Implementation notes: amd64, dali, crypto_stream/simon6496ctr

Computer: dali
Microarchitecture: amd64; Zen (820f01)
Architecture: amd64
CPU ID: AuthenticAMD-00820f01-178bfbff
SUPERCOP version: 20240425
Operation: crypto_stream
Primitive: simon6496ctr
TimeObject sizeTest sizeImplementationCompilerBenchmark dateSUPERCOP version
469578457 0 093016 780 1016T:sse4gcc_-march=native_-mtune=native_-O3_-fomit-frame-pointer_-fwrapv_-fPIC_-fPIE2024042720240425
524976357 0 090928 812 984T:sse4clang_-march=native_-O2_-fomit-frame-pointer_-fwrapv_-Qunused-arguments_-fPIC_-fPIE2024042720240425
525576741 0 091440 812 984T:sse4clang_-march=native_-O3_-fomit-frame-pointer_-fwrapv_-Qunused-arguments_-fPIC_-fPIE2024042720240425
530987862 0 0102456 780 1016T:avx2gcc_-march=native_-mtune=native_-O3_-fomit-frame-pointer_-fwrapv_-fPIC_-fPIE2024042720240425
581888252 0 0102760 812 984T:avx2clang_-march=native_-O2_-fomit-frame-pointer_-fwrapv_-Qunused-arguments_-fPIC_-fPIE2024042720240425
582688716 0 0103336 812 984T:avx2clang_-march=native_-O3_-fomit-frame-pointer_-fwrapv_-Qunused-arguments_-fPIC_-fPIE2024042720240425
710680027 0 092310 804 952T:sse4clang_-march=native_-Os_-fomit-frame-pointer_-fwrapv_-Qunused-arguments_-fPIC_-fPIE2024042720240425
725978231 0 091720 780 1016T:sse4gcc_-march=native_-mtune=native_-O2_-fomit-frame-pointer_-fwrapv_-fPIC_-fPIE2024042720240425
754687299 0 099454 804 952T:avx2clang_-march=native_-Os_-fomit-frame-pointer_-fwrapv_-Qunused-arguments_-fPIC_-fPIE2024042720240425
769181835 0 093659 756 984T:sse4gcc_-march=native_-mtune=native_-Os_-fomit-frame-pointer_-fwrapv_-fPIC_-fPIE2024042720240425
784880645 0 093623 772 1016T:sse4gcc_-march=native_-mtune=native_-O_-fomit-frame-pointer_-fwrapv_-fPIC_-fPIE2024042720240425
802684518 0 098048 780 1016T:avx2gcc_-march=native_-mtune=native_-O2_-fomit-frame-pointer_-fwrapv_-fPIC_-fPIE2024042720240425
809285405 0 097870 804 952T:sse4clang_-march=native_-O_-fomit-frame-pointer_-fwrapv_-Qunused-arguments_-fPIC_-fPIE2024042720240425
829483920 0 095787 756 984T:avx2gcc_-march=native_-mtune=native_-Os_-fomit-frame-pointer_-fwrapv_-fPIC_-fPIE2024042720240425

Compiler output

Implementation: T:avx2
Security model: timingleaks
Compiler: clang -march=native -O -fomit-frame-pointer -fwrapv -Qunused-arguments -fPIC -fPIE
try.c: /usr/bin/ld: libcrypto_stream_simon6496ctr.a(stream.o): in function `ExpandKeyBS':
try.c: stream.c:(.text+0x...): undefined reference to `Transpose'
try.c: /usr/bin/ld: libcrypto_stream_simon6496ctr.a(stream.o): in function `Encrypt':
try.c: stream.c:(.text+0x...): undefined reference to `Transpose'
try.c: /usr/bin/ld: stream.c:(.text+0x...): undefined reference to `Transpose'
try.c: /usr/bin/ld: stream.c:(.text+0x...): undefined reference to `Transpose'
try.c: /usr/bin/ld: stream.c:(.text+0x...): undefined reference to `Transpose'
try.c: /usr/bin/ld: libcrypto_stream_simon6496ctr.a(stream.o):stream.c:(.text+0x...): more undefined references to `Transpose' follow
try.c: clang: error: linker command failed with exit code 1 (use -v to see invocation)

Number of similar (compiler,implementation) pairs: 1, namely:
CompilerImplementations
clang -march=native -O -fomit-frame-pointer -fwrapv -Qunused-arguments -fPIC -fPIE T:avx2

Compiler output

Implementation: T:avx2
Security model: timingleaks
Compiler: clang -mcpu=native -O3 -fomit-frame-pointer -fwrapv -Qunused-arguments -fPIC -fPIE
stream.c: stream.c:148:3: error: always_inline function '_mm256_set_epi32' requires target feature 'avx', but would be inlined into function 'Encrypt' that is compiled without support for 'avx'
stream.c: SET1(X[0],nonce[1]); SET8(Y[0],nonce[0]);
stream.c: ^
stream.c: ./Intrinsics_AVX2_64block.h:25:22: note: expanded from macro 'SET1'
stream.c: #define SET1(X,c) (X=SET(c,c,c,c,c,c,c,c))
stream.c: ^
stream.c: ./Intrinsics_AVX2_64block.h:24:13: note: expanded from macro 'SET'
stream.c: #define SET _mm256_set_epi32
stream.c: ^
stream.c: stream.c:148:3: error: AVX vector return of type '__m256i' (vector of 4 'long long' values) without 'avx' enabled changes the ABI
stream.c: ./Intrinsics_AVX2_64block.h:25:22: note: expanded from macro 'SET1'
stream.c: #define SET1(X,c) (X=SET(c,c,c,c,c,c,c,c))
stream.c: ^
stream.c: ./Intrinsics_AVX2_64block.h:24:13: note: expanded from macro 'SET'
stream.c: #define SET _mm256_set_epi32
stream.c: ^
stream.c: stream.c:148:24: error: always_inline function '_mm256_set_epi32' requires target feature 'avx', but would be inlined into function 'Encrypt' that is compiled without support for 'avx'
stream.c: SET1(X[0],nonce[1]); SET8(Y[0],nonce[0]);
stream.c: ^
stream.c: ./Intrinsics_AVX2_64block.h:26:22: note: expanded from macro 'SET8'
stream.c: #define SET8(X,c) (X=SET(c,c,c,c,c,c,c,c), X=ADD(X,_q))
stream.c: ^
stream.c: ./Intrinsics_AVX2_64block.h:24:13: note: expanded from macro 'SET'
stream.c: #define SET _mm256_set_epi32
stream.c: ^
stream.c: ...

Number of similar (compiler,implementation) pairs: 1, namely:
CompilerImplementations
clang -mcpu=native -O3 -fomit-frame-pointer -fwrapv -Qunused-arguments -fPIC -fPIE T:avx2

Compiler output

Implementation: T:avx2
Security model: timingleaks
Compiler: gcc -march=native -mtune=native -O -fomit-frame-pointer -fwrapv -fPIC -fPIE
try.c: /usr/bin/ld: libcrypto_stream_simon6496ctr.a(stream.o): in function `Encrypt':
try.c: stream.c:(.text+0x...): undefined reference to `Transpose'
try.c: /usr/bin/ld: stream.c:(.text+0x...): undefined reference to `Transpose'
try.c: /usr/bin/ld: stream.c:(.text+0x...): undefined reference to `Transpose'
try.c: /usr/bin/ld: stream.c:(.text+0x...): undefined reference to `Transpose'
try.c: /usr/bin/ld: libcrypto_stream_simon6496ctr.a(stream.o): in function `Encrypt_Xor':
try.c: stream.c:(.text+0x...): undefined reference to `Transpose'
try.c: /usr/bin/ld: libcrypto_stream_simon6496ctr.a(stream.o):stream.c:(.text+0x...): more undefined references to `Transpose' follow
try.c: collect2: error: ld returned 1 exit status

Number of similar (compiler,implementation) pairs: 1, namely:
CompilerImplementations
gcc -march=native -mtune=native -O -fomit-frame-pointer -fwrapv -fPIC -fPIE T:avx2

Compiler output

Implementation: T:sse4
Security model: timingleaks
Compiler: clang -mcpu=native -O3 -fomit-frame-pointer -fwrapv -Qunused-arguments -fPIC -fPIE
stream.c: stream.c:341:3: error: always_inline function '_mm_shuffle_epi8' requires target feature 'ssse3', but would be inlined into function 'ExpandKeyBS' that is compiled without support for 'ssse3'
stream.c: EKBS(rk);
stream.c: ^
stream.c: ./Simon6496SSE4.h:59:19: note: expanded from macro 'EKBS'
stream.c: #define EKBS(rk) (RKBS(rk,3,_D), RKBS(rk,4,_C), RKBS(rk,5,_D), RKBS(rk,6,_C), RKBS(rk,7,_D), RKBS(rk,8,_D), \
stream.c: ^
stream.c: ./Simon6496SSE4.h:50:52: note: expanded from macro 'RKBS'
stream.c: #define RKBS(rk,r,_V) (rk[r][7]= _D ^ rk[r-3][7] ^ ROR8(rk[r-1][2] ^ rk[r-1][3]), \
stream.c: ^
stream.c: ./Intrinsics_SSE4_64block.h:40:19: note: expanded from macro 'ROR8'
stream.c: #define ROR8(X) (SHFL(X,R8))
stream.c: ^
stream.c: ./Intrinsics_SSE4_64block.h:35:14: note: expanded from macro 'SHFL'
stream.c: #define SHFL _mm_shuffle_epi8
stream.c: ^
stream.c: stream.c:341:3: error: always_inline function '_mm_shuffle_epi8' requires target feature 'ssse3', but would be inlined into function 'ExpandKeyBS' that is compiled without support for 'ssse3'
stream.c: ./Simon6496SSE4.h:59:19: note: expanded from macro 'EKBS'
stream.c: #define EKBS(rk) (RKBS(rk,3,_D), RKBS(rk,4,_C), RKBS(rk,5,_D), RKBS(rk,6,_C), RKBS(rk,7,_D), RKBS(rk,8,_D), \
stream.c: ^
stream.c: ./Simon6496SSE4.h:51:52: note: expanded from macro 'RKBS'
stream.c: rk[r][6]= _D ^ rk[r-3][6] ^ ROR8(rk[r-1][1] ^ rk[r-1][2]), \
stream.c: ^
stream.c: ./Intrinsics_SSE4_64block.h:40:19: note: expanded from macro 'ROR8'
stream.c: #define ROR8(X) (SHFL(X,R8))
stream.c: ^
stream.c: ...

Number of similar (compiler,implementation) pairs: 1, namely:
CompilerImplementations
clang -mcpu=native -O3 -fomit-frame-pointer -fwrapv -Qunused-arguments -fPIC -fPIE T:sse4