Implementation notes: amd64, cubi10, crypto_aead/omdsha256k256n104tau160v2

Computer: cubi10
Microarchitecture: amd64; Comet Lake (806ec)
Architecture: amd64
CPU ID: GenuineIntel-000806ec-bfebfbff
SUPERCOP version: 20240625
Operation: crypto_aead
Primitive: omdsha256k256n104tau160v2
TimeObject sizeTest sizeImplementationCompilerBenchmark dateSUPERCOP version
16052715519 0 038456 780 1080T:refgcc_-march=native_-mtune=native_-O3_-fwrapv_-fPIC_-fPIE_-gdwarf-4_-Wall2024062720240625
1918108081 0 031144 812 1048T:refclang_-march=native_-O2_-fwrapv_-Qunused-arguments_-fPIC_-fPIE_-gdwarf-4_-Wall2024062720240625
1937278178 0 031336 812 1048T:refclang_-march=native_-O3_-fwrapv_-Qunused-arguments_-fPIC_-fPIE_-gdwarf-4_-Wall2024062720240625
2015076434 0 027440 780 1080T:refgcc_-march=native_-mtune=native_-O2_-fwrapv_-fPIC_-fPIE_-gdwarf-4_-Wall2024062720240625
2016295567 0 026023 772 1080T:refgcc_-march=native_-mtune=native_-O_-fwrapv_-fPIC_-fPIE_-gdwarf-4_-Wall2024062720240625
2084684666 0 024318 804 1016T:refclang_-march=native_-Os_-fwrapv_-Qunused-arguments_-fPIC_-fPIE_-gdwarf-4_-Wall2024062720240625
2098638806 0 031208 812 1016T:refclang_-mcpu=native_-O3_-fwrapv_-Qunused-arguments_-fPIC_-fPIE_-gdwarf-4_-Wall2024062720240625
2123064447 0 024262 804 1016T:refclang_-march=native_-O_-fwrapv_-Qunused-arguments_-fPIC_-fPIE_-gdwarf-4_-Wall2024062720240625
2149714129 0 022995 756 1048T:refgcc_-march=native_-mtune=native_-Os_-fwrapv_-fPIC_-fPIE_-gdwarf-4_-Wall2024062720240625

Compiler output


try.c: /usr/bin/ld: libcrypto_aead_omdsha256k256n104tau160v2.a(omdsha256.o):.../supercop-data/cubi10/amd64/try/c/clang_-march=native_-O2_-fwrapv_-Qunused-arguments_-fPIC_-fPIE_-gdwarf-4_-Wall/timingleaks/crypto_aead/omdsha256k256n104tau160v2/avx1/work/./omdsha256.h:41: multiple definition of `Hash'; libcrypto_aead_omdsha256k256n104tau160v2.a(encrypt.o):.../supercop-data/cubi10/amd64/try/c/clang_-march=native_-O2_-fwrapv_-Qunused-arguments_-fPIC_-fPIE_-gdwarf-4_-Wall/timingleaks/crypto_aead/omdsha256k256n104tau160v2/avx1/work/./omdsha256.h:41: first defined here
try.c: clang: error: linker command failed with exit code 1 (use -v to see invocation)

Number of similar (implementation,compiler) pairs: 1, namely:
ImplementationCompiler
T:avx1clang -march=native -O2 -fwrapv -Qunused-arguments -fPIC -fPIE -gdwarf-4 -Wall (Debian_Clang_11.0.1)

Compiler output


try.c: /usr/bin/ld: libcrypto_aead_omdsha256k256n104tau160v2.a(omdsha256.o):.../supercop-data/cubi10/amd64/try/c/clang_-march=native_-O3_-fwrapv_-Qunused-arguments_-fPIC_-fPIE_-gdwarf-4_-Wall/timingleaks/crypto_aead/omdsha256k256n104tau160v2/avx1/work/./omdsha256.h:41: multiple definition of `Hash'; libcrypto_aead_omdsha256k256n104tau160v2.a(encrypt.o):.../supercop-data/cubi10/amd64/try/c/clang_-march=native_-O3_-fwrapv_-Qunused-arguments_-fPIC_-fPIE_-gdwarf-4_-Wall/timingleaks/crypto_aead/omdsha256k256n104tau160v2/avx1/work/./omdsha256.h:41: first defined here
try.c: clang: error: linker command failed with exit code 1 (use -v to see invocation)

Number of similar (implementation,compiler) pairs: 1, namely:
ImplementationCompiler
T:avx1clang -march=native -O3 -fwrapv -Qunused-arguments -fPIC -fPIE -gdwarf-4 -Wall (Debian_Clang_11.0.1)

Compiler output


try.c: /usr/bin/ld: libcrypto_aead_omdsha256k256n104tau160v2.a(omdsha256.o):.../supercop-data/cubi10/amd64/try/c/clang_-march=native_-O_-fwrapv_-Qunused-arguments_-fPIC_-fPIE_-gdwarf-4_-Wall/timingleaks/crypto_aead/omdsha256k256n104tau160v2/avx1/work/./omdsha256.h:41: multiple definition of `Hash'; libcrypto_aead_omdsha256k256n104tau160v2.a(encrypt.o):.../supercop-data/cubi10/amd64/try/c/clang_-march=native_-O_-fwrapv_-Qunused-arguments_-fPIC_-fPIE_-gdwarf-4_-Wall/timingleaks/crypto_aead/omdsha256k256n104tau160v2/avx1/work/./omdsha256.h:41: first defined here
try.c: clang: error: linker command failed with exit code 1 (use -v to see invocation)

Number of similar (implementation,compiler) pairs: 1, namely:
ImplementationCompiler
T:avx1clang -march=native -O -fwrapv -Qunused-arguments -fPIC -fPIE -gdwarf-4 -Wall (Debian_Clang_11.0.1)

Compiler output


try.c: /usr/bin/ld: libcrypto_aead_omdsha256k256n104tau160v2.a(omdsha256.o):.../supercop-data/cubi10/amd64/try/c/clang_-march=native_-Os_-fwrapv_-Qunused-arguments_-fPIC_-fPIE_-gdwarf-4_-Wall/timingleaks/crypto_aead/omdsha256k256n104tau160v2/avx1/work/./omdsha256.h:41: multiple definition of `Hash'; libcrypto_aead_omdsha256k256n104tau160v2.a(encrypt.o):.../supercop-data/cubi10/amd64/try/c/clang_-march=native_-Os_-fwrapv_-Qunused-arguments_-fPIC_-fPIE_-gdwarf-4_-Wall/timingleaks/crypto_aead/omdsha256k256n104tau160v2/avx1/work/./omdsha256.h:41: first defined here
try.c: clang: error: linker command failed with exit code 1 (use -v to see invocation)

Number of similar (implementation,compiler) pairs: 1, namely:
ImplementationCompiler
T:avx1clang -march=native -Os -fwrapv -Qunused-arguments -fPIC -fPIE -gdwarf-4 -Wall (Debian_Clang_11.0.1)

Compiler output


try.c: /usr/bin/ld: libcrypto_aead_omdsha256k256n104tau160v2.a(omdsha256.o):.../supercop-data/cubi10/amd64/try/c/clang_-mcpu=native_-O3_-fwrapv_-Qunused-arguments_-fPIC_-fPIE_-gdwarf-4_-Wall/timingleaks/crypto_aead/omdsha256k256n104tau160v2/avx1/work/./omdsha256.h:41: multiple definition of `Hash'; libcrypto_aead_omdsha256k256n104tau160v2.a(encrypt.o):.../supercop-data/cubi10/amd64/try/c/clang_-mcpu=native_-O3_-fwrapv_-Qunused-arguments_-fPIC_-fPIE_-gdwarf-4_-Wall/timingleaks/crypto_aead/omdsha256k256n104tau160v2/avx1/work/./omdsha256.h:41: first defined here
try.c: clang: error: linker command failed with exit code 1 (use -v to see invocation)

Number of similar (implementation,compiler) pairs: 1, namely:
ImplementationCompiler
T:avx1clang -mcpu=native -O3 -fwrapv -Qunused-arguments -fPIC -fPIE -gdwarf-4 -Wall (Debian_Clang_11.0.1)

Compiler output


try.c: /usr/bin/ld: libcrypto_aead_omdsha256k256n104tau160v2.a(omdsha256.o):.../supercop-data/cubi10/amd64/try/c/gcc_-march=native_-mtune=native_-O2_-fwrapv_-fPIC_-fPIE_-gdwarf-4_-Wall/timingleaks/crypto_aead/omdsha256k256n104tau160v2/avx1/work/omdsha256.h:41: multiple definition of `Hash'; libcrypto_aead_omdsha256k256n104tau160v2.a(encrypt.o):.../supercop-data/cubi10/amd64/try/c/gcc_-march=native_-mtune=native_-O2_-fwrapv_-fPIC_-fPIE_-gdwarf-4_-Wall/timingleaks/crypto_aead/omdsha256k256n104tau160v2/avx1/work/omdsha256.h:41: first defined here
try.c: collect2: error: ld returned 1 exit status

Number of similar (implementation,compiler) pairs: 1, namely:
ImplementationCompiler
T:avx1gcc -march=native -mtune=native -O2 -fwrapv -fPIC -fPIE -gdwarf-4 -Wall (10.2.1_20210110)

Compiler output


try.c: /usr/bin/ld: libcrypto_aead_omdsha256k256n104tau160v2.a(omdsha256.o):.../supercop-data/cubi10/amd64/try/c/gcc_-march=native_-mtune=native_-O3_-fwrapv_-fPIC_-fPIE_-gdwarf-4_-Wall/timingleaks/crypto_aead/omdsha256k256n104tau160v2/avx1/work/omdsha256.h:41: multiple definition of `Hash'; libcrypto_aead_omdsha256k256n104tau160v2.a(encrypt.o):.../supercop-data/cubi10/amd64/try/c/gcc_-march=native_-mtune=native_-O3_-fwrapv_-fPIC_-fPIE_-gdwarf-4_-Wall/timingleaks/crypto_aead/omdsha256k256n104tau160v2/avx1/work/omdsha256.h:41: first defined here
try.c: collect2: error: ld returned 1 exit status

Number of similar (implementation,compiler) pairs: 1, namely:
ImplementationCompiler
T:avx1gcc -march=native -mtune=native -O3 -fwrapv -fPIC -fPIE -gdwarf-4 -Wall (10.2.1_20210110)

Compiler output


try.c: /usr/bin/ld: libcrypto_aead_omdsha256k256n104tau160v2.a(omdsha256.o):.../supercop-data/cubi10/amd64/try/c/gcc_-march=native_-mtune=native_-O_-fwrapv_-fPIC_-fPIE_-gdwarf-4_-Wall/timingleaks/crypto_aead/omdsha256k256n104tau160v2/avx1/work/omdsha256.h:41: multiple definition of `Hash'; libcrypto_aead_omdsha256k256n104tau160v2.a(encrypt.o):.../supercop-data/cubi10/amd64/try/c/gcc_-march=native_-mtune=native_-O_-fwrapv_-fPIC_-fPIE_-gdwarf-4_-Wall/timingleaks/crypto_aead/omdsha256k256n104tau160v2/avx1/work/omdsha256.h:41: first defined here
try.c: collect2: error: ld returned 1 exit status

Number of similar (implementation,compiler) pairs: 1, namely:
ImplementationCompiler
T:avx1gcc -march=native -mtune=native -O -fwrapv -fPIC -fPIE -gdwarf-4 -Wall (10.2.1_20210110)

Compiler output


try.c: /usr/bin/ld: libcrypto_aead_omdsha256k256n104tau160v2.a(omdsha256.o):.../supercop-data/cubi10/amd64/try/c/gcc_-march=native_-mtune=native_-Os_-fwrapv_-fPIC_-fPIE_-gdwarf-4_-Wall/timingleaks/crypto_aead/omdsha256k256n104tau160v2/avx1/work/omdsha256.h:41: multiple definition of `Hash'; libcrypto_aead_omdsha256k256n104tau160v2.a(encrypt.o):.../supercop-data/cubi10/amd64/try/c/gcc_-march=native_-mtune=native_-Os_-fwrapv_-fPIC_-fPIE_-gdwarf-4_-Wall/timingleaks/crypto_aead/omdsha256k256n104tau160v2/avx1/work/omdsha256.h:41: first defined here
try.c: collect2: error: ld returned 1 exit status

Number of similar (implementation,compiler) pairs: 1, namely:
ImplementationCompiler
T:avx1gcc -march=native -mtune=native -Os -fwrapv -fPIC -fPIE -gdwarf-4 -Wall (10.2.1_20210110)

Compiler output


try.c: /usr/bin/ld: libcrypto_aead_omdsha256k256n104tau160v2.a(omdsha256.o):.../supercop-data/cubi10/amd64/try/c/clang_-march=native_-O2_-fwrapv_-Qunused-arguments_-fPIC_-fPIE_-gdwarf-4_-Wall/timingleaks/crypto_aead/omdsha256k256n104tau160v2/sse4/work/./omdsha256.h:41: multiple definition of `Hash'; libcrypto_aead_omdsha256k256n104tau160v2.a(encrypt.o):.../supercop-data/cubi10/amd64/try/c/clang_-march=native_-O2_-fwrapv_-Qunused-arguments_-fPIC_-fPIE_-gdwarf-4_-Wall/timingleaks/crypto_aead/omdsha256k256n104tau160v2/sse4/work/./omdsha256.h:41: first defined here
try.c: clang: error: linker command failed with exit code 1 (use -v to see invocation)

Number of similar (implementation,compiler) pairs: 1, namely:
ImplementationCompiler
T:sse4clang -march=native -O2 -fwrapv -Qunused-arguments -fPIC -fPIE -gdwarf-4 -Wall (Debian_Clang_11.0.1)

Compiler output


try.c: /usr/bin/ld: libcrypto_aead_omdsha256k256n104tau160v2.a(omdsha256.o):.../supercop-data/cubi10/amd64/try/c/clang_-march=native_-O3_-fwrapv_-Qunused-arguments_-fPIC_-fPIE_-gdwarf-4_-Wall/timingleaks/crypto_aead/omdsha256k256n104tau160v2/sse4/work/./omdsha256.h:41: multiple definition of `Hash'; libcrypto_aead_omdsha256k256n104tau160v2.a(encrypt.o):.../supercop-data/cubi10/amd64/try/c/clang_-march=native_-O3_-fwrapv_-Qunused-arguments_-fPIC_-fPIE_-gdwarf-4_-Wall/timingleaks/crypto_aead/omdsha256k256n104tau160v2/sse4/work/./omdsha256.h:41: first defined here
try.c: clang: error: linker command failed with exit code 1 (use -v to see invocation)

Number of similar (implementation,compiler) pairs: 1, namely:
ImplementationCompiler
T:sse4clang -march=native -O3 -fwrapv -Qunused-arguments -fPIC -fPIE -gdwarf-4 -Wall (Debian_Clang_11.0.1)

Compiler output


try.c: /usr/bin/ld: libcrypto_aead_omdsha256k256n104tau160v2.a(omdsha256.o):.../supercop-data/cubi10/amd64/try/c/clang_-march=native_-O_-fwrapv_-Qunused-arguments_-fPIC_-fPIE_-gdwarf-4_-Wall/timingleaks/crypto_aead/omdsha256k256n104tau160v2/sse4/work/./omdsha256.h:41: multiple definition of `Hash'; libcrypto_aead_omdsha256k256n104tau160v2.a(encrypt.o):.../supercop-data/cubi10/amd64/try/c/clang_-march=native_-O_-fwrapv_-Qunused-arguments_-fPIC_-fPIE_-gdwarf-4_-Wall/timingleaks/crypto_aead/omdsha256k256n104tau160v2/sse4/work/./omdsha256.h:41: first defined here
try.c: clang: error: linker command failed with exit code 1 (use -v to see invocation)

Number of similar (implementation,compiler) pairs: 1, namely:
ImplementationCompiler
T:sse4clang -march=native -O -fwrapv -Qunused-arguments -fPIC -fPIE -gdwarf-4 -Wall (Debian_Clang_11.0.1)

Compiler output


try.c: /usr/bin/ld: libcrypto_aead_omdsha256k256n104tau160v2.a(omdsha256.o):.../supercop-data/cubi10/amd64/try/c/clang_-march=native_-Os_-fwrapv_-Qunused-arguments_-fPIC_-fPIE_-gdwarf-4_-Wall/timingleaks/crypto_aead/omdsha256k256n104tau160v2/sse4/work/./omdsha256.h:41: multiple definition of `Hash'; libcrypto_aead_omdsha256k256n104tau160v2.a(encrypt.o):.../supercop-data/cubi10/amd64/try/c/clang_-march=native_-Os_-fwrapv_-Qunused-arguments_-fPIC_-fPIE_-gdwarf-4_-Wall/timingleaks/crypto_aead/omdsha256k256n104tau160v2/sse4/work/./omdsha256.h:41: first defined here
try.c: clang: error: linker command failed with exit code 1 (use -v to see invocation)

Number of similar (implementation,compiler) pairs: 1, namely:
ImplementationCompiler
T:sse4clang -march=native -Os -fwrapv -Qunused-arguments -fPIC -fPIE -gdwarf-4 -Wall (Debian_Clang_11.0.1)

Compiler output


try.c: /usr/bin/ld: libcrypto_aead_omdsha256k256n104tau160v2.a(omdsha256.o):.../supercop-data/cubi10/amd64/try/c/clang_-mcpu=native_-O3_-fwrapv_-Qunused-arguments_-fPIC_-fPIE_-gdwarf-4_-Wall/timingleaks/crypto_aead/omdsha256k256n104tau160v2/sse4/work/./omdsha256.h:41: multiple definition of `Hash'; libcrypto_aead_omdsha256k256n104tau160v2.a(encrypt.o):.../supercop-data/cubi10/amd64/try/c/clang_-mcpu=native_-O3_-fwrapv_-Qunused-arguments_-fPIC_-fPIE_-gdwarf-4_-Wall/timingleaks/crypto_aead/omdsha256k256n104tau160v2/sse4/work/./omdsha256.h:41: first defined here
try.c: clang: error: linker command failed with exit code 1 (use -v to see invocation)

Number of similar (implementation,compiler) pairs: 1, namely:
ImplementationCompiler
T:sse4clang -mcpu=native -O3 -fwrapv -Qunused-arguments -fPIC -fPIE -gdwarf-4 -Wall (Debian_Clang_11.0.1)

Compiler output


try.c: /usr/bin/ld: libcrypto_aead_omdsha256k256n104tau160v2.a(omdsha256.o):.../supercop-data/cubi10/amd64/try/c/gcc_-march=native_-mtune=native_-O2_-fwrapv_-fPIC_-fPIE_-gdwarf-4_-Wall/timingleaks/crypto_aead/omdsha256k256n104tau160v2/sse4/work/omdsha256.h:41: multiple definition of `Hash'; libcrypto_aead_omdsha256k256n104tau160v2.a(encrypt.o):.../supercop-data/cubi10/amd64/try/c/gcc_-march=native_-mtune=native_-O2_-fwrapv_-fPIC_-fPIE_-gdwarf-4_-Wall/timingleaks/crypto_aead/omdsha256k256n104tau160v2/sse4/work/omdsha256.h:41: first defined here
try.c: collect2: error: ld returned 1 exit status

Number of similar (implementation,compiler) pairs: 1, namely:
ImplementationCompiler
T:sse4gcc -march=native -mtune=native -O2 -fwrapv -fPIC -fPIE -gdwarf-4 -Wall (10.2.1_20210110)

Compiler output


try.c: /usr/bin/ld: libcrypto_aead_omdsha256k256n104tau160v2.a(omdsha256.o):.../supercop-data/cubi10/amd64/try/c/gcc_-march=native_-mtune=native_-O3_-fwrapv_-fPIC_-fPIE_-gdwarf-4_-Wall/timingleaks/crypto_aead/omdsha256k256n104tau160v2/sse4/work/omdsha256.h:41: multiple definition of `Hash'; libcrypto_aead_omdsha256k256n104tau160v2.a(encrypt.o):.../supercop-data/cubi10/amd64/try/c/gcc_-march=native_-mtune=native_-O3_-fwrapv_-fPIC_-fPIE_-gdwarf-4_-Wall/timingleaks/crypto_aead/omdsha256k256n104tau160v2/sse4/work/omdsha256.h:41: first defined here
try.c: collect2: error: ld returned 1 exit status

Number of similar (implementation,compiler) pairs: 1, namely:
ImplementationCompiler
T:sse4gcc -march=native -mtune=native -O3 -fwrapv -fPIC -fPIE -gdwarf-4 -Wall (10.2.1_20210110)

Compiler output


try.c: /usr/bin/ld: libcrypto_aead_omdsha256k256n104tau160v2.a(omdsha256.o):.../supercop-data/cubi10/amd64/try/c/gcc_-march=native_-mtune=native_-O_-fwrapv_-fPIC_-fPIE_-gdwarf-4_-Wall/timingleaks/crypto_aead/omdsha256k256n104tau160v2/sse4/work/omdsha256.h:41: multiple definition of `Hash'; libcrypto_aead_omdsha256k256n104tau160v2.a(encrypt.o):.../supercop-data/cubi10/amd64/try/c/gcc_-march=native_-mtune=native_-O_-fwrapv_-fPIC_-fPIE_-gdwarf-4_-Wall/timingleaks/crypto_aead/omdsha256k256n104tau160v2/sse4/work/omdsha256.h:41: first defined here
try.c: collect2: error: ld returned 1 exit status

Number of similar (implementation,compiler) pairs: 1, namely:
ImplementationCompiler
T:sse4gcc -march=native -mtune=native -O -fwrapv -fPIC -fPIE -gdwarf-4 -Wall (10.2.1_20210110)

Compiler output


try.c: /usr/bin/ld: libcrypto_aead_omdsha256k256n104tau160v2.a(omdsha256.o):.../supercop-data/cubi10/amd64/try/c/gcc_-march=native_-mtune=native_-Os_-fwrapv_-fPIC_-fPIE_-gdwarf-4_-Wall/timingleaks/crypto_aead/omdsha256k256n104tau160v2/sse4/work/omdsha256.h:41: multiple definition of `Hash'; libcrypto_aead_omdsha256k256n104tau160v2.a(encrypt.o):.../supercop-data/cubi10/amd64/try/c/gcc_-march=native_-mtune=native_-Os_-fwrapv_-fPIC_-fPIE_-gdwarf-4_-Wall/timingleaks/crypto_aead/omdsha256k256n104tau160v2/sse4/work/omdsha256.h:41: first defined here
try.c: collect2: error: ld returned 1 exit status

Number of similar (implementation,compiler) pairs: 1, namely:
ImplementationCompiler
T:sse4gcc -march=native -mtune=native -Os -fwrapv -fPIC -fPIE -gdwarf-4 -Wall (10.2.1_20210110)