Implementation notes: amd64, comet, crypto_stream/simon64128ctr

Computer: comet
Microarchitecture: amd64; Comet Lake (806ec)
Architecture: amd64
CPU ID: GenuineIntel-000806ec-bfebfbff
SUPERCOP version: 20240425
Operation: crypto_stream
Primitive: simon64128ctr
TimeObject sizeTest sizeImplementationCompilerBenchmark dateSUPERCOP version
383999991 0 0115156 780 1024T:avx2gcc_-march=native_-mtune=native_-O3_-fomit-frame-pointer_-fwrapv_-fPIC_-fPIE2024042720240425
516195706 0 0107247 756 992T:avx2gcc_-march=native_-mtune=native_-Os_-fomit-frame-pointer_-fwrapv_-fPIC_-fPIE2024042720240425
536195826 0 0109060 780 1024T:avx2gcc_-march=native_-mtune=native_-O2_-fomit-frame-pointer_-fwrapv_-fPIC_-fPIE2024042720240425
558183164 0 099489 852 992T:sse4clang_-march=native_-O2_-fomit-frame-pointer_-fwrapv_-Qunused-arguments_-fPIC_-fPIE2024042720240425
563683980 0 0100601 852 1024T:sse4clang_-march=native_-O3_-fomit-frame-pointer_-fwrapv_-Qunused-arguments_-fPIC_-fPIE2024042720240425
590493863 0 0108996 780 1024T:sse4gcc_-march=native_-mtune=native_-O3_-fomit-frame-pointer_-fwrapv_-fPIC_-fPIE2024042720240425
821092081 0 0103575 756 992T:sse4gcc_-march=native_-mtune=native_-Os_-fomit-frame-pointer_-fwrapv_-fPIC_-fPIE2024042720240425
849893641 0 0106331 772 1024T:sse4gcc_-march=native_-mtune=native_-O_-fomit-frame-pointer_-fwrapv_-fPIC_-fPIE2024042720240425
885592781 0 0105988 780 1024T:sse4gcc_-march=native_-mtune=native_-O2_-fomit-frame-pointer_-fwrapv_-fPIC_-fPIE2024042720240425
885983338 0 096807 844 1024T:sse4clang_-march=native_-Os_-fomit-frame-pointer_-fwrapv_-Qunused-arguments_-fPIC_-fPIE2024042720240425
969887724 0 0100265 852 960T:sse4clang_-march=native_-O_-fomit-frame-pointer_-fwrapv_-Qunused-arguments_-fPIC_-fPIE2024042720240425

Compiler output

Implementation: T:avx2
Security model: timingleaks
Compiler: clang -march=native -O2 -fomit-frame-pointer -fwrapv -Qunused-arguments -fPIC -fPIE
try.c: /usr/bin/ld: libcrypto_stream_simon64128ctr.a(stream.o): in function `Encrypt':
try.c: stream.c:(.text+0x...): undefined reference to `Transpose'
try.c: /usr/bin/ld: stream.c:(.text+0x...): undefined reference to `Transpose'
try.c: /usr/bin/ld: stream.c:(.text+0x...): undefined reference to `Transpose'
try.c: /usr/bin/ld: stream.c:(.text+0x...): undefined reference to `Transpose'
try.c: /usr/bin/ld: libcrypto_stream_simon64128ctr.a(stream.o): in function `Encrypt_Xor':
try.c: stream.c:(.text+0x...): undefined reference to `Transpose'
try.c: /usr/bin/ld: libcrypto_stream_simon64128ctr.a(stream.o):stream.c:(.text+0x...): more undefined references to `Transpose' follow
try.c: clang: error: linker command failed with exit code 1 (use -v to see invocation)

Number of similar (compiler,implementation) pairs: 4, namely:
CompilerImplementations
clang -march=native -O2 -fomit-frame-pointer -fwrapv -Qunused-arguments -fPIC -fPIE T:avx2
clang -march=native -O3 -fomit-frame-pointer -fwrapv -Qunused-arguments -fPIC -fPIE T:avx2
clang -march=native -O -fomit-frame-pointer -fwrapv -Qunused-arguments -fPIC -fPIE T:avx2
clang -march=native -Os -fomit-frame-pointer -fwrapv -Qunused-arguments -fPIC -fPIE T:avx2

Compiler output

Implementation: T:avx2
Security model: timingleaks
Compiler: clang -mcpu=native -O3 -fomit-frame-pointer -fwrapv -Qunused-arguments -fPIC -fPIE
stream.c: stream.c:147:3: error: always_inline function '_mm256_set_epi32' requires target feature 'avx', but would be inlined into function 'Encrypt' that is compiled without support for 'avx'
stream.c: SET1(X[0],nonce[1]); SET8(Y[0],nonce[0]);
stream.c: ^
stream.c: ./Intrinsics_AVX2_64block.h:24:22: note: expanded from macro 'SET1'
stream.c: #define SET1(X,c) (X=SET(c,c,c,c,c,c,c,c))
stream.c: ^
stream.c: ./Intrinsics_AVX2_64block.h:23:13: note: expanded from macro 'SET'
stream.c: #define SET _mm256_set_epi32
stream.c: ^
stream.c: stream.c:147:3: error: AVX vector return of type '__m256i' (vector of 4 'long long' values) without 'avx' enabled changes the ABI
stream.c: ./Intrinsics_AVX2_64block.h:24:22: note: expanded from macro 'SET1'
stream.c: #define SET1(X,c) (X=SET(c,c,c,c,c,c,c,c))
stream.c: ^
stream.c: ./Intrinsics_AVX2_64block.h:23:13: note: expanded from macro 'SET'
stream.c: #define SET _mm256_set_epi32
stream.c: ^
stream.c: stream.c:147:24: error: always_inline function '_mm256_set_epi32' requires target feature 'avx', but would be inlined into function 'Encrypt' that is compiled without support for 'avx'
stream.c: SET1(X[0],nonce[1]); SET8(Y[0],nonce[0]);
stream.c: ^
stream.c: ./Intrinsics_AVX2_64block.h:25:22: note: expanded from macro 'SET8'
stream.c: #define SET8(X,c) (X=SET(c,c,c,c,c,c,c,c), X=ADD(X,_q))
stream.c: ^
stream.c: ./Intrinsics_AVX2_64block.h:23:13: note: expanded from macro 'SET'
stream.c: #define SET _mm256_set_epi32
stream.c: ^
stream.c: ...

Number of similar (compiler,implementation) pairs: 1, namely:
CompilerImplementations
clang -mcpu=native -O3 -fomit-frame-pointer -fwrapv -Qunused-arguments -fPIC -fPIE T:avx2

Compiler output

Implementation: T:avx2
Security model: timingleaks
Compiler: gcc -march=native -mtune=native -O -fomit-frame-pointer -fwrapv -fPIC -fPIE
try.c: /usr/bin/ld: libcrypto_stream_simon64128ctr.a(stream.o): in function `Encrypt':
try.c: stream.c:(.text+0x...): undefined reference to `Transpose'
try.c: /usr/bin/ld: stream.c:(.text+0x...): undefined reference to `Transpose'
try.c: /usr/bin/ld: stream.c:(.text+0x...): undefined reference to `Transpose'
try.c: /usr/bin/ld: stream.c:(.text+0x...): undefined reference to `Transpose'
try.c: /usr/bin/ld: libcrypto_stream_simon64128ctr.a(stream.o): in function `Encrypt_Xor':
try.c: stream.c:(.text+0x...): undefined reference to `Transpose'
try.c: /usr/bin/ld: libcrypto_stream_simon64128ctr.a(stream.o):stream.c:(.text+0x...): more undefined references to `Transpose' follow
try.c: collect2: error: ld returned 1 exit status

Number of similar (compiler,implementation) pairs: 1, namely:
CompilerImplementations
gcc -march=native -mtune=native -O -fomit-frame-pointer -fwrapv -fPIC -fPIE T:avx2

Compiler output

Implementation: T:sse4
Security model: timingleaks
Compiler: clang -mcpu=native -O3 -fomit-frame-pointer -fwrapv -Qunused-arguments -fPIC -fPIE
stream.c: stream.c:340:3: error: always_inline function '_mm_shuffle_epi8' requires target feature 'ssse3', but would be inlined into function 'ExpandKeyBS' that is compiled without support for 'ssse3'
stream.c: EKBS(rk);
stream.c: ^
stream.c: ./Simon64128SSE4.h:64:19: note: expanded from macro 'EKBS'
stream.c: #define EKBS(rk) (RKBS(rk,4,_D), RKBS(rk,5,_D), RKBS(rk,6,_C), RKBS(rk,7,_D), RKBS(rk,8,_D), RKBS(rk,9,_C), RKBS(rk,10,_D), RKBS(rk,11,_D), \
stream.c: ^
stream.c: ./Simon64128SSE4.h:53:52: note: expanded from macro 'RKBS'
stream.c: #define RKBS(rk,r,_V) (rk[r][7]= _D ^ rk[r-4][7] ^ ROR8(rk[r-1][2]) ^ rk[r-3][7] ^ ROR8(rk[r-1][3]) ^ ROR8(rk[r-3][0]), \
stream.c: ^
stream.c: ./Intrinsics_SSE4_64block.h:39:19: note: expanded from macro 'ROR8'
stream.c: #define ROR8(X) (SHFL(X,R8))
stream.c: ^
stream.c: ./Intrinsics_SSE4_64block.h:34:14: note: expanded from macro 'SHFL'
stream.c: #define SHFL _mm_shuffle_epi8
stream.c: ^
stream.c: stream.c:340:3: error: always_inline function '_mm_shuffle_epi8' requires target feature 'ssse3', but would be inlined into function 'ExpandKeyBS' that is compiled without support for 'ssse3'
stream.c: ./Simon64128SSE4.h:64:19: note: expanded from macro 'EKBS'
stream.c: #define EKBS(rk) (RKBS(rk,4,_D), RKBS(rk,5,_D), RKBS(rk,6,_C), RKBS(rk,7,_D), RKBS(rk,8,_D), RKBS(rk,9,_C), RKBS(rk,10,_D), RKBS(rk,11,_D), \
stream.c: ^
stream.c: ./Simon64128SSE4.h:53:85: note: expanded from macro 'RKBS'
stream.c: #define RKBS(rk,r,_V) (rk[r][7]= _D ^ rk[r-4][7] ^ ROR8(rk[r-1][2]) ^ rk[r-3][7] ^ ROR8(rk[r-1][3]) ^ ROR8(rk[r-3][0]), \
stream.c: ^
stream.c: ./Intrinsics_SSE4_64block.h:39:19: note: expanded from macro 'ROR8'
stream.c: #define ROR8(X) (SHFL(X,R8))
stream.c: ^
stream.c: ...

Number of similar (compiler,implementation) pairs: 1, namely:
CompilerImplementations
clang -mcpu=native -O3 -fomit-frame-pointer -fwrapv -Qunused-arguments -fPIC -fPIE T:sse4