Implementation notes: amd64, cherry, crypto_aead/omdsha256k256n104tau160v2

Computer: cherry
Microarchitecture: amd64; Silvermont (406c4)
Architecture: amd64
CPU ID: GenuineIntel-000406c4-bfebfbff
SUPERCOP version: 20240625
Operation: crypto_aead
Primitive: omdsha256k256n104tau160v2
TimeObject sizeTest sizeImplementationCompilerBenchmark dateSUPERCOP version
45307023094 0 045160 780 1080T:refgcc_-march=native_-mtune=native_-O3_-fwrapv_-fPIC_-fPIE_-gdwarf-4_-Wall2024062820240625
49281310406 0 031616 812 1016T:refclang_-march=native_-O2_-fwrapv_-Qunused-arguments_-fPIC_-fPIE_-gdwarf-4_-Wall2024062820240625
4939438604 0 031568 812 1016T:refclang_-march=native_-O3_-fwrapv_-Qunused-arguments_-fPIC_-fPIE_-gdwarf-4_-Wall2024062820240625
5050978806 0 031224 812 1016T:refclang_-mcpu=native_-O3_-fwrapv_-Qunused-arguments_-fPIC_-fPIE_-gdwarf-4_-Wall2024062820240625
5259854799 0 024406 804 1016T:refclang_-march=native_-Os_-fwrapv_-Qunused-arguments_-fPIC_-fPIE_-gdwarf-4_-Wall2024062820240625
5336826830 0 027760 780 1080T:refgcc_-march=native_-mtune=native_-O2_-fwrapv_-fPIC_-fPIE_-gdwarf-4_-Wall2024062820240625
5502505721 0 026095 772 1080T:refgcc_-march=native_-mtune=native_-O_-fwrapv_-fPIC_-fPIE_-gdwarf-4_-Wall2024062820240625
5758704508 0 024566 804 1016T:refclang_-march=native_-O_-fwrapv_-Qunused-arguments_-fPIC_-fPIE_-gdwarf-4_-Wall2024062820240625
5814044100 0 022979 756 1048T:refgcc_-march=native_-mtune=native_-Os_-fwrapv_-fPIC_-fPIE_-gdwarf-4_-Wall2024062820240625

Compiler output


try.c: /usr/bin/ld: libcrypto_aead_omdsha256k256n104tau160v2.a(omdsha256.o):.../supercop-data/cherry/amd64/try/c/clang_-march=native_-O2_-fwrapv_-Qunused-arguments_-fPIC_-fPIE_-gdwarf-4_-Wall/timingleaks/crypto_aead/omdsha256k256n104tau160v2/avx1/work/./omdsha256.h:41: multiple definition of `Hash'; libcrypto_aead_omdsha256k256n104tau160v2.a(encrypt.o):.../supercop-data/cherry/amd64/try/c/clang_-march=native_-O2_-fwrapv_-Qunused-arguments_-fPIC_-fPIE_-gdwarf-4_-Wall/timingleaks/crypto_aead/omdsha256k256n104tau160v2/avx1/work/./omdsha256.h:41: first defined here
try.c: clang: error: linker command failed with exit code 1 (use -v to see invocation)

Number of similar (implementation,compiler) pairs: 1, namely:
ImplementationCompiler
T:avx1clang -march=native -O2 -fwrapv -Qunused-arguments -fPIC -fPIE -gdwarf-4 -Wall (Debian_Clang_11.0.1)

Compiler output


try.c: /usr/bin/ld: libcrypto_aead_omdsha256k256n104tau160v2.a(omdsha256.o):.../supercop-data/cherry/amd64/try/c/clang_-march=native_-O3_-fwrapv_-Qunused-arguments_-fPIC_-fPIE_-gdwarf-4_-Wall/timingleaks/crypto_aead/omdsha256k256n104tau160v2/avx1/work/./omdsha256.h:41: multiple definition of `Hash'; libcrypto_aead_omdsha256k256n104tau160v2.a(encrypt.o):.../supercop-data/cherry/amd64/try/c/clang_-march=native_-O3_-fwrapv_-Qunused-arguments_-fPIC_-fPIE_-gdwarf-4_-Wall/timingleaks/crypto_aead/omdsha256k256n104tau160v2/avx1/work/./omdsha256.h:41: first defined here
try.c: clang: error: linker command failed with exit code 1 (use -v to see invocation)

Number of similar (implementation,compiler) pairs: 1, namely:
ImplementationCompiler
T:avx1clang -march=native -O3 -fwrapv -Qunused-arguments -fPIC -fPIE -gdwarf-4 -Wall (Debian_Clang_11.0.1)

Compiler output


try.c: /usr/bin/ld: libcrypto_aead_omdsha256k256n104tau160v2.a(omdsha256.o):.../supercop-data/cherry/amd64/try/c/clang_-march=native_-O_-fwrapv_-Qunused-arguments_-fPIC_-fPIE_-gdwarf-4_-Wall/timingleaks/crypto_aead/omdsha256k256n104tau160v2/avx1/work/./omdsha256.h:41: multiple definition of `Hash'; libcrypto_aead_omdsha256k256n104tau160v2.a(encrypt.o):.../supercop-data/cherry/amd64/try/c/clang_-march=native_-O_-fwrapv_-Qunused-arguments_-fPIC_-fPIE_-gdwarf-4_-Wall/timingleaks/crypto_aead/omdsha256k256n104tau160v2/avx1/work/./omdsha256.h:41: first defined here
try.c: clang: error: linker command failed with exit code 1 (use -v to see invocation)

Number of similar (implementation,compiler) pairs: 1, namely:
ImplementationCompiler
T:avx1clang -march=native -O -fwrapv -Qunused-arguments -fPIC -fPIE -gdwarf-4 -Wall (Debian_Clang_11.0.1)

Compiler output


try.c: /usr/bin/ld: libcrypto_aead_omdsha256k256n104tau160v2.a(omdsha256.o):.../supercop-data/cherry/amd64/try/c/clang_-march=native_-Os_-fwrapv_-Qunused-arguments_-fPIC_-fPIE_-gdwarf-4_-Wall/timingleaks/crypto_aead/omdsha256k256n104tau160v2/avx1/work/./omdsha256.h:41: multiple definition of `Hash'; libcrypto_aead_omdsha256k256n104tau160v2.a(encrypt.o):.../supercop-data/cherry/amd64/try/c/clang_-march=native_-Os_-fwrapv_-Qunused-arguments_-fPIC_-fPIE_-gdwarf-4_-Wall/timingleaks/crypto_aead/omdsha256k256n104tau160v2/avx1/work/./omdsha256.h:41: first defined here
try.c: clang: error: linker command failed with exit code 1 (use -v to see invocation)

Number of similar (implementation,compiler) pairs: 1, namely:
ImplementationCompiler
T:avx1clang -march=native -Os -fwrapv -Qunused-arguments -fPIC -fPIE -gdwarf-4 -Wall (Debian_Clang_11.0.1)

Compiler output


try.c: /usr/bin/ld: libcrypto_aead_omdsha256k256n104tau160v2.a(omdsha256.o):.../supercop-data/cherry/amd64/try/c/clang_-mcpu=native_-O3_-fwrapv_-Qunused-arguments_-fPIC_-fPIE_-gdwarf-4_-Wall/timingleaks/crypto_aead/omdsha256k256n104tau160v2/avx1/work/./omdsha256.h:41: multiple definition of `Hash'; libcrypto_aead_omdsha256k256n104tau160v2.a(encrypt.o):.../supercop-data/cherry/amd64/try/c/clang_-mcpu=native_-O3_-fwrapv_-Qunused-arguments_-fPIC_-fPIE_-gdwarf-4_-Wall/timingleaks/crypto_aead/omdsha256k256n104tau160v2/avx1/work/./omdsha256.h:41: first defined here
try.c: clang: error: linker command failed with exit code 1 (use -v to see invocation)

Number of similar (implementation,compiler) pairs: 1, namely:
ImplementationCompiler
T:avx1clang -mcpu=native -O3 -fwrapv -Qunused-arguments -fPIC -fPIE -gdwarf-4 -Wall (Debian_Clang_11.0.1)

Compiler output


try.c: /usr/bin/ld: libcrypto_aead_omdsha256k256n104tau160v2.a(omdsha256.o):.../supercop-data/cherry/amd64/try/c/gcc_-march=native_-mtune=native_-O2_-fwrapv_-fPIC_-fPIE_-gdwarf-4_-Wall/timingleaks/crypto_aead/omdsha256k256n104tau160v2/avx1/work/omdsha256.h:41: multiple definition of `Hash'; libcrypto_aead_omdsha256k256n104tau160v2.a(encrypt.o):.../supercop-data/cherry/amd64/try/c/gcc_-march=native_-mtune=native_-O2_-fwrapv_-fPIC_-fPIE_-gdwarf-4_-Wall/timingleaks/crypto_aead/omdsha256k256n104tau160v2/avx1/work/omdsha256.h:41: first defined here
try.c: collect2: error: ld returned 1 exit status

Number of similar (implementation,compiler) pairs: 1, namely:
ImplementationCompiler
T:avx1gcc -march=native -mtune=native -O2 -fwrapv -fPIC -fPIE -gdwarf-4 -Wall (10.2.1_20210110)

Compiler output


try.c: /usr/bin/ld: libcrypto_aead_omdsha256k256n104tau160v2.a(omdsha256.o):.../supercop-data/cherry/amd64/try/c/gcc_-march=native_-mtune=native_-O3_-fwrapv_-fPIC_-fPIE_-gdwarf-4_-Wall/timingleaks/crypto_aead/omdsha256k256n104tau160v2/avx1/work/omdsha256.h:41: multiple definition of `Hash'; libcrypto_aead_omdsha256k256n104tau160v2.a(encrypt.o):.../supercop-data/cherry/amd64/try/c/gcc_-march=native_-mtune=native_-O3_-fwrapv_-fPIC_-fPIE_-gdwarf-4_-Wall/timingleaks/crypto_aead/omdsha256k256n104tau160v2/avx1/work/omdsha256.h:41: first defined here
try.c: collect2: error: ld returned 1 exit status

Number of similar (implementation,compiler) pairs: 1, namely:
ImplementationCompiler
T:avx1gcc -march=native -mtune=native -O3 -fwrapv -fPIC -fPIE -gdwarf-4 -Wall (10.2.1_20210110)

Compiler output


try.c: /usr/bin/ld: libcrypto_aead_omdsha256k256n104tau160v2.a(omdsha256.o):.../supercop-data/cherry/amd64/try/c/gcc_-march=native_-mtune=native_-O_-fwrapv_-fPIC_-fPIE_-gdwarf-4_-Wall/timingleaks/crypto_aead/omdsha256k256n104tau160v2/avx1/work/omdsha256.h:41: multiple definition of `Hash'; libcrypto_aead_omdsha256k256n104tau160v2.a(encrypt.o):.../supercop-data/cherry/amd64/try/c/gcc_-march=native_-mtune=native_-O_-fwrapv_-fPIC_-fPIE_-gdwarf-4_-Wall/timingleaks/crypto_aead/omdsha256k256n104tau160v2/avx1/work/omdsha256.h:41: first defined here
try.c: collect2: error: ld returned 1 exit status

Number of similar (implementation,compiler) pairs: 1, namely:
ImplementationCompiler
T:avx1gcc -march=native -mtune=native -O -fwrapv -fPIC -fPIE -gdwarf-4 -Wall (10.2.1_20210110)

Compiler output


try.c: /usr/bin/ld: libcrypto_aead_omdsha256k256n104tau160v2.a(omdsha256.o):.../supercop-data/cherry/amd64/try/c/gcc_-march=native_-mtune=native_-Os_-fwrapv_-fPIC_-fPIE_-gdwarf-4_-Wall/timingleaks/crypto_aead/omdsha256k256n104tau160v2/avx1/work/omdsha256.h:41: multiple definition of `Hash'; libcrypto_aead_omdsha256k256n104tau160v2.a(encrypt.o):.../supercop-data/cherry/amd64/try/c/gcc_-march=native_-mtune=native_-Os_-fwrapv_-fPIC_-fPIE_-gdwarf-4_-Wall/timingleaks/crypto_aead/omdsha256k256n104tau160v2/avx1/work/omdsha256.h:41: first defined here
try.c: collect2: error: ld returned 1 exit status

Number of similar (implementation,compiler) pairs: 1, namely:
ImplementationCompiler
T:avx1gcc -march=native -mtune=native -Os -fwrapv -fPIC -fPIE -gdwarf-4 -Wall (10.2.1_20210110)

Compiler output


try.c: /usr/bin/ld: libcrypto_aead_omdsha256k256n104tau160v2.a(omdsha256.o):.../supercop-data/cherry/amd64/try/c/clang_-march=native_-O2_-fwrapv_-Qunused-arguments_-fPIC_-fPIE_-gdwarf-4_-Wall/timingleaks/crypto_aead/omdsha256k256n104tau160v2/sse4/work/./omdsha256.h:41: multiple definition of `Hash'; libcrypto_aead_omdsha256k256n104tau160v2.a(encrypt.o):.../supercop-data/cherry/amd64/try/c/clang_-march=native_-O2_-fwrapv_-Qunused-arguments_-fPIC_-fPIE_-gdwarf-4_-Wall/timingleaks/crypto_aead/omdsha256k256n104tau160v2/sse4/work/./omdsha256.h:41: first defined here
try.c: clang: error: linker command failed with exit code 1 (use -v to see invocation)

Number of similar (implementation,compiler) pairs: 1, namely:
ImplementationCompiler
T:sse4clang -march=native -O2 -fwrapv -Qunused-arguments -fPIC -fPIE -gdwarf-4 -Wall (Debian_Clang_11.0.1)

Compiler output


try.c: /usr/bin/ld: libcrypto_aead_omdsha256k256n104tau160v2.a(omdsha256.o):.../supercop-data/cherry/amd64/try/c/clang_-march=native_-O3_-fwrapv_-Qunused-arguments_-fPIC_-fPIE_-gdwarf-4_-Wall/timingleaks/crypto_aead/omdsha256k256n104tau160v2/sse4/work/./omdsha256.h:41: multiple definition of `Hash'; libcrypto_aead_omdsha256k256n104tau160v2.a(encrypt.o):.../supercop-data/cherry/amd64/try/c/clang_-march=native_-O3_-fwrapv_-Qunused-arguments_-fPIC_-fPIE_-gdwarf-4_-Wall/timingleaks/crypto_aead/omdsha256k256n104tau160v2/sse4/work/./omdsha256.h:41: first defined here
try.c: clang: error: linker command failed with exit code 1 (use -v to see invocation)

Number of similar (implementation,compiler) pairs: 1, namely:
ImplementationCompiler
T:sse4clang -march=native -O3 -fwrapv -Qunused-arguments -fPIC -fPIE -gdwarf-4 -Wall (Debian_Clang_11.0.1)

Compiler output


try.c: /usr/bin/ld: libcrypto_aead_omdsha256k256n104tau160v2.a(omdsha256.o):.../supercop-data/cherry/amd64/try/c/clang_-march=native_-O_-fwrapv_-Qunused-arguments_-fPIC_-fPIE_-gdwarf-4_-Wall/timingleaks/crypto_aead/omdsha256k256n104tau160v2/sse4/work/./omdsha256.h:41: multiple definition of `Hash'; libcrypto_aead_omdsha256k256n104tau160v2.a(encrypt.o):.../supercop-data/cherry/amd64/try/c/clang_-march=native_-O_-fwrapv_-Qunused-arguments_-fPIC_-fPIE_-gdwarf-4_-Wall/timingleaks/crypto_aead/omdsha256k256n104tau160v2/sse4/work/./omdsha256.h:41: first defined here
try.c: clang: error: linker command failed with exit code 1 (use -v to see invocation)

Number of similar (implementation,compiler) pairs: 1, namely:
ImplementationCompiler
T:sse4clang -march=native -O -fwrapv -Qunused-arguments -fPIC -fPIE -gdwarf-4 -Wall (Debian_Clang_11.0.1)

Compiler output


try.c: /usr/bin/ld: libcrypto_aead_omdsha256k256n104tau160v2.a(omdsha256.o):.../supercop-data/cherry/amd64/try/c/clang_-march=native_-Os_-fwrapv_-Qunused-arguments_-fPIC_-fPIE_-gdwarf-4_-Wall/timingleaks/crypto_aead/omdsha256k256n104tau160v2/sse4/work/./omdsha256.h:41: multiple definition of `Hash'; libcrypto_aead_omdsha256k256n104tau160v2.a(encrypt.o):.../supercop-data/cherry/amd64/try/c/clang_-march=native_-Os_-fwrapv_-Qunused-arguments_-fPIC_-fPIE_-gdwarf-4_-Wall/timingleaks/crypto_aead/omdsha256k256n104tau160v2/sse4/work/./omdsha256.h:41: first defined here
try.c: clang: error: linker command failed with exit code 1 (use -v to see invocation)

Number of similar (implementation,compiler) pairs: 1, namely:
ImplementationCompiler
T:sse4clang -march=native -Os -fwrapv -Qunused-arguments -fPIC -fPIE -gdwarf-4 -Wall (Debian_Clang_11.0.1)

Compiler output


try.c: /usr/bin/ld: libcrypto_aead_omdsha256k256n104tau160v2.a(omdsha256.o):.../supercop-data/cherry/amd64/try/c/clang_-mcpu=native_-O3_-fwrapv_-Qunused-arguments_-fPIC_-fPIE_-gdwarf-4_-Wall/timingleaks/crypto_aead/omdsha256k256n104tau160v2/sse4/work/./omdsha256.h:41: multiple definition of `Hash'; libcrypto_aead_omdsha256k256n104tau160v2.a(encrypt.o):.../supercop-data/cherry/amd64/try/c/clang_-mcpu=native_-O3_-fwrapv_-Qunused-arguments_-fPIC_-fPIE_-gdwarf-4_-Wall/timingleaks/crypto_aead/omdsha256k256n104tau160v2/sse4/work/./omdsha256.h:41: first defined here
try.c: clang: error: linker command failed with exit code 1 (use -v to see invocation)

Number of similar (implementation,compiler) pairs: 1, namely:
ImplementationCompiler
T:sse4clang -mcpu=native -O3 -fwrapv -Qunused-arguments -fPIC -fPIE -gdwarf-4 -Wall (Debian_Clang_11.0.1)

Compiler output


try.c: /usr/bin/ld: libcrypto_aead_omdsha256k256n104tau160v2.a(omdsha256.o):.../supercop-data/cherry/amd64/try/c/gcc_-march=native_-mtune=native_-O2_-fwrapv_-fPIC_-fPIE_-gdwarf-4_-Wall/timingleaks/crypto_aead/omdsha256k256n104tau160v2/sse4/work/omdsha256.h:41: multiple definition of `Hash'; libcrypto_aead_omdsha256k256n104tau160v2.a(encrypt.o):.../supercop-data/cherry/amd64/try/c/gcc_-march=native_-mtune=native_-O2_-fwrapv_-fPIC_-fPIE_-gdwarf-4_-Wall/timingleaks/crypto_aead/omdsha256k256n104tau160v2/sse4/work/omdsha256.h:41: first defined here
try.c: collect2: error: ld returned 1 exit status

Number of similar (implementation,compiler) pairs: 1, namely:
ImplementationCompiler
T:sse4gcc -march=native -mtune=native -O2 -fwrapv -fPIC -fPIE -gdwarf-4 -Wall (10.2.1_20210110)

Compiler output


try.c: /usr/bin/ld: libcrypto_aead_omdsha256k256n104tau160v2.a(omdsha256.o):.../supercop-data/cherry/amd64/try/c/gcc_-march=native_-mtune=native_-O3_-fwrapv_-fPIC_-fPIE_-gdwarf-4_-Wall/timingleaks/crypto_aead/omdsha256k256n104tau160v2/sse4/work/omdsha256.h:41: multiple definition of `Hash'; libcrypto_aead_omdsha256k256n104tau160v2.a(encrypt.o):.../supercop-data/cherry/amd64/try/c/gcc_-march=native_-mtune=native_-O3_-fwrapv_-fPIC_-fPIE_-gdwarf-4_-Wall/timingleaks/crypto_aead/omdsha256k256n104tau160v2/sse4/work/omdsha256.h:41: first defined here
try.c: collect2: error: ld returned 1 exit status

Number of similar (implementation,compiler) pairs: 1, namely:
ImplementationCompiler
T:sse4gcc -march=native -mtune=native -O3 -fwrapv -fPIC -fPIE -gdwarf-4 -Wall (10.2.1_20210110)

Compiler output


try.c: /usr/bin/ld: libcrypto_aead_omdsha256k256n104tau160v2.a(omdsha256.o):.../supercop-data/cherry/amd64/try/c/gcc_-march=native_-mtune=native_-O_-fwrapv_-fPIC_-fPIE_-gdwarf-4_-Wall/timingleaks/crypto_aead/omdsha256k256n104tau160v2/sse4/work/omdsha256.h:41: multiple definition of `Hash'; libcrypto_aead_omdsha256k256n104tau160v2.a(encrypt.o):.../supercop-data/cherry/amd64/try/c/gcc_-march=native_-mtune=native_-O_-fwrapv_-fPIC_-fPIE_-gdwarf-4_-Wall/timingleaks/crypto_aead/omdsha256k256n104tau160v2/sse4/work/omdsha256.h:41: first defined here
try.c: collect2: error: ld returned 1 exit status

Number of similar (implementation,compiler) pairs: 1, namely:
ImplementationCompiler
T:sse4gcc -march=native -mtune=native -O -fwrapv -fPIC -fPIE -gdwarf-4 -Wall (10.2.1_20210110)

Compiler output


try.c: /usr/bin/ld: libcrypto_aead_omdsha256k256n104tau160v2.a(omdsha256.o):.../supercop-data/cherry/amd64/try/c/gcc_-march=native_-mtune=native_-Os_-fwrapv_-fPIC_-fPIE_-gdwarf-4_-Wall/timingleaks/crypto_aead/omdsha256k256n104tau160v2/sse4/work/omdsha256.h:41: multiple definition of `Hash'; libcrypto_aead_omdsha256k256n104tau160v2.a(encrypt.o):.../supercop-data/cherry/amd64/try/c/gcc_-march=native_-mtune=native_-Os_-fwrapv_-fPIC_-fPIE_-gdwarf-4_-Wall/timingleaks/crypto_aead/omdsha256k256n104tau160v2/sse4/work/omdsha256.h:41: first defined here
try.c: collect2: error: ld returned 1 exit status

Number of similar (implementation,compiler) pairs: 1, namely:
ImplementationCompiler
T:sse4gcc -march=native -mtune=native -Os -fwrapv -fPIC -fPIE -gdwarf-4 -Wall (10.2.1_20210110)