Implementation notes: amd64, bolero, crypto_aead/schwaemm256256v1

Computer: bolero
Architecture: amd64
CPU ID: GenuineIntel-000406f1-bfebfbff
SUPERCOP version: 20200906
Operation: crypto_aead
Primitive: schwaemm256256v1
TimeObject sizeTest sizeImplementationCompilerBenchmark dateSUPERCOP version
2134765479 0 019988 784 928T:refgcc_-march=native_-mtune=native_-O2_-fomit-frame-pointer_-fwrapv_-fPIC_-fPIE2020081920200816
23047614604 0 032309 792 928T:refgcc_-march=native_-mtune=native_-O3_-fomit-frame-pointer_-fwrapv_-fPIC_-fPIE2020081920200816
2440565308 0 019821 792 928T:refgcc_-march=native_-mtune=native_-O_-fomit-frame-pointer_-fwrapv_-fPIC_-fPIE2020081920200816
2939404673 0 019084 776 928T:optgcc_-march=native_-mtune=native_-O2_-fomit-frame-pointer_-fwrapv_-fPIC_-fPIE2020081920200816
3052486049 0 023653 784 928T:optgcc_-march=native_-mtune=native_-O3_-fomit-frame-pointer_-fwrapv_-fPIC_-fPIE2020081920200816
3190484668 0 019093 784 928T:optgcc_-march=native_-mtune=native_-O_-fomit-frame-pointer_-fwrapv_-fPIC_-fPIE2020081920200816

Compiler output

Implementation: T:opt
Security model: timingleaks
Compiler: clang -march=native -O2 -fomit-frame-pointer -fwrapv -Qunused-arguments -fPIC -fPIE
try.c: crypto_aead_schwaemm256256v1.a(encrypt.o): In function `crypto_aead_schwaemm256256v1_opt_timingleaks_encrypt':
try.c: encrypt.c:(.text+0x...): undefined reference to `initialize'
try.c: encrypt.c:(.text+0x...): undefined reference to `processAD'
try.c: encrypt.c:(.text+0x...): undefined reference to `encryptPT'
try.c: crypto_aead_schwaemm256256v1.a(encrypt.o): In function `crypto_aead_schwaemm256256v1_opt_timingleaks_decrypt':
try.c: encrypt.c:(.text+0x...): undefined reference to `initialize'
try.c: encrypt.c:(.text+0x...): undefined reference to `processAD'
try.c: encrypt.c:(.text+0x...): undefined reference to `decryptCT'
try.c: clang: error: linker command failed with exit code 1 (use -v to see invocation)

Number of similar (compiler,implementation) pairs: 4, namely:
CompilerImplementations
clang -march=native -O2 -fomit-frame-pointer -fwrapv -Qunused-arguments -fPIC -fPIE T:opt
clang -march=native -O3 -fomit-frame-pointer -fwrapv -Qunused-arguments -fPIC -fPIE T:opt
clang -march=native -O -fomit-frame-pointer -fwrapv -Qunused-arguments -fPIC -fPIE T:opt
clang -mcpu=native -O3 -fomit-frame-pointer -fwrapv -Qunused-arguments -fPIC -fPIE T:opt

Compiler output

Implementation: T:opt
Security model: timingleaks
Compiler: clang -march=native -Os -fomit-frame-pointer -fwrapv -Qunused-arguments -fPIC -fPIE
try.c: crypto_aead_schwaemm256256v1.a(encrypt.o): In function `crypto_aead_schwaemm256256v1_opt_timingleaks_encrypt':
try.c: encrypt.c:(.text+0x...): undefined reference to `processAD'
try.c: encrypt.c:(.text+0x...): undefined reference to `encryptPT'
try.c: crypto_aead_schwaemm256256v1.a(encrypt.o): In function `crypto_aead_schwaemm256256v1_opt_timingleaks_decrypt':
try.c: encrypt.c:(.text+0x...): undefined reference to `processAD'
try.c: encrypt.c:(.text+0x...): undefined reference to `decryptCT'
try.c: clang: error: linker command failed with exit code 1 (use -v to see invocation)

Number of similar (compiler,implementation) pairs: 1, namely:
CompilerImplementations
clang -march=native -Os -fomit-frame-pointer -fwrapv -Qunused-arguments -fPIC -fPIE T:opt

Compiler output

Implementation: T:opt
Security model: timingleaks
Compiler: gcc -march=native -mtune=native -Os -fomit-frame-pointer -fwrapv -fPIC -fPIE
try.c: crypto_aead_schwaemm256256v1.a(encrypt.o): In function `crypto_aead_schwaemm256256v1_opt_timingleaks_encrypt':
try.c: encrypt.c:(.text+0x...): undefined reference to `initialize'
try.c: encrypt.c:(.text+0x...): undefined reference to `processAD'
try.c: encrypt.c:(.text+0x...): undefined reference to `encryptPT'
try.c: crypto_aead_schwaemm256256v1.a(encrypt.o): In function `crypto_aead_schwaemm256256v1_opt_timingleaks_decrypt':
try.c: encrypt.c:(.text+0x...): undefined reference to `initialize'
try.c: encrypt.c:(.text+0x...): undefined reference to `processAD'
try.c: encrypt.c:(.text+0x...): undefined reference to `decryptCT'
try.c: collect2: error: ld returned 1 exit status

Number of similar (compiler,implementation) pairs: 1, namely:
CompilerImplementations
gcc -march=native -mtune=native -Os -fomit-frame-pointer -fwrapv -fPIC -fPIE T:opt

Compiler output

Implementation: T:ref
Security model: timingleaks
Compiler: clang -march=native -O2 -fomit-frame-pointer -fwrapv -Qunused-arguments -fPIC -fPIE
try.c: crypto_aead_schwaemm256256v1.a(encrypt.o): In function `crypto_aead_schwaemm256256v1_ref_timingleaks_encrypt':
try.c: encrypt.c:(.text+0x...): undefined reference to `initialize'
try.c: encrypt.c:(.text+0x...): undefined reference to `processAD'
try.c: encrypt.c:(.text+0x...): undefined reference to `encryptPT'
try.c: crypto_aead_schwaemm256256v1.a(encrypt.o): In function `crypto_aead_schwaemm256256v1_ref_timingleaks_decrypt':
try.c: encrypt.c:(.text+0x...): undefined reference to `initialize'
try.c: encrypt.c:(.text+0x...): undefined reference to `processAD'
try.c: encrypt.c:(.text+0x...): undefined reference to `decryptCT'
try.c: clang: error: linker command failed with exit code 1 (use -v to see invocation)

Number of similar (compiler,implementation) pairs: 4, namely:
CompilerImplementations
clang -march=native -O2 -fomit-frame-pointer -fwrapv -Qunused-arguments -fPIC -fPIE T:ref
clang -march=native -O3 -fomit-frame-pointer -fwrapv -Qunused-arguments -fPIC -fPIE T:ref
clang -march=native -O -fomit-frame-pointer -fwrapv -Qunused-arguments -fPIC -fPIE T:ref
clang -mcpu=native -O3 -fomit-frame-pointer -fwrapv -Qunused-arguments -fPIC -fPIE T:ref

Compiler output

Implementation: T:ref
Security model: timingleaks
Compiler: clang -march=native -Os -fomit-frame-pointer -fwrapv -Qunused-arguments -fPIC -fPIE
try.c: crypto_aead_schwaemm256256v1.a(encrypt.o): In function `crypto_aead_schwaemm256256v1_ref_timingleaks_encrypt':
try.c: encrypt.c:(.text+0x...): undefined reference to `processAD'
try.c: encrypt.c:(.text+0x...): undefined reference to `encryptPT'
try.c: crypto_aead_schwaemm256256v1.a(encrypt.o): In function `crypto_aead_schwaemm256256v1_ref_timingleaks_decrypt':
try.c: encrypt.c:(.text+0x...): undefined reference to `processAD'
try.c: encrypt.c:(.text+0x...): undefined reference to `decryptCT'
try.c: clang: error: linker command failed with exit code 1 (use -v to see invocation)

Number of similar (compiler,implementation) pairs: 1, namely:
CompilerImplementations
clang -march=native -Os -fomit-frame-pointer -fwrapv -Qunused-arguments -fPIC -fPIE T:ref

Compiler output

Implementation: T:ref
Security model: timingleaks
Compiler: gcc -march=native -mtune=native -Os -fomit-frame-pointer -fwrapv -fPIC -fPIE
try.c: crypto_aead_schwaemm256256v1.a(encrypt.o): In function `crypto_aead_schwaemm256256v1_ref_timingleaks_encrypt':
try.c: encrypt.c:(.text+0x...): undefined reference to `initialize'
try.c: encrypt.c:(.text+0x...): undefined reference to `processAD'
try.c: encrypt.c:(.text+0x...): undefined reference to `encryptPT'
try.c: crypto_aead_schwaemm256256v1.a(encrypt.o): In function `crypto_aead_schwaemm256256v1_ref_timingleaks_decrypt':
try.c: encrypt.c:(.text+0x...): undefined reference to `initialize'
try.c: encrypt.c:(.text+0x...): undefined reference to `processAD'
try.c: encrypt.c:(.text+0x...): undefined reference to `decryptCT'
try.c: collect2: error: ld returned 1 exit status

Number of similar (compiler,implementation) pairs: 1, namely:
CompilerImplementations
gcc -march=native -mtune=native -Os -fomit-frame-pointer -fwrapv -fPIC -fPIE T:ref

Namespace violations

Implementation: T:opt
Security model: timingleaks
Compiler: gcc -march=native -mtune=native -O2 -fomit-frame-pointer -fwrapv -fPIC -fPIE
sparkle_opt.o print_state_opt T
sparkle_opt.o sparkle_inv_opt T
sparkle_opt.o sparkle_opt T
sparkle_opt.o test_sparkle_opt T
util.o C_SEED R
util.o feistelSwap T
util.o load32 T
util.o pad T
util.o rho1 T
util.o rho2 T
util.o rhop1 T
util.o sparklePermutation T
util.o store32 T

Number of similar (compiler,implementation) pairs: 3, namely:
CompilerImplementations
gcc -march=native -mtune=native -O2 -fomit-frame-pointer -fwrapv -fPIC -fPIE T:opt
gcc -march=native -mtune=native -O3 -fomit-frame-pointer -fwrapv -fPIC -fPIE T:opt
gcc -march=native -mtune=native -O -fomit-frame-pointer -fwrapv -fPIC -fPIE T:opt

Namespace violations

Implementation: T:ref
Security model: timingleaks
Compiler: gcc -march=native -mtune=native -O2 -fomit-frame-pointer -fwrapv -fPIC -fPIE
sparkle_ref.o linear_layer T
sparkle_ref.o linear_layer_inv T
sparkle_ref.o print_state_ref T
sparkle_ref.o sparkle_inv_ref T
sparkle_ref.o sparkle_ref T
sparkle_ref.o test_sparkle_ref T
util.o C_SEED R
util.o feistelSwap T
util.o load32 T
util.o pad T
util.o rho1 T
util.o rho2 T
util.o rhop1 T
util.o sparklePermutation T
util.o store32 T

Number of similar (compiler,implementation) pairs: 3, namely:
CompilerImplementations
gcc -march=native -mtune=native -O2 -fomit-frame-pointer -fwrapv -fPIC -fPIE T:ref
gcc -march=native -mtune=native -O3 -fomit-frame-pointer -fwrapv -fPIC -fPIE T:ref
gcc -march=native -mtune=native -O -fomit-frame-pointer -fwrapv -fPIC -fPIE T:ref