Implementation notes: amd64, bolero, crypto_aead/aes128cpfbv1

Computer: bolero
Microarchitecture: amd64; BW+AES (406f1)
Architecture: amd64
CPU ID: GenuineIntel-000406f1-bfebfbff
SUPERCOP version: 20221122
Operation: crypto_aead
Primitive: aes128cpfbv1
TimeObject sizeTest sizeImplementationCompilerBenchmark dateSUPERCOP version
1554412815 0 036886 776 928T:aesnigcc_-march=native_-mtune=native_-O3_-fomit-frame-pointer_-fwrapv_-fPIC_-fPIE2020081920200816
1574813760 0 036473 776 872T:aesniclang_-march=native_-O2_-fomit-frame-pointer_-fwrapv_-Qunused-arguments_-fPIC_-fPIE2020081920200816
1574813760 0 036473 776 872T:aesniclang_-march=native_-O_-fomit-frame-pointer_-fwrapv_-Qunused-arguments_-fPIC_-fPIE2020081920200816
1642012656 0 035385 776 872T:aesniclang_-march=native_-O3_-fomit-frame-pointer_-fwrapv_-Qunused-arguments_-fPIC_-fPIE2020081920200816
210568691 0 027415 768 856T:aesniclang_-march=native_-Os_-fomit-frame-pointer_-fwrapv_-Qunused-arguments_-fPIC_-fPIE2020081920200816
211609235 0 030069 768 928T:aesnigcc_-march=native_-mtune=native_-O2_-fomit-frame-pointer_-fwrapv_-fPIC_-fPIE2020081920200816
215808819 0 029253 768 928T:aesnigcc_-march=native_-mtune=native_-O_-fomit-frame-pointer_-fwrapv_-fPIC_-fPIE2020081920200816
858523244 0 026377 776 872T:refclang_-march=native_-O_-fomit-frame-pointer_-fwrapv_-Qunused-arguments_-fPIC_-fPIE2020090720200906
858723244 0 026377 776 872T:refclang_-march=native_-O2_-fomit-frame-pointer_-fwrapv_-Qunused-arguments_-fPIC_-fPIE2020090720200906
861763244 0 026393 776 872T:refclang_-march=native_-O3_-fomit-frame-pointer_-fwrapv_-Qunused-arguments_-fPIC_-fPIE2020090720200906
870003046 0 025305 776 856T:refclang_-mcpu=native_-O3_-fomit-frame-pointer_-fwrapv_-Qunused-arguments_-fPIC_-fPIE2020090720200906
888641851 0 020999 768 856T:refclang_-march=native_-Os_-fomit-frame-pointer_-fwrapv_-Qunused-arguments_-fPIC_-fPIE2020090720200906
915206980 0 031478 776 928T:refgcc_-march=native_-mtune=native_-O3_-fomit-frame-pointer_-fwrapv_-fPIC_-fPIE2020090720200906
9489216099 0 035073 752 896T:gladmangcc_-march=native_-mtune=native_-Os_-fomit-frame-pointer_-fwrapv_-fPIC_-fPIE2020081920200816
9775618471 0 040257 776 856T:gladmanclang_-mcpu=native_-O3_-fomit-frame-pointer_-fwrapv_-Qunused-arguments_-fPIC_-fPIE2020081920200816
9850019552 0 042217 776 872T:gladmanclang_-march=native_-O_-fomit-frame-pointer_-fwrapv_-Qunused-arguments_-fPIC_-fPIE2020081920200816
9852419552 0 042233 776 872T:gladmanclang_-march=native_-O3_-fomit-frame-pointer_-fwrapv_-Qunused-arguments_-fPIC_-fPIE2020081920200816
9870019552 0 042217 776 872T:gladmanclang_-march=native_-O2_-fomit-frame-pointer_-fwrapv_-Qunused-arguments_-fPIC_-fPIE2020081920200816
9889615685 0 034343 768 856T:gladmanclang_-march=native_-Os_-fomit-frame-pointer_-fwrapv_-Qunused-arguments_-fPIC_-fPIE2020081920200816
10138017931 0 041934 776 928T:gladmangcc_-march=native_-mtune=native_-O3_-fomit-frame-pointer_-fwrapv_-fPIC_-fPIE2020081920200816
10152017037 0 037885 768 928T:gladmangcc_-march=native_-mtune=native_-O2_-fomit-frame-pointer_-fwrapv_-fPIC_-fPIE2020081920200816
10547616986 0 037389 768 928T:gladmangcc_-march=native_-mtune=native_-O_-fomit-frame-pointer_-fwrapv_-fPIC_-fPIE2020081920200816
1077362722 0 024005 768 928T:refgcc_-march=native_-mtune=native_-O2_-fomit-frame-pointer_-fwrapv_-fPIC_-fPIE2020090720200906
1104202203 0 023093 768 928T:refgcc_-march=native_-mtune=native_-O_-fomit-frame-pointer_-fwrapv_-fPIC_-fPIE2020090720200906
11850416748 0 037205 768 928T:aesrefgcc_-march=native_-mtune=native_-O_-fomit-frame-pointer_-fwrapv_-fPIC_-fPIE2020081920200816
12714022744 0 046814 776 928T:aesrefgcc_-march=native_-mtune=native_-O3_-fomit-frame-pointer_-fwrapv_-fPIC_-fPIE2020081920200816
1280801836 0 021281 752 896T:refgcc_-march=native_-mtune=native_-Os_-fomit-frame-pointer_-fwrapv_-fPIC_-fPIE2020090720200906
13126016908 0 037773 768 928T:aesrefgcc_-march=native_-mtune=native_-O2_-fomit-frame-pointer_-fwrapv_-fPIC_-fPIE2020081920200816
13900417151 0 038969 776 856T:aesrefclang_-mcpu=native_-O3_-fomit-frame-pointer_-fwrapv_-Qunused-arguments_-fPIC_-fPIE2020081920200816
14374015315 0 034031 768 856T:aesrefclang_-march=native_-Os_-fomit-frame-pointer_-fwrapv_-Qunused-arguments_-fPIC_-fPIE2020081920200816
14496017497 0 040209 776 872T:aesrefclang_-march=native_-O3_-fomit-frame-pointer_-fwrapv_-Qunused-arguments_-fPIC_-fPIE2020081920200816
14580416761 0 039457 776 872T:aesrefclang_-march=native_-O_-fomit-frame-pointer_-fwrapv_-Qunused-arguments_-fPIC_-fPIE2020081920200816
14588816761 0 039457 776 872T:aesrefclang_-march=native_-O2_-fomit-frame-pointer_-fwrapv_-Qunused-arguments_-fPIC_-fPIE2020081920200816
15298816097 0 035121 752 896T:aesrefgcc_-march=native_-mtune=native_-Os_-fomit-frame-pointer_-fwrapv_-fPIC_-fPIE2020081920200816

Compiler output

Implementation: T:aesni
Security model: timingleaks
Compiler: clang -mcpu=native -O3 -fomit-frame-pointer -fwrapv -Qunused-arguments -fPIC -fPIE
cpfbkey.c: cpfbkey.c:50:9: error: '__builtin_ia32_aeskeygenassist128' needs target feature aes
cpfbkey.c: temp2 = _mm_aeskeygenassist_si128 (temp1,0x1);
cpfbkey.c: ^
cpfbkey.c: /usr/lib/llvm-6.0/lib/clang/6.0.0/include/__wmmintrin_aes.h:147:12: note: expanded from macro '_mm_aeskeygenassist_si128'
cpfbkey.c: (__m128i)__builtin_ia32_aeskeygenassist128((__v2di)(__m128i)(C), (int)(R))
cpfbkey.c: ^
cpfbkey.c: cpfbkey.c:52:6: error: always_inline function '_mm_aesenc_si128' requires target feature 'aes', but would be inlined into function 'AES_128_Key_Expansion_and_encryption' that is compiled without support for 'aes'
cpfbkey.c: k1 = _mm_aesenc_si128(k1,temp1);
cpfbkey.c: ^
cpfbkey.c: cpfbkey.c:53:6: error: always_inline function '_mm_aesenc_si128' requires target feature 'aes', but would be inlined into function 'AES_128_Key_Expansion_and_encryption' that is compiled without support for 'aes'
cpfbkey.c: k2 = _mm_aesenc_si128(k2,temp1);
cpfbkey.c: ^
cpfbkey.c: cpfbkey.c:54:9: error: '__builtin_ia32_aeskeygenassist128' needs target feature aes
cpfbkey.c: temp2 = _mm_aeskeygenassist_si128 (temp1,0x2);
cpfbkey.c: ^
cpfbkey.c: /usr/lib/llvm-6.0/lib/clang/6.0.0/include/__wmmintrin_aes.h:147:12: note: expanded from macro '_mm_aeskeygenassist_si128'
cpfbkey.c: (__m128i)__builtin_ia32_aeskeygenassist128((__v2di)(__m128i)(C), (int)(R))
cpfbkey.c: ^
cpfbkey.c: cpfbkey.c:56:6: error: always_inline function '_mm_aesenc_si128' requires target feature 'aes', but would be inlined into function 'AES_128_Key_Expansion_and_encryption' that is compiled without support for 'aes'
cpfbkey.c: k1 = _mm_aesenc_si128(k1,temp1);
cpfbkey.c: ^
cpfbkey.c: cpfbkey.c:57:6: error: always_inline function '_mm_aesenc_si128' requires target feature 'aes', but would be inlined into function 'AES_128_Key_Expansion_and_encryption' that is compiled without support for 'aes'
cpfbkey.c: k2 = _mm_aesenc_si128(k2,temp1);
cpfbkey.c: ^
cpfbkey.c: cpfbkey.c:58:9: error: '__builtin_ia32_aeskeygenassist128' needs target feature aes
cpfbkey.c: ...

Number of similar (compiler,implementation) pairs: 1, namely:
CompilerImplementations
clang -mcpu=native -O3 -fomit-frame-pointer -fwrapv -Qunused-arguments -fPIC -fPIE T:aesni

Compiler output

Implementation: T:aesni
Security model: timingleaks
Compiler: gcc -march=native -mtune=native -Os -fomit-frame-pointer -fwrapv -fPIC -fPIE
try.c: crypto_aead_aes128cpfbv1.a(encrypt.o): In function `crypto_aead_aes128cpfbv1_aesni_timingleaks_encrypt':
try.c: encrypt.c:(.text+0x...): undefined reference to `safe_store_partial'
try.c: crypto_aead_aes128cpfbv1.a(cpfbkey.o): In function `AES_128_Key_Expansion_and_encryption':
try.c: cpfbkey.c:(.text+0x...): undefined reference to `key_expansion_128'
try.c: cpfbkey.c:(.text+0x...): undefined reference to `key_expansion_128'
try.c: cpfbkey.c:(.text+0x...): undefined reference to `key_expansion_128'
try.c: cpfbkey.c:(.text+0x...): undefined reference to `key_expansion_128'
try.c: cpfbkey.c:(.text+0x...): undefined reference to `key_expansion_128'
try.c: crypto_aead_aes128cpfbv1.a(cpfbkey.o):cpfbkey.c:(.text+0x...): more undefined references to `key_expansion_128' follow
try.c: crypto_aead_aes128cpfbv1.a(cpfbkey.o): In function `AES_256_Key_Expansion':
try.c: cpfbkey.c:(.text+0x...): undefined reference to `KEY_256_ASSIST_1'
try.c: cpfbkey.c:(.text+0x...): undefined reference to `KEY_256_ASSIST_1'
try.c: cpfbkey.c:(.text+0x...): undefined reference to `KEY_256_ASSIST_1'
try.c: cpfbkey.c:(.text+0x...): undefined reference to `KEY_256_ASSIST_1'
try.c: cpfbkey.c:(.text+0x...): undefined reference to `KEY_256_ASSIST_1'
try.c: crypto_aead_aes128cpfbv1.a(cpfbkey.o):cpfbkey.c:(.text+0x...): more undefined references to `KEY_256_ASSIST_1' follow
try.c: collect2: error: ld returned 1 exit status

Number of similar (compiler,implementation) pairs: 1, namely:
CompilerImplementations
gcc -march=native -mtune=native -Os -fomit-frame-pointer -fwrapv -fPIC -fPIE T:aesni

Compiler output

Implementation: T:evp
Security model: timingleaks
Compiler: clang -march=native -O2 -fomit-frame-pointer -fwrapv -Qunused-arguments -fPIC -fPIE
encrypt.c: encrypt.c:170:89: error: array has incomplete element type 'EVP_CIPHER_CTX' (aka 'struct evp_cipher_ctx_st')
encrypt.c: static void gen_kappa(unsigned char* nonce, unsigned char* kappa, EVP_CIPHER_CTX ctx_key[1]){
encrypt.c: ^
encrypt.c: /usr/include/openssl/ossl_typ.h:90:16: note: forward declaration of 'struct evp_cipher_ctx_st'
encrypt.c: typedef struct evp_cipher_ctx_st EVP_CIPHER_CTX;
encrypt.c: ^
encrypt.c: encrypt.c:188:25: error: array has incomplete element type 'EVP_CIPHER_CTX' (aka 'struct evp_cipher_ctx_st')
encrypt.c: EVP_CIPHER_CTX ctx_k[1];
encrypt.c: ^
encrypt.c: /usr/include/openssl/ossl_typ.h:90:16: note: forward declaration of 'struct evp_cipher_ctx_st'
encrypt.c: typedef struct evp_cipher_ctx_st EVP_CIPHER_CTX;
encrypt.c: ^
encrypt.c: encrypt.c:189:31: error: array has incomplete element type 'EVP_CIPHER_CTX' (aka 'struct evp_cipher_ctx_st')
encrypt.c: EVP_CIPHER_CTX ctx_kappa_0[1];
encrypt.c: ^
encrypt.c: /usr/include/openssl/ossl_typ.h:90:16: note: forward declaration of 'struct evp_cipher_ctx_st'
encrypt.c: typedef struct evp_cipher_ctx_st EVP_CIPHER_CTX;
encrypt.c: ^
encrypt.c: encrypt.c:190:31: error: array has incomplete element type 'EVP_CIPHER_CTX' (aka 'struct evp_cipher_ctx_st')
encrypt.c: EVP_CIPHER_CTX ctx_kappa_m[1];
encrypt.c: ^
encrypt.c: /usr/include/openssl/ossl_typ.h:90:16: note: forward declaration of 'struct evp_cipher_ctx_st'
encrypt.c: typedef struct evp_cipher_ctx_st EVP_CIPHER_CTX;
encrypt.c: ^
encrypt.c: encrypt.c:330:25: error: array has incomplete element type 'EVP_CIPHER_CTX' (aka 'struct evp_cipher_ctx_st')
encrypt.c: ...

Number of similar (compiler,implementation) pairs: 5, namely:
CompilerImplementations
clang -march=native -O2 -fomit-frame-pointer -fwrapv -Qunused-arguments -fPIC -fPIE T:evp
clang -march=native -O3 -fomit-frame-pointer -fwrapv -Qunused-arguments -fPIC -fPIE T:evp
clang -march=native -O -fomit-frame-pointer -fwrapv -Qunused-arguments -fPIC -fPIE T:evp
clang -march=native -Os -fomit-frame-pointer -fwrapv -Qunused-arguments -fPIC -fPIE T:evp
clang -mcpu=native -O3 -fomit-frame-pointer -fwrapv -Qunused-arguments -fPIC -fPIE T:evp

Compiler output

Implementation: T:evp
Security model: timingleaks
Compiler: gcc -march=native -mtune=native -O2 -fomit-frame-pointer -fwrapv -fPIC -fPIE
encrypt.c: encrypt.c:170:82: error: array type has incomplete element type 'EVP_CIPHER_CTX {aka struct evp_cipher_ctx_st}'
encrypt.c: static void gen_kappa(unsigned char* nonce, unsigned char* kappa, EVP_CIPHER_CTX ctx_key[1]){
encrypt.c: ^~~~~~~
encrypt.c: encrypt.c: In function 'crypto_aead_aes128cpfbv1_evp_timingleaks_encrypt':
encrypt.c: encrypt.c:188:20: error: array type has incomplete element type 'EVP_CIPHER_CTX {aka struct evp_cipher_ctx_st}'
encrypt.c: EVP_CIPHER_CTX ctx_k[1];
encrypt.c: ^~~~~
encrypt.c: encrypt.c:189:20: error: array type has incomplete element type 'EVP_CIPHER_CTX {aka struct evp_cipher_ctx_st}'
encrypt.c: EVP_CIPHER_CTX ctx_kappa_0[1];
encrypt.c: ^~~~~~~~~~~
encrypt.c: encrypt.c:190:20: error: array type has incomplete element type 'EVP_CIPHER_CTX {aka struct evp_cipher_ctx_st}'
encrypt.c: EVP_CIPHER_CTX ctx_kappa_m[1];
encrypt.c: ^~~~~~~~~~~
encrypt.c: encrypt.c:204:31: error: type of formal parameter 3 is incomplete
encrypt.c: gen_kappa(nonce, kappa_0, ctx_k);
encrypt.c: ^~~~~
encrypt.c: encrypt.c:265:28: error: type of formal parameter 3 is incomplete
encrypt.c: gen_kappa(nonce, kappa_m, ctx_k);
encrypt.c: ^~~~~
encrypt.c: encrypt.c: In function 'crypto_aead_aes128cpfbv1_evp_timingleaks_decrypt':
encrypt.c: encrypt.c:330:20: error: array type has incomplete element type 'EVP_CIPHER_CTX {aka struct evp_cipher_ctx_st}'
encrypt.c: EVP_CIPHER_CTX ctx_k[1];
encrypt.c: ^~~~~
encrypt.c: encrypt.c:331:20: error: array type has incomplete element type 'EVP_CIPHER_CTX {aka struct evp_cipher_ctx_st}'
encrypt.c: EVP_CIPHER_CTX ctx_kappa_0[1];
encrypt.c: ...

Number of similar (compiler,implementation) pairs: 4, namely:
CompilerImplementations
gcc -march=native -mtune=native -O2 -fomit-frame-pointer -fwrapv -fPIC -fPIE T:evp
gcc -march=native -mtune=native -O3 -fomit-frame-pointer -fwrapv -fPIC -fPIE T:evp
gcc -march=native -mtune=native -O -fomit-frame-pointer -fwrapv -fPIC -fPIE T:evp
gcc -march=native -mtune=native -Os -fomit-frame-pointer -fwrapv -fPIC -fPIE T:evp

Namespace violations

Implementation: T:aesni
Security model: timingleaks
Compiler: clang -march=native -O2 -fomit-frame-pointer -fwrapv -Qunused-arguments -fPIC -fPIE
cpfbkey.o AES_128_Key_Expansion_2 T
cpfbkey.o AES_128_Key_Expansion_and_encryption T
cpfbkey.o AES_256_Key_Expansion T
cpfbkey.o AES_256_Key_Expansion_2 T
cpfbkey.o AES_256_Key_Expansion_and_encryption T

Number of similar (compiler,implementation) pairs: 7, namely:
CompilerImplementations
clang -march=native -O2 -fomit-frame-pointer -fwrapv -Qunused-arguments -fPIC -fPIE T:aesni
clang -march=native -O3 -fomit-frame-pointer -fwrapv -Qunused-arguments -fPIC -fPIE T:aesni
clang -march=native -O -fomit-frame-pointer -fwrapv -Qunused-arguments -fPIC -fPIE T:aesni
clang -march=native -Os -fomit-frame-pointer -fwrapv -Qunused-arguments -fPIC -fPIE T:aesni
gcc -march=native -mtune=native -O2 -fomit-frame-pointer -fwrapv -fPIC -fPIE T:aesni
gcc -march=native -mtune=native -O3 -fomit-frame-pointer -fwrapv -fPIC -fPIE T:aesni
gcc -march=native -mtune=native -O -fomit-frame-pointer -fwrapv -fPIC -fPIE T:aesni

Namespace violations

Implementation: T:aesref
Security model: timingleaks
Compiler: clang -march=native -O2 -fomit-frame-pointer -fwrapv -Qunused-arguments -fPIC -fPIE
rijndael-alg-fst.o rijndaelDecrypt T
rijndael-alg-fst.o rijndaelEncrypt T
rijndael-alg-fst.o rijndaelKeySetupDec T
rijndael-alg-fst.o rijndaelKeySetupEnc T

Number of similar (compiler,implementation) pairs: 9, namely:
CompilerImplementations
clang -march=native -O2 -fomit-frame-pointer -fwrapv -Qunused-arguments -fPIC -fPIE T:aesref
clang -march=native -O3 -fomit-frame-pointer -fwrapv -Qunused-arguments -fPIC -fPIE T:aesref
clang -march=native -O -fomit-frame-pointer -fwrapv -Qunused-arguments -fPIC -fPIE T:aesref
clang -march=native -Os -fomit-frame-pointer -fwrapv -Qunused-arguments -fPIC -fPIE T:aesref
clang -mcpu=native -O3 -fomit-frame-pointer -fwrapv -Qunused-arguments -fPIC -fPIE T:aesref
gcc -march=native -mtune=native -O2 -fomit-frame-pointer -fwrapv -fPIC -fPIE T:aesref
gcc -march=native -mtune=native -O3 -fomit-frame-pointer -fwrapv -fPIC -fPIE T:aesref
gcc -march=native -mtune=native -O -fomit-frame-pointer -fwrapv -fPIC -fPIE T:aesref
gcc -march=native -mtune=native -Os -fomit-frame-pointer -fwrapv -fPIC -fPIE T:aesref

Namespace violations

Implementation: T:gladman
Security model: timingleaks
Compiler: clang -march=native -O2 -fomit-frame-pointer -fwrapv -Qunused-arguments -fPIC -fPIE
aescrypt.o aes_encrypt T
aeskey.o aes_encrypt_key128 T
aeskey.o aes_encrypt_key256 T
aestab.o aes_init T
aestab.o t_fl R
aestab.o t_fn R
aestab.o t_rc R

Number of similar (compiler,implementation) pairs: 9, namely:
CompilerImplementations
clang -march=native -O2 -fomit-frame-pointer -fwrapv -Qunused-arguments -fPIC -fPIE T:gladman
clang -march=native -O3 -fomit-frame-pointer -fwrapv -Qunused-arguments -fPIC -fPIE T:gladman
clang -march=native -O -fomit-frame-pointer -fwrapv -Qunused-arguments -fPIC -fPIE T:gladman
clang -march=native -Os -fomit-frame-pointer -fwrapv -Qunused-arguments -fPIC -fPIE T:gladman
clang -mcpu=native -O3 -fomit-frame-pointer -fwrapv -Qunused-arguments -fPIC -fPIE T:gladman
gcc -march=native -mtune=native -O2 -fomit-frame-pointer -fwrapv -fPIC -fPIE T:gladman
gcc -march=native -mtune=native -O3 -fomit-frame-pointer -fwrapv -fPIC -fPIE T:gladman
gcc -march=native -mtune=native -O -fomit-frame-pointer -fwrapv -fPIC -fPIE T:gladman
gcc -march=native -mtune=native -Os -fomit-frame-pointer -fwrapv -fPIC -fPIE T:gladman