Implementation notes: amd64, alder2,1f626960,3300000, crypto_stream/simon64128ctr

Computer: alder2,1f626960,3300000
Microarchitecture: amd64; Gracemont (906a4-20)
Architecture: amd64
CPU ID: GenuineIntel-000906a4-20-bfebfbff
SUPERCOP version: 20240625
Operation: crypto_stream
Primitive: simon64128ctr
TimeObject sizeTest sizeImplementationCompilerBenchmark dateSUPERCOP version
549986550 0 0101200 812 984T:sse4clang_-march=native_-O2_-fwrapv_-Qunused-arguments_-fPIC_-fPIE_-gdwarf-4_-Wall2024062720240625
554386550 0 0101328 812 984T:sse4clang_-march=native_-O3_-fwrapv_-Qunused-arguments_-fPIC_-fPIE_-gdwarf-4_-Wall2024062720240625
569991473 0 0106856 780 1016T:sse4gcc_-march=native_-mtune=native_-O3_-fwrapv_-fPIC_-fPIE_-gdwarf-4_-Wall2024062720240625
624297782 0 0112488 812 984T:avx2clang_-march=native_-O3_-fwrapv_-Qunused-arguments_-fPIC_-fPIE_-gdwarf-4_-Wall2024062720240625
632397782 0 0112360 812 984T:avx2clang_-march=native_-O2_-fwrapv_-Qunused-arguments_-fPIC_-fPIE_-gdwarf-4_-Wall2024062720240625
6447101098 0 0116496 780 1016T:avx2gcc_-march=native_-mtune=native_-O3_-fwrapv_-fPIC_-fPIE_-gdwarf-4_-Wall2024062720240625
684296932 0 0109070 804 952T:avx2clang_-march=native_-Os_-fwrapv_-Qunused-arguments_-fPIC_-fPIE_-gdwarf-4_-Wall2024062720240625
709896410 0 0109776 780 1016T:avx2gcc_-march=native_-mtune=native_-O2_-fwrapv_-fPIC_-fPIE_-gdwarf-4_-Wall2024062720240625
777394998 0 0106787 756 984T:avx2gcc_-march=native_-mtune=native_-Os_-fwrapv_-fPIC_-fPIE_-gdwarf-4_-Wall2024062720240625
782791609 0 0103878 804 952T:sse4clang_-march=native_-Os_-fwrapv_-Qunused-arguments_-fPIC_-fPIE_-gdwarf-4_-Wall2024062720240625
852592335 0 0104083 756 984T:sse4gcc_-march=native_-mtune=native_-Os_-fwrapv_-fPIC_-fPIE_-gdwarf-4_-Wall2024062720240625
862290864 0 0104176 780 1016T:sse4gcc_-march=native_-mtune=native_-O2_-fwrapv_-fPIC_-fPIE_-gdwarf-4_-Wall2024062720240625
902899934 0 0112390 804 952T:sse4clang_-march=native_-O_-fwrapv_-Qunused-arguments_-fPIC_-fPIE_-gdwarf-4_-Wall2024062720240625
981791691 0 0104623 772 1016T:sse4gcc_-march=native_-mtune=native_-O_-fwrapv_-fPIC_-fPIE_-gdwarf-4_-Wall2024062720240625

Compiler output


try.c: /usr/bin/ld: libcrypto_stream_simon64128ctr.a(stream.o): in function `ExpandKeyBS':
try.c: .../supercop-data/alder2,1f626960,3300000/amd64/try/c/clang_-march=native_-O_-fwrapv_-Qunused-arguments_-fPIC_-fPIE_-gdwarf-4_-Wall/timingleaks/crypto_stream/simon64128ctr/avx2/work/stream.c:373: undefined reference to `Transpose'
try.c: /usr/bin/ld: libcrypto_stream_simon64128ctr.a(stream.o): in function `Encrypt':
try.c: .../supercop-data/alder2,1f626960,3300000/amd64/try/c/clang_-march=native_-O_-fwrapv_-Qunused-arguments_-fPIC_-fPIE_-gdwarf-4_-Wall/timingleaks/crypto_stream/simon64128ctr/avx2/work/stream.c:164: undefined reference to `Transpose'
try.c: /usr/bin/ld: .../supercop-data/alder2,1f626960,3300000/amd64/try/c/clang_-march=native_-O_-fwrapv_-Qunused-arguments_-fPIC_-fPIE_-gdwarf-4_-Wall/timingleaks/crypto_stream/simon64128ctr/avx2/work/stream.c:164: undefined reference to `Transpose'
try.c: /usr/bin/ld: .../supercop-data/alder2,1f626960,3300000/amd64/try/c/clang_-march=native_-O_-fwrapv_-Qunused-arguments_-fPIC_-fPIE_-gdwarf-4_-Wall/timingleaks/crypto_stream/simon64128ctr/avx2/work/stream.c:173: undefined reference to `Transpose'
try.c: /usr/bin/ld: .../supercop-data/alder2,1f626960,3300000/amd64/try/c/clang_-march=native_-O_-fwrapv_-Qunused-arguments_-fPIC_-fPIE_-gdwarf-4_-Wall/timingleaks/crypto_stream/simon64128ctr/avx2/work/stream.c:173: undefined reference to `Transpose'
try.c: /usr/bin/ld: libcrypto_stream_simon64128ctr.a(stream.o):.../supercop-data/alder2,1f626960,3300000/amd64/try/c/clang_-march=native_-O_-fwrapv_-Qunused-arguments_-fPIC_-fPIE_-gdwarf-4_-Wall/timingleaks/crypto_stream/simon64128ctr/avx2/work/stream.c:331: more undefined references to `Transpose' follow
try.c: clang: error: linker command failed with exit code 1 (use -v to see invocation)

Number of similar (implementation,compiler) pairs: 1, namely:
ImplementationCompiler
T:avx2clang -march=native -O -fwrapv -Qunused-arguments -fPIC -fPIE -gdwarf-4 -Wall (Debian_Clang_11.0.1)

Compiler output


stream.c: stream.c:147:3: error: always_inline function '_mm256_set_epi32' requires target feature 'avx', but would be inlined into function 'Encrypt' that is compiled without support for 'avx'
stream.c:   SET1(X[0],nonce[1]); SET8(Y[0],nonce[0]);
stream.c:   ^
stream.c: ./Intrinsics_AVX2_64block.h:24:22: note: expanded from macro 'SET1'
stream.c: #define SET1(X,c) (X=SET(c,c,c,c,c,c,c,c))
stream.c:                      ^
stream.c: ./Intrinsics_AVX2_64block.h:23:13: note: expanded from macro 'SET'
stream.c: #define SET _mm256_set_epi32
stream.c:             ^
stream.c: stream.c:147:3: error: AVX vector return of type '__m256i' (vector of 4 'long long' values) without 'avx' enabled changes the ABI
stream.c: ./Intrinsics_AVX2_64block.h:24:22: note: expanded from macro 'SET1'
stream.c: #define SET1(X,c) (X=SET(c,c,c,c,c,c,c,c))
stream.c:                      ^
stream.c: ./Intrinsics_AVX2_64block.h:23:13: note: expanded from macro 'SET'
stream.c: #define SET _mm256_set_epi32
stream.c:             ^
stream.c: stream.c:147:24: error: always_inline function '_mm256_set_epi32' requires target feature 'avx', but would be inlined into function 'Encrypt' that is compiled without support for 'avx'
stream.c:   SET1(X[0],nonce[1]); SET8(Y[0],nonce[0]);
stream.c:                        ^
stream.c: ./Intrinsics_AVX2_64block.h:25:22: note: expanded from macro 'SET8'
stream.c: #define SET8(X,c) (X=SET(c,c,c,c,c,c,c,c), X=ADD(X,_q))
stream.c:                      ^
stream.c: ./Intrinsics_AVX2_64block.h:23:13: note: expanded from macro 'SET'
stream.c: #define SET _mm256_set_epi32
stream.c:             ^
stream.c: ...

Number of similar (implementation,compiler) pairs: 1, namely:
ImplementationCompiler
T:avx2clang -mcpu=native -O3 -fwrapv -Qunused-arguments -fPIC -fPIE -gdwarf-4 -Wall (Debian_Clang_11.0.1)

Compiler output


try.c: /usr/bin/ld: libcrypto_stream_simon64128ctr.a(stream.o): in function `Encrypt':
try.c: .../supercop-data/alder2,1f626960,3300000/amd64/try/c/gcc_-march=native_-mtune=native_-O_-fwrapv_-fPIC_-fPIE_-gdwarf-4_-Wall/timingleaks/crypto_stream/simon64128ctr/avx2/work/stream.c:164: undefined reference to `Transpose'
try.c: /usr/bin/ld: .../supercop-data/alder2,1f626960,3300000/amd64/try/c/gcc_-march=native_-mtune=native_-O_-fwrapv_-fPIC_-fPIE_-gdwarf-4_-Wall/timingleaks/crypto_stream/simon64128ctr/avx2/work/stream.c:164: undefined reference to `Transpose'
try.c: /usr/bin/ld: .../supercop-data/alder2,1f626960,3300000/amd64/try/c/gcc_-march=native_-mtune=native_-O_-fwrapv_-fPIC_-fPIE_-gdwarf-4_-Wall/timingleaks/crypto_stream/simon64128ctr/avx2/work/stream.c:173: undefined reference to `Transpose'
try.c: /usr/bin/ld: .../supercop-data/alder2,1f626960,3300000/amd64/try/c/gcc_-march=native_-mtune=native_-O_-fwrapv_-fPIC_-fPIE_-gdwarf-4_-Wall/timingleaks/crypto_stream/simon64128ctr/avx2/work/stream.c:173: undefined reference to `Transpose'
try.c: /usr/bin/ld: libcrypto_stream_simon64128ctr.a(stream.o): in function `Encrypt_Xor':
try.c: .../supercop-data/alder2,1f626960,3300000/amd64/try/c/gcc_-march=native_-mtune=native_-O_-fwrapv_-fPIC_-fPIE_-gdwarf-4_-Wall/timingleaks/crypto_stream/simon64128ctr/avx2/work/stream.c:331: undefined reference to `Transpose'
try.c: /usr/bin/ld: libcrypto_stream_simon64128ctr.a(stream.o):.../supercop-data/alder2,1f626960,3300000/amd64/try/c/gcc_-march=native_-mtune=native_-O_-fwrapv_-fPIC_-fPIE_-gdwarf-4_-Wall/timingleaks/crypto_stream/simon64128ctr/avx2/work/stream.c:331: more undefined references to `Transpose' follow
try.c: collect2: error: ld returned 1 exit status

Number of similar (implementation,compiler) pairs: 1, namely:
ImplementationCompiler
T:avx2gcc -march=native -mtune=native -O -fwrapv -fPIC -fPIE -gdwarf-4 -Wall (10.2.1_20210110)

Compiler output


stream.c: stream.c:340:3: error: always_inline function '_mm_shuffle_epi8' requires target feature 'ssse3', but would be inlined into function 'ExpandKeyBS' that is compiled without support for 'ssse3'
stream.c:   EKBS(rk);
stream.c:   ^
stream.c: ./Simon64128SSE4.h:64:19: note: expanded from macro 'EKBS'
stream.c: #define EKBS(rk) (RKBS(rk,4,_D),  RKBS(rk,5,_D),  RKBS(rk,6,_C),  RKBS(rk,7,_D),  RKBS(rk,8,_D),  RKBS(rk,9,_C),  RKBS(rk,10,_D), RKBS(rk,11,_D), \
stream.c:                   ^
stream.c: ./Simon64128SSE4.h:53:52: note: expanded from macro 'RKBS'
stream.c: #define RKBS(rk,r,_V) (rk[r][7]= _D ^ rk[r-4][7] ^ ROR8(rk[r-1][2])  ^ rk[r-3][7] ^ ROR8(rk[r-1][3])  ^ ROR8(rk[r-3][0]), \
stream.c:                                                    ^
stream.c: ./Intrinsics_SSE4_64block.h:39:19: note: expanded from macro 'ROR8'
stream.c: #define ROR8(X)  (SHFL(X,R8))
stream.c:                   ^
stream.c: ./Intrinsics_SSE4_64block.h:34:14: note: expanded from macro 'SHFL'
stream.c: #define SHFL _mm_shuffle_epi8
stream.c:              ^
stream.c: stream.c:340:3: error: always_inline function '_mm_shuffle_epi8' requires target feature 'ssse3', but would be inlined into function 'ExpandKeyBS' that is compiled without support for 'ssse3'
stream.c: ./Simon64128SSE4.h:64:19: note: expanded from macro 'EKBS'
stream.c: #define EKBS(rk) (RKBS(rk,4,_D),  RKBS(rk,5,_D),  RKBS(rk,6,_C),  RKBS(rk,7,_D),  RKBS(rk,8,_D),  RKBS(rk,9,_C),  RKBS(rk,10,_D), RKBS(rk,11,_D), \
stream.c:                   ^
stream.c: ./Simon64128SSE4.h:53:85: note: expanded from macro 'RKBS'
stream.c: #define RKBS(rk,r,_V) (rk[r][7]= _D ^ rk[r-4][7] ^ ROR8(rk[r-1][2])  ^ rk[r-3][7] ^ ROR8(rk[r-1][3])  ^ ROR8(rk[r-3][0]), \
stream.c:                                                                                     ^
stream.c: ./Intrinsics_SSE4_64block.h:39:19: note: expanded from macro 'ROR8'
stream.c: #define ROR8(X)  (SHFL(X,R8))
stream.c:                   ^
stream.c: ...

Number of similar (implementation,compiler) pairs: 1, namely:
ImplementationCompiler
T:sse4clang -mcpu=native -O3 -fwrapv -Qunused-arguments -fPIC -fPIE -gdwarf-4 -Wall (Debian_Clang_11.0.1)