Implementation notes: amd64, alder2,1f626960,3300000, crypto_scalarmult/curve25519

Computer: alder2,1f626960,3300000
Microarchitecture: amd64; Gracemont (906a4-20)
Architecture: amd64
CPU ID: GenuineIntel-000906a4-20-bfebfbff
SUPERCOP version: 20240625
Operation: crypto_scalarmult
Primitive: curve25519
TimeObject sizeTest sizeImplementationCompilerBenchmark dateSUPERCOP version
64307220701 0 044040 788 1784sandy2xgcc_-march=native_-mtune=native_-O3_-fwrapv_-fPIC_-fPIE_-gdwarf-4_-Wall2024062820240625
64313120797 0 043720 820 1720sandy2xclang_-mcpu=native_-O3_-fwrapv_-Qunused-arguments_-fPIC_-fPIE_-gdwarf-4_-Wall2024062820240625
64315220766 0 042096 788 1784sandy2xgcc_-march=native_-mtune=native_-O2_-fwrapv_-fPIC_-fPIE_-gdwarf-4_-Wall2024062820240625
64566420786 0 043288 820 1752sandy2xclang_-march=native_-O2_-fwrapv_-Qunused-arguments_-fPIC_-fPIE_-gdwarf-4_-Wall2024062820240625
64630720697 0 040758 812 1720sandy2xclang_-march=native_-Os_-fwrapv_-Qunused-arguments_-fPIC_-fPIE_-gdwarf-4_-Wall2024062820240625
64647020859 0 041720 788 1784sandy2xgcc_-march=native_-mtune=native_-O_-fwrapv_-fPIC_-fPIE_-gdwarf-4_-Wall2024062820240625
64931520841 0 041214 812 1720sandy2xclang_-march=native_-O_-fwrapv_-Qunused-arguments_-fPIC_-fPIE_-gdwarf-4_-Wall2024062820240625
64977220786 0 043464 820 1752sandy2xclang_-march=native_-O3_-fwrapv_-Qunused-arguments_-fPIC_-fPIE_-gdwarf-4_-Wall2024062820240625
65160120687 0 040376 780 1752sandy2xgcc_-march=native_-mtune=native_-Os_-fwrapv_-fPIC_-fPIE_-gdwarf-4_-Wall2024062820240625
7579998627 0 028766 812 1720amd64-64clang_-march=native_-Os_-fwrapv_-Qunused-arguments_-fPIC_-fPIE_-gdwarf-4_-Wall2024062820240625
7692198721 0 032088 788 1784amd64-64gcc_-march=native_-mtune=native_-O3_-fwrapv_-fPIC_-fPIE_-gdwarf-4_-Wall2024062820240625
7700818645 0 028320 780 1752amd64-64gcc_-march=native_-mtune=native_-Os_-fwrapv_-fPIC_-fPIE_-gdwarf-4_-Wall2024062820240625
77274610016 0 032696 820 1752amd64-64clang_-march=native_-O3_-fwrapv_-Qunused-arguments_-fPIC_-fPIE_-gdwarf-4_-Wall2024062820240625
77378510044 0 033016 820 1720amd64-64clang_-mcpu=native_-O3_-fwrapv_-Qunused-arguments_-fPIC_-fPIE_-gdwarf-4_-Wall2024062820240625
7748338738 0 029584 788 1784amd64-64gcc_-march=native_-mtune=native_-O_-fwrapv_-fPIC_-fPIE_-gdwarf-4_-Wall2024062820240625
7766529002 0 031560 820 1752amd64-64clang_-march=native_-O2_-fwrapv_-Qunused-arguments_-fPIC_-fPIE_-gdwarf-4_-Wall2024062820240625
7814608749 0 029222 812 1720amd64-64clang_-march=native_-O_-fwrapv_-Qunused-arguments_-fPIC_-fPIE_-gdwarf-4_-Wall2024062820240625
7834918721 0 030064 788 1784amd64-64gcc_-march=native_-mtune=native_-O2_-fwrapv_-fPIC_-fPIE_-gdwarf-4_-Wall2024062820240625
95863010712 0 031560 788 1784amd64-51gcc_-march=native_-mtune=native_-O_-fwrapv_-fPIC_-fPIE_-gdwarf-4_-Wall2024062820240625
96653110491 0 030614 812 1720amd64-51clang_-march=native_-Os_-fwrapv_-Qunused-arguments_-fPIC_-fPIE_-gdwarf-4_-Wall2024062820240625
96859711894 0 034608 820 1752amd64-51clang_-march=native_-O3_-fwrapv_-Qunused-arguments_-fPIC_-fPIE_-gdwarf-4_-Wall2024062820240625
96860010655 0 031006 812 1720amd64-51clang_-march=native_-O_-fwrapv_-Qunused-arguments_-fPIC_-fPIE_-gdwarf-4_-Wall2024062820240625
96911611913 0 034864 820 1720amd64-51clang_-mcpu=native_-O3_-fwrapv_-Qunused-arguments_-fPIC_-fPIE_-gdwarf-4_-Wall2024062820240625
97000110654 0 034000 788 1784amd64-51gcc_-march=native_-mtune=native_-O3_-fwrapv_-fPIC_-fPIE_-gdwarf-4_-Wall2024062820240625
97254410896 0 033408 820 1752amd64-51clang_-march=native_-O2_-fwrapv_-Qunused-arguments_-fPIC_-fPIE_-gdwarf-4_-Wall2024062820240625
97385210654 0 032040 788 1784amd64-51gcc_-march=native_-mtune=native_-O2_-fwrapv_-fPIC_-fPIE_-gdwarf-4_-Wall2024062820240625
97786310473 0 030168 780 1752amd64-51gcc_-march=native_-mtune=native_-Os_-fwrapv_-fPIC_-fPIE_-gdwarf-4_-Wall2024062820240625
103794021683 0 041352 780 1752donna_c64gcc_-march=native_-mtune=native_-Os_-fwrapv_-fPIC_-fPIE_-gdwarf-4_-Wall2024062820240625
103842925653 0 048936 788 1784donna_c64gcc_-march=native_-mtune=native_-O3_-fwrapv_-fPIC_-fPIE_-gdwarf-4_-Wall2024062820240625
105354225008 0 045816 788 1784donna_c64gcc_-march=native_-mtune=native_-O_-fwrapv_-fPIC_-fPIE_-gdwarf-4_-Wall2024062820240625
10640087463 0 030648 788 1784ref10gcc_-march=native_-mtune=native_-O3_-fwrapv_-fPIC_-fPIE_-gdwarf-4_-Wall2024062820240625
106469022287 0 043584 788 1784donna_c64gcc_-march=native_-mtune=native_-O2_-fwrapv_-fPIC_-fPIE_-gdwarf-4_-Wall2024062820240625
110446329992 0 052464 820 1752donna_c64clang_-march=native_-O2_-fwrapv_-Qunused-arguments_-fPIC_-fPIE_-gdwarf-4_-Wall2024062820240625
11083577061 0 026958 812 1720ref10clang_-march=native_-Os_-fwrapv_-Qunused-arguments_-fPIC_-fPIE_-gdwarf-4_-Wall2024062820240625
111527029992 0 052576 820 1752donna_c64clang_-march=native_-O3_-fwrapv_-Qunused-arguments_-fPIC_-fPIE_-gdwarf-4_-Wall2024062820240625
111548428130 0 048198 812 1720donna_c64clang_-march=native_-Os_-fwrapv_-Qunused-arguments_-fPIC_-fPIE_-gdwarf-4_-Wall2024062820240625
112717528758 0 051648 820 1720donna_c64clang_-mcpu=native_-O3_-fwrapv_-Qunused-arguments_-fPIC_-fPIE_-gdwarf-4_-Wall2024062820240625
11462417867 0 029056 788 1784ref10gcc_-march=native_-mtune=native_-O2_-fwrapv_-fPIC_-fPIE_-gdwarf-4_-Wall2024062820240625
11554977713 0 027152 780 1752ref10gcc_-march=native_-mtune=native_-Os_-fwrapv_-fPIC_-fPIE_-gdwarf-4_-Wall2024062820240625
11654597791 0 030136 820 1752ref10clang_-march=native_-O2_-fwrapv_-Qunused-arguments_-fPIC_-fPIE_-gdwarf-4_-Wall2024062820240625
11655718245 0 028816 788 1784ref10gcc_-march=native_-mtune=native_-O_-fwrapv_-fPIC_-fPIE_-gdwarf-4_-Wall2024062820240625
11727778783 0 031328 820 1752ref10clang_-march=native_-O3_-fwrapv_-Qunused-arguments_-fPIC_-fPIE_-gdwarf-4_-Wall2024062820240625
11922734663 0 025936 788 1784donnagcc_-march=native_-mtune=native_-O2_-fwrapv_-fPIC_-fPIE_-gdwarf-4_-Wall2024062820240625
12071478940 0 031776 820 1720ref10clang_-mcpu=native_-O3_-fwrapv_-Qunused-arguments_-fPIC_-fPIE_-gdwarf-4_-Wall2024062820240625
12096284623 0 027872 788 1784donnagcc_-march=native_-mtune=native_-O3_-fwrapv_-fPIC_-fPIE_-gdwarf-4_-Wall2024062820240625
12246374687 0 025062 812 1720donnaclang_-march=native_-O_-fwrapv_-Qunused-arguments_-fPIC_-fPIE_-gdwarf-4_-Wall2024062820240625
122584025672 0 046014 812 1720donna_c64clang_-march=native_-O_-fwrapv_-Qunused-arguments_-fPIC_-fPIE_-gdwarf-4_-Wall2024062820240625
12282664815 0 027296 820 1752donnaclang_-march=native_-O2_-fwrapv_-Qunused-arguments_-fPIC_-fPIE_-gdwarf-4_-Wall2024062820240625
12342734503 0 024558 812 1720donnaclang_-march=native_-Os_-fwrapv_-Qunused-arguments_-fPIC_-fPIE_-gdwarf-4_-Wall2024062820240625
12348775768 0 028368 820 1752donnaclang_-march=native_-O3_-fwrapv_-Qunused-arguments_-fPIC_-fPIE_-gdwarf-4_-Wall2024062820240625
12619988023 0 028222 812 1720ref10clang_-march=native_-O_-fwrapv_-Qunused-arguments_-fPIC_-fPIE_-gdwarf-4_-Wall2024062820240625
12757984727 0 025552 788 1784donnagcc_-march=native_-mtune=native_-O_-fwrapv_-fPIC_-fPIE_-gdwarf-4_-Wall2024062820240625
13419964422 0 024096 780 1752donnagcc_-march=native_-mtune=native_-Os_-fwrapv_-fPIC_-fPIE_-gdwarf-4_-Wall2024062820240625
1602809724663 0 047288 820 1752refclang_-march=native_-O3_-fwrapv_-Qunused-arguments_-fPIC_-fPIE_-gdwarf-4_-Wall2024062820240625
1635546227625 0 050080 820 1752refclang_-march=native_-O2_-fwrapv_-Qunused-arguments_-fPIC_-fPIE_-gdwarf-4_-Wall2024062820240625
171053175916 0 029184 788 1784refgcc_-march=native_-mtune=native_-O3_-fwrapv_-fPIC_-fPIE_-gdwarf-4_-Wall2024062820240625
1910149232760 0 055640 820 1720refclang_-mcpu=native_-O3_-fwrapv_-Qunused-arguments_-fPIC_-fPIE_-gdwarf-4_-Wall2024062820240625
197173063950 0 025272 788 1784refgcc_-march=native_-mtune=native_-O2_-fwrapv_-fPIC_-fPIE_-gdwarf-4_-Wall2024062820240625
209386453615 0 024022 812 1720refclang_-march=native_-O_-fwrapv_-Qunused-arguments_-fPIC_-fPIE_-gdwarf-4_-Wall2024062820240625
210248293142 0 023976 788 1784refgcc_-march=native_-mtune=native_-O_-fwrapv_-fPIC_-fPIE_-gdwarf-4_-Wall2024062820240625
251965723777 0 023798 812 1720refclang_-march=native_-Os_-fwrapv_-Qunused-arguments_-fPIC_-fPIE_-gdwarf-4_-Wall2024062820240625
252770942626 0 022296 780 1752refgcc_-march=native_-mtune=native_-Os_-fwrapv_-fPIC_-fPIE_-gdwarf-4_-Wall2024062820240625

Test failure


error 111

Number of similar (implementation,compiler) pairs: 1, namely:
ImplementationCompiler
donnaclang -mcpu=native -O3 -fwrapv -Qunused-arguments -fPIC -fPIE -gdwarf-4 -Wall (Debian_Clang_11.0.1)

Compiler output


smult.c: smult.c:141:16: warning: unused variable 'i' [-Wunused-variable]
smult.c:   unsigned int i;
smult.c:                ^
smult.c: 1 warning generated.

Number of similar (implementation,compiler) pairs: 5, namely:
ImplementationCompiler
refclang -march=native -O2 -fwrapv -Qunused-arguments -fPIC -fPIE -gdwarf-4 -Wall (Debian_Clang_11.0.1)
refclang -march=native -O3 -fwrapv -Qunused-arguments -fPIC -fPIE -gdwarf-4 -Wall (Debian_Clang_11.0.1)
refclang -march=native -O -fwrapv -Qunused-arguments -fPIC -fPIE -gdwarf-4 -Wall (Debian_Clang_11.0.1)
refclang -march=native -Os -fwrapv -Qunused-arguments -fPIC -fPIE -gdwarf-4 -Wall (Debian_Clang_11.0.1)
refclang -mcpu=native -O3 -fwrapv -Qunused-arguments -fPIC -fPIE -gdwarf-4 -Wall (Debian_Clang_11.0.1)

Compiler output


smult.c: smult.c: In function 'mainloop':
smult.c: smult.c:141:16: warning: unused variable 'i' [-Wunused-variable]
smult.c:   141 |   unsigned int i;
smult.c:       |                ^

Number of similar (implementation,compiler) pairs: 4, namely:
ImplementationCompiler
refgcc -march=native -mtune=native -O2 -fwrapv -fPIC -fPIE -gdwarf-4 -Wall (10.2.1_20210110)
refgcc -march=native -mtune=native -O3 -fwrapv -fPIC -fPIE -gdwarf-4 -Wall (10.2.1_20210110)
refgcc -march=native -mtune=native -O -fwrapv -fPIC -fPIE -gdwarf-4 -Wall (10.2.1_20210110)
refgcc -march=native -mtune=native -Os -fwrapv -fPIC -fPIE -gdwarf-4 -Wall (10.2.1_20210110)

Compiler output


try.c: error: linking with `cc` failed: exit code: 1
try.c:   |
try.c:   = note: "cc" "-Wl,--as-needed" "-Wl,-z,noexecstack" "-m64" "-Wl,--eh-frame-hdr" "-L" "/usr/lib/rustlib/x86_64-unknown-linux-gnu/lib" ".../supercop-data/alder2,1f626960,3300000/amd64/try/c/clang_-march=native_-O2_-fwrapv_-Qunused-arguments_-fPIC_-fPIE_-gdwarf-4_-Wall/constbranchindex/crypto_scalarmult/curve25519/rust_crypto/work/target/release/deps/measure-adbb583536850dd7.measure.ewlbjp2d-cgu.0.rcgu.o" ".../supercop-data/alder2,1f626960,3300000/amd64/try/c/clang_-march=native_-O2_-fwrapv_-Qunused-arguments_-fPIC_-fPIE_-gdwarf-4_-Wall/constbranchindex/crypto_scalarmult/curve25519/rust_crypto/work/target/release/deps/measure-adbb583536850dd7.measure.ewlbjp2d-cgu.1.rcgu.o" ".../supercop-data/alder2,1f626960,3300000/amd64/try/c/clang_-march=native_-O2_-fwrapv_-Qunused-arguments_-fPIC_-fPIE_-gdwarf-4_-Wall/constbranchindex/crypto_scalarmult/curve25519/rust_crypto/work/target/release/deps/measure-adbb583536850dd7.measure.ewlbjp2d-cgu.2.rcgu.o" ".../supercop-data/alder2,1f626960,3300000/amd64/try/c/clang_-march=native_-O2_-fwrapv_-Qunused-arguments_-fPIC_-fPIE_-gdwarf-4_-Wall/constbranchindex/crypto_scalarmult/curve25519/rust_crypto/work/target/release/deps/measure-adbb583536850dd7.measure.ewlbjp2d-cgu.3.rcgu.o" ".../supercop-data/alder2,1f626960,3300000/amd64/try/c/clang_-march=native_-O2_-fwrapv_-Qunused-arguments_-fPIC_-fPIE_-gdwarf-4_-Wall/constbranchindex/crypto_scalarmult/curve25519/rust_crypto/work/target/release/deps/measure-adbb583536850dd7.measure.ewlbjp2d-cgu.4.rcgu.o" "-o" ".../supercop-data/alder2,1f626960,3300000/amd64/try/c/clang_-march=native_-O2_-fwrapv_-Qunused-arguments_-fPIC_-fPIE_-gdwarf-4_-Wall/constbranchindex/crypto_scalarmult/curve25519/rust_crypto/work/target/release/deps/measure-adbb583536850dd7" ".../supercop-data/alder2,1f626960,3300000/amd64/try/c/clang_-march=native_-O2_-fwrapv_-Qunused-arguments_-fPIC_-fPIE_-gdwarf-4_-Wall/constbranchindex/crypto_scalarmult/curve25519/rust_crypto/work/target/release/deps/measure-adbb583536850dd7.2cxb3zllm6zjse12.rcgu.o" "-Wl,--gc-sections" "-pie" "-Wl,-zrelro" "-Wl,-znow" "-Wl,-O1" "-nodefaultlibs" "-L" ".../supercop-data/alder2,1f626960,3300000/amd64/try/c/clang_-march=native_-O2_-fwrapv_-Qunused-arguments_-fPIC_-fPIE_-gdwarf-4_-Wall/constbranchindex/crypto_scalarmult/curve25519/rust_crypto/work/target/release/deps" "-L" ".../supercop-data/alder2,1f626960,3300000/amd64/lib" "-L" ".../supercop-data/alder2,1f626960,3300000/amd64/try/c/clang_-march=native_-O2_-fwrapv_-Qunused-arguments_-fPIC_-fPIE_-gdwarf-4_-Wall/constbranchindex/crypto_scalarmult/curve25519/rust_crypto/work/target/release/build/crypto_scalarmult_curve25519-d006c1bfefb27d9f/out" "-L" ".../supercop-data/alder2,1f626960,3300000/amd64/try/c/clang_-march=native_-O2_-fwrapv_-Qunused-arguments_-fPIC_-fPIE_-gdwarf-4_-Wall/constbranchindex/crypto_scalarmult/curve25519/rust_crypto/work/target/release/build/rust-crypto-afe9b4ff19c80bbc/out" "-L" "/usr/lib/rustlib/x86_64-unknown-linux-gnu/lib" "-lmeasure-anything" "-lmeasure" "-lfastrandombytes" "-lsupercop" "-lkernelrandombytes" "-lcpucycles" "-lcrypto" "-lnsl" "-lm" "-Wl,-Bstatic" ".../supercop-data/alder2,1f626960,3300000/amd64/try/c/clang_-march=native_-O2_-fwrapv_-Qunused-arguments_-fPIC_-fPIE_-gdwarf-4_-Wall/constbranchindex/crypto_scalarmult/curve25519/rust_crypto/work/target/release/deps/libcrypto_scalarmult_curve25519-6422eef6e46a1f1b.rlib" ".../supercop-data/alder2,1f626960,3300000/amd64/try/c/clang_-march=native_-O2_-fwrapv_-Qunused-arguments_-fPIC_-fPIE_-gdwarf-4_-Wall/constbranchindex/crypto_scalarmult/curve25519/rust_crypto/work/target/release/deps/libcrypto-83ceebf3c7290f98.rlib" ".../supercop-data/alder2,1f626960,3300000/amd64/try/c/clang_-march=native_-O2_-fwrapv_-Qunused-arguments_-fPIC_-fPIE_-gdwarf-4_-Wall/constbranchindex/crypto_scalarmult/curve25519/rust_crypto/work/target/release/deps/libtime-b473882f9f54487c.rlib" ".../supercop-data/alder2,1f626960,3300000/amd64/try/c/clang_-march=native_-O2_-fwrapv_-Qunused-arguments_-fPIC_-fPIE_-gdwarf-4_-Wall/constbranchindex/crypto_scalarmult/curve25519/rust_crypto/work/target/release/deps/librustc_serialize-72942cfdca4fb518.rlib" ".../supercop-data/alder2,1f626960,3300000/amd64/try/c/clang_-march=native_-O2_-fwrapv_-Qunused-arguments_-fPIC_-fPIE_-gdwarf-4_-Wall/constbranchindex/crypto_scalarmult/curve25519/rust_crypto/work/target/release/deps/librand-2cdf248a3f2ca473.rlib" ".../supercop-data/alder2,1f626960,3300000/amd64/try/c/clang_-march=native_-O2_-fwrapv_-Qunused-arguments_-fPIC_-fPIE_-gdwarf-4_-Wall/constbranchindex/crypto_scalarmult/curve25519/rust_crypto/work/target/release/deps/librand-7df229a95dbcb448.rlib" ".../supercop-data/alder2,1f626960,3300000/amd64/try/c/clang_-march=native_-O2_-fwrapv_-Qunused-arguments_-fPIC_-fPIE_-gdwarf-4_-Wall/constbranchindex/crypto_scalarmult/curve25519/rust_crypto/work/target/release/deps/liblibc-141c671f2ddc755d.rlib" "-Wl,--start-group" "/usr/lib/rustlib/x86_64-unknown-linux-gnu/lib/libstd-6bf3f16f340782ca.rlib" "/usr/lib/rustlib/x86_64-unknown-linux-gnu/lib/libpanic_unwind-13f3099d50c21bc6.rlib" "/usr/lib/rustlib/x86_64-unknown-linux-gnu/lib/libminiz_oxide-a2ba33c985785afe.rlib" "/usr/lib/rustlib/x86_64-unknown-linux-gnu/lib/libadler-3f6e9f8f4afbea6d.rlib" "/usr/lib/rustlib/x86_64-unknown-linux-gnu/lib/libobject-af517d7f13e7c960.rlib" "/usr/lib/rustlib/x86_64-unknown-linux-gnu/lib/libaddr2line-12740563628e601f.rlib" "/usr/lib/rustlib/x86_64-unknown-linux-gnu/lib/libgimli-0ac82a1e1820dd21.rlib" "/usr/lib/rustlib/x86_64-unknown-linux-gnu/lib/librustc_demangle-3ac2d0878c297d42.rlib" "/usr/lib/rustlib/x86_64-unknown-linux-gnu/lib/libhashbrown-c6632ca171f954dd.rlib" "/usr/lib/rustlib/x86_64-unknown-linux-gnu/lib/librustc_std_workspace_alloc-b5bfd0198c7b740d.rlib" "/usr/lib/rustlib/x86_64-unknown-linux-gnu/lib/libunwind-bd645b20c6c7b56d.rlib" "/usr/lib/rustlib/x86_64-unknown-linux-gnu/lib/libcfg_if-b9e1e523c0c29a77.rlib" "/usr/lib/rustlib/x86_64-unknown-linux-gnu/lib/liblibc-dfbef8c525de0186.rlib" "/usr/lib/rustlib/x86_64-unknown-linux-gnu/lib/liballoc-1ebf406bd4ea5769.rlib" "/usr/lib/rustlib/x86_64-unknown-linux-gnu/lib/librustc_std_workspace_core-5e0675f526ef5c6b.rlib" "/usr/lib/rustlib/x86_64-unknown-linux-gnu/lib/libcore-3375e4f89d420e7a.rlib" "-Wl,--end-group" "/usr/lib/rustlib/x86_64-unknown-linux-gnu/lib/libcompiler_builtins-f74b197469e67088.rlib" "-Wl,-Bdynamic" "-lgcc_s" "-lc" "-lm" "-lrt" "-lpthread" "-lutil" "-ldl" "-lutil"
try.c:   = note: /usr/bin/ld: cannot find -lcpucycles
try.c:           collect2: error: ld returned 1 exit status
try.c:
try.c:
try.c: error: aborting due to previous error
try.c:
try.c: error: could not compile `crypto_scalarmult_curve25519`.
try.c:
try.c: To learn more, run the command again with --verbose.

Number of similar (implementation,compiler) pairs: 1, namely:
ImplementationCompiler
rust_cryptoclang -march=native -O2 -fwrapv -Qunused-arguments -fPIC -fPIE -gdwarf-4 -Wall (Debian_Clang_11.0.1)

Compiler output


try.c: error: linking with `cc` failed: exit code: 1
try.c:   |
try.c:   = note: "cc" "-Wl,--as-needed" "-Wl,-z,noexecstack" "-m64" "-Wl,--eh-frame-hdr" "-L" "/usr/lib/rustlib/x86_64-unknown-linux-gnu/lib" ".../supercop-data/alder2,1f626960,3300000/amd64/try/c/clang_-march=native_-O3_-fwrapv_-Qunused-arguments_-fPIC_-fPIE_-gdwarf-4_-Wall/constbranchindex/crypto_scalarmult/curve25519/rust_crypto/work/target/release/deps/try-ee480e045ac5bf28.try.11q4nylm-cgu.0.rcgu.o" ".../supercop-data/alder2,1f626960,3300000/amd64/try/c/clang_-march=native_-O3_-fwrapv_-Qunused-arguments_-fPIC_-fPIE_-gdwarf-4_-Wall/constbranchindex/crypto_scalarmult/curve25519/rust_crypto/work/target/release/deps/try-ee480e045ac5bf28.try.11q4nylm-cgu.1.rcgu.o" ".../supercop-data/alder2,1f626960,3300000/amd64/try/c/clang_-march=native_-O3_-fwrapv_-Qunused-arguments_-fPIC_-fPIE_-gdwarf-4_-Wall/constbranchindex/crypto_scalarmult/curve25519/rust_crypto/work/target/release/deps/try-ee480e045ac5bf28.try.11q4nylm-cgu.2.rcgu.o" ".../supercop-data/alder2,1f626960,3300000/amd64/try/c/clang_-march=native_-O3_-fwrapv_-Qunused-arguments_-fPIC_-fPIE_-gdwarf-4_-Wall/constbranchindex/crypto_scalarmult/curve25519/rust_crypto/work/target/release/deps/try-ee480e045ac5bf28.try.11q4nylm-cgu.3.rcgu.o" ".../supercop-data/alder2,1f626960,3300000/amd64/try/c/clang_-march=native_-O3_-fwrapv_-Qunused-arguments_-fPIC_-fPIE_-gdwarf-4_-Wall/constbranchindex/crypto_scalarmult/curve25519/rust_crypto/work/target/release/deps/try-ee480e045ac5bf28.try.11q4nylm-cgu.4.rcgu.o" "-o" ".../supercop-data/alder2,1f626960,3300000/amd64/try/c/clang_-march=native_-O3_-fwrapv_-Qunused-arguments_-fPIC_-fPIE_-gdwarf-4_-Wall/constbranchindex/crypto_scalarmult/curve25519/rust_crypto/work/target/release/deps/try-ee480e045ac5bf28" ".../supercop-data/alder2,1f626960,3300000/amd64/try/c/clang_-march=native_-O3_-fwrapv_-Qunused-arguments_-fPIC_-fPIE_-gdwarf-4_-Wall/constbranchindex/crypto_scalarmult/curve25519/rust_crypto/work/target/release/deps/try-ee480e045ac5bf28.24am9u1fm0gh21g5.rcgu.o" "-Wl,--gc-sections" "-pie" "-Wl,-zrelro" "-Wl,-znow" "-Wl,-O1" "-nodefaultlibs" "-L" ".../supercop-data/alder2,1f626960,3300000/amd64/try/c/clang_-march=native_-O3_-fwrapv_-Qunused-arguments_-fPIC_-fPIE_-gdwarf-4_-Wall/constbranchindex/crypto_scalarmult/curve25519/rust_crypto/work/target/release/deps" "-L" ".../supercop-data/alder2,1f626960,3300000/amd64/lib" "-L" ".../supercop-data/alder2,1f626960,3300000/amd64/try/c/clang_-march=native_-O3_-fwrapv_-Qunused-arguments_-fPIC_-fPIE_-gdwarf-4_-Wall/constbranchindex/crypto_scalarmult/curve25519/rust_crypto/work/target/release/build/crypto_scalarmult_curve25519-d006c1bfefb27d9f/out" "-L" ".../supercop-data/alder2,1f626960,3300000/amd64/try/c/clang_-march=native_-O3_-fwrapv_-Qunused-arguments_-fPIC_-fPIE_-gdwarf-4_-Wall/constbranchindex/crypto_scalarmult/curve25519/rust_crypto/work/target/release/build/rust-crypto-afe9b4ff19c80bbc/out" "-L" "/usr/lib/rustlib/x86_64-unknown-linux-gnu/lib" "-ltry-anything" "-ltry" "-lknownrandombytes" "-lsupercop" "-lkernelrandombytes" "-lcpucycles" "-lcrypto" "-lnsl" "-lm" "-Wl,-Bstatic" ".../supercop-data/alder2,1f626960,3300000/amd64/try/c/clang_-march=native_-O3_-fwrapv_-Qunused-arguments_-fPIC_-fPIE_-gdwarf-4_-Wall/constbranchindex/crypto_scalarmult/curve25519/rust_crypto/work/target/release/deps/libcrypto_scalarmult_curve25519-6422eef6e46a1f1b.rlib" ".../supercop-data/alder2,1f626960,3300000/amd64/try/c/clang_-march=native_-O3_-fwrapv_-Qunused-arguments_-fPIC_-fPIE_-gdwarf-4_-Wall/constbranchindex/crypto_scalarmult/curve25519/rust_crypto/work/target/release/deps/libcrypto-83ceebf3c7290f98.rlib" ".../supercop-data/alder2,1f626960,3300000/amd64/try/c/clang_-march=native_-O3_-fwrapv_-Qunused-arguments_-fPIC_-fPIE_-gdwarf-4_-Wall/constbranchindex/crypto_scalarmult/curve25519/rust_crypto/work/target/release/deps/libtime-b473882f9f54487c.rlib" ".../supercop-data/alder2,1f626960,3300000/amd64/try/c/clang_-march=native_-O3_-fwrapv_-Qunused-arguments_-fPIC_-fPIE_-gdwarf-4_-Wall/constbranchindex/crypto_scalarmult/curve25519/rust_crypto/work/target/release/deps/librustc_serialize-72942cfdca4fb518.rlib" ".../supercop-data/alder2,1f626960,3300000/amd64/try/c/clang_-march=native_-O3_-fwrapv_-Qunused-arguments_-fPIC_-fPIE_-gdwarf-4_-Wall/constbranchindex/crypto_scalarmult/curve25519/rust_crypto/work/target/release/deps/librand-2cdf248a3f2ca473.rlib" ".../supercop-data/alder2,1f626960,3300000/amd64/try/c/clang_-march=native_-O3_-fwrapv_-Qunused-arguments_-fPIC_-fPIE_-gdwarf-4_-Wall/constbranchindex/crypto_scalarmult/curve25519/rust_crypto/work/target/release/deps/librand-7df229a95dbcb448.rlib" ".../supercop-data/alder2,1f626960,3300000/amd64/try/c/clang_-march=native_-O3_-fwrapv_-Qunused-arguments_-fPIC_-fPIE_-gdwarf-4_-Wall/constbranchindex/crypto_scalarmult/curve25519/rust_crypto/work/target/release/deps/liblibc-141c671f2ddc755d.rlib" "-Wl,--start-group" "/usr/lib/rustlib/x86_64-unknown-linux-gnu/lib/libstd-6bf3f16f340782ca.rlib" "/usr/lib/rustlib/x86_64-unknown-linux-gnu/lib/libpanic_unwind-13f3099d50c21bc6.rlib" "/usr/lib/rustlib/x86_64-unknown-linux-gnu/lib/libminiz_oxide-a2ba33c985785afe.rlib" "/usr/lib/rustlib/x86_64-unknown-linux-gnu/lib/libadler-3f6e9f8f4afbea6d.rlib" "/usr/lib/rustlib/x86_64-unknown-linux-gnu/lib/libobject-af517d7f13e7c960.rlib" "/usr/lib/rustlib/x86_64-unknown-linux-gnu/lib/libaddr2line-12740563628e601f.rlib" "/usr/lib/rustlib/x86_64-unknown-linux-gnu/lib/libgimli-0ac82a1e1820dd21.rlib" "/usr/lib/rustlib/x86_64-unknown-linux-gnu/lib/librustc_demangle-3ac2d0878c297d42.rlib" "/usr/lib/rustlib/x86_64-unknown-linux-gnu/lib/libhashbrown-c6632ca171f954dd.rlib" "/usr/lib/rustlib/x86_64-unknown-linux-gnu/lib/librustc_std_workspace_alloc-b5bfd0198c7b740d.rlib" "/usr/lib/rustlib/x86_64-unknown-linux-gnu/lib/libunwind-bd645b20c6c7b56d.rlib" "/usr/lib/rustlib/x86_64-unknown-linux-gnu/lib/libcfg_if-b9e1e523c0c29a77.rlib" "/usr/lib/rustlib/x86_64-unknown-linux-gnu/lib/liblibc-dfbef8c525de0186.rlib" "/usr/lib/rustlib/x86_64-unknown-linux-gnu/lib/liballoc-1ebf406bd4ea5769.rlib" "/usr/lib/rustlib/x86_64-unknown-linux-gnu/lib/librustc_std_workspace_core-5e0675f526ef5c6b.rlib" "/usr/lib/rustlib/x86_64-unknown-linux-gnu/lib/libcore-3375e4f89d420e7a.rlib" "-Wl,--end-group" "/usr/lib/rustlib/x86_64-unknown-linux-gnu/lib/libcompiler_builtins-f74b197469e67088.rlib" "-Wl,-Bdynamic" "-lgcc_s" "-lc" "-lm" "-lrt" "-lpthread" "-lutil" "-ldl" "-lutil"
try.c:   = note: /usr/bin/ld: cannot find -lcpucycles
try.c:           collect2: error: ld returned 1 exit status
try.c:
try.c:
try.c: error: aborting due to previous error
try.c:
try.c: error: could not compile `crypto_scalarmult_curve25519`.
try.c:
try.c: To learn more, run the command again with --verbose.

Number of similar (implementation,compiler) pairs: 1, namely:
ImplementationCompiler
rust_cryptoclang -march=native -O3 -fwrapv -Qunused-arguments -fPIC -fPIE -gdwarf-4 -Wall (Debian_Clang_11.0.1)

Compiler output


try.c: error: linking with `cc` failed: exit code: 1
try.c:   |
try.c:   = note: "cc" "-Wl,--as-needed" "-Wl,-z,noexecstack" "-m64" "-Wl,--eh-frame-hdr" "-L" "/usr/lib/rustlib/x86_64-unknown-linux-gnu/lib" ".../supercop-data/alder2,1f626960,3300000/amd64/try/c/clang_-march=native_-O_-fwrapv_-Qunused-arguments_-fPIC_-fPIE_-gdwarf-4_-Wall/constbranchindex/crypto_scalarmult/curve25519/rust_crypto/work/target/release/deps/try_small-d887ad352f24cb89.try_small.7i0lr38s-cgu.0.rcgu.o" ".../supercop-data/alder2,1f626960,3300000/amd64/try/c/clang_-march=native_-O_-fwrapv_-Qunused-arguments_-fPIC_-fPIE_-gdwarf-4_-Wall/constbranchindex/crypto_scalarmult/curve25519/rust_crypto/work/target/release/deps/try_small-d887ad352f24cb89.try_small.7i0lr38s-cgu.1.rcgu.o" ".../supercop-data/alder2,1f626960,3300000/amd64/try/c/clang_-march=native_-O_-fwrapv_-Qunused-arguments_-fPIC_-fPIE_-gdwarf-4_-Wall/constbranchindex/crypto_scalarmult/curve25519/rust_crypto/work/target/release/deps/try_small-d887ad352f24cb89.try_small.7i0lr38s-cgu.2.rcgu.o" ".../supercop-data/alder2,1f626960,3300000/amd64/try/c/clang_-march=native_-O_-fwrapv_-Qunused-arguments_-fPIC_-fPIE_-gdwarf-4_-Wall/constbranchindex/crypto_scalarmult/curve25519/rust_crypto/work/target/release/deps/try_small-d887ad352f24cb89.try_small.7i0lr38s-cgu.3.rcgu.o" ".../supercop-data/alder2,1f626960,3300000/amd64/try/c/clang_-march=native_-O_-fwrapv_-Qunused-arguments_-fPIC_-fPIE_-gdwarf-4_-Wall/constbranchindex/crypto_scalarmult/curve25519/rust_crypto/work/target/release/deps/try_small-d887ad352f24cb89.try_small.7i0lr38s-cgu.4.rcgu.o" "-o" ".../supercop-data/alder2,1f626960,3300000/amd64/try/c/clang_-march=native_-O_-fwrapv_-Qunused-arguments_-fPIC_-fPIE_-gdwarf-4_-Wall/constbranchindex/crypto_scalarmult/curve25519/rust_crypto/work/target/release/deps/try_small-d887ad352f24cb89" ".../supercop-data/alder2,1f626960,3300000/amd64/try/c/clang_-march=native_-O_-fwrapv_-Qunused-arguments_-fPIC_-fPIE_-gdwarf-4_-Wall/constbranchindex/crypto_scalarmult/curve25519/rust_crypto/work/target/release/deps/try_small-d887ad352f24cb89.2oefsontexx9vrvo.rcgu.o" "-Wl,--gc-sections" "-pie" "-Wl,-zrelro" "-Wl,-znow" "-Wl,-O1" "-nodefaultlibs" "-L" ".../supercop-data/alder2,1f626960,3300000/amd64/try/c/clang_-march=native_-O_-fwrapv_-Qunused-arguments_-fPIC_-fPIE_-gdwarf-4_-Wall/constbranchindex/crypto_scalarmult/curve25519/rust_crypto/work/target/release/deps" "-L" ".../supercop-data/alder2,1f626960,3300000/amd64/lib" "-L" ".../supercop-data/alder2,1f626960,3300000/amd64/try/c/clang_-march=native_-O_-fwrapv_-Qunused-arguments_-fPIC_-fPIE_-gdwarf-4_-Wall/constbranchindex/crypto_scalarmult/curve25519/rust_crypto/work/target/release/build/crypto_scalarmult_curve25519-d006c1bfefb27d9f/out" "-L" ".../supercop-data/alder2,1f626960,3300000/amd64/try/c/clang_-march=native_-O_-fwrapv_-Qunused-arguments_-fPIC_-fPIE_-gdwarf-4_-Wall/constbranchindex/crypto_scalarmult/curve25519/rust_crypto/work/target/release/build/rust-crypto-afe9b4ff19c80bbc/out" "-L" "/usr/lib/rustlib/x86_64-unknown-linux-gnu/lib" "-ltry-anything" "-ltry-small" "-lknownrandombytes" "-lsupercop" "-lkernelrandombytes" "-lcpucycles" "-lcrypto" "-lnsl" "-lm" "-Wl,-Bstatic" ".../supercop-data/alder2,1f626960,3300000/amd64/try/c/clang_-march=native_-O_-fwrapv_-Qunused-arguments_-fPIC_-fPIE_-gdwarf-4_-Wall/constbranchindex/crypto_scalarmult/curve25519/rust_crypto/work/target/release/deps/libcrypto_scalarmult_curve25519-6422eef6e46a1f1b.rlib" ".../supercop-data/alder2,1f626960,3300000/amd64/try/c/clang_-march=native_-O_-fwrapv_-Qunused-arguments_-fPIC_-fPIE_-gdwarf-4_-Wall/constbranchindex/crypto_scalarmult/curve25519/rust_crypto/work/target/release/deps/libcrypto-83ceebf3c7290f98.rlib" ".../supercop-data/alder2,1f626960,3300000/amd64/try/c/clang_-march=native_-O_-fwrapv_-Qunused-arguments_-fPIC_-fPIE_-gdwarf-4_-Wall/constbranchindex/crypto_scalarmult/curve25519/rust_crypto/work/target/release/deps/libtime-b473882f9f54487c.rlib" ".../supercop-data/alder2,1f626960,3300000/amd64/try/c/clang_-march=native_-O_-fwrapv_-Qunused-arguments_-fPIC_-fPIE_-gdwarf-4_-Wall/constbranchindex/crypto_scalarmult/curve25519/rust_crypto/work/target/release/deps/librustc_serialize-72942cfdca4fb518.rlib" ".../supercop-data/alder2,1f626960,3300000/amd64/try/c/clang_-march=native_-O_-fwrapv_-Qunused-arguments_-fPIC_-fPIE_-gdwarf-4_-Wall/constbranchindex/crypto_scalarmult/curve25519/rust_crypto/work/target/release/deps/librand-2cdf248a3f2ca473.rlib" ".../supercop-data/alder2,1f626960,3300000/amd64/try/c/clang_-march=native_-O_-fwrapv_-Qunused-arguments_-fPIC_-fPIE_-gdwarf-4_-Wall/constbranchindex/crypto_scalarmult/curve25519/rust_crypto/work/target/release/deps/librand-7df229a95dbcb448.rlib" ".../supercop-data/alder2,1f626960,3300000/amd64/try/c/clang_-march=native_-O_-fwrapv_-Qunused-arguments_-fPIC_-fPIE_-gdwarf-4_-Wall/constbranchindex/crypto_scalarmult/curve25519/rust_crypto/work/target/release/deps/liblibc-141c671f2ddc755d.rlib" "-Wl,--start-group" "/usr/lib/rustlib/x86_64-unknown-linux-gnu/lib/libstd-6bf3f16f340782ca.rlib" "/usr/lib/rustlib/x86_64-unknown-linux-gnu/lib/libpanic_unwind-13f3099d50c21bc6.rlib" "/usr/lib/rustlib/x86_64-unknown-linux-gnu/lib/libminiz_oxide-a2ba33c985785afe.rlib" "/usr/lib/rustlib/x86_64-unknown-linux-gnu/lib/libadler-3f6e9f8f4afbea6d.rlib" "/usr/lib/rustlib/x86_64-unknown-linux-gnu/lib/libobject-af517d7f13e7c960.rlib" "/usr/lib/rustlib/x86_64-unknown-linux-gnu/lib/libaddr2line-12740563628e601f.rlib" "/usr/lib/rustlib/x86_64-unknown-linux-gnu/lib/libgimli-0ac82a1e1820dd21.rlib" "/usr/lib/rustlib/x86_64-unknown-linux-gnu/lib/librustc_demangle-3ac2d0878c297d42.rlib" "/usr/lib/rustlib/x86_64-unknown-linux-gnu/lib/libhashbrown-c6632ca171f954dd.rlib" "/usr/lib/rustlib/x86_64-unknown-linux-gnu/lib/librustc_std_workspace_alloc-b5bfd0198c7b740d.rlib" "/usr/lib/rustlib/x86_64-unknown-linux-gnu/lib/libunwind-bd645b20c6c7b56d.rlib" "/usr/lib/rustlib/x86_64-unknown-linux-gnu/lib/libcfg_if-b9e1e523c0c29a77.rlib" "/usr/lib/rustlib/x86_64-unknown-linux-gnu/lib/liblibc-dfbef8c525de0186.rlib" "/usr/lib/rustlib/x86_64-unknown-linux-gnu/lib/liballoc-1ebf406bd4ea5769.rlib" "/usr/lib/rustlib/x86_64-unknown-linux-gnu/lib/librustc_std_workspace_core-5e0675f526ef5c6b.rlib" "/usr/lib/rustlib/x86_64-unknown-linux-gnu/lib/libcore-3375e4f89d420e7a.rlib" "-Wl,--end-group" "/usr/lib/rustlib/x86_64-unknown-linux-gnu/lib/libcompiler_builtins-f74b197469e67088.rlib" "-Wl,-Bdynamic" "-lgcc_s" "-lc" "-lm" "-lrt" "-lpthread" "-lutil" "-ldl" "-lutil"
try.c:   = note: /usr/bin/ld: cannot find -lcpucycles
try.c:           collect2: error: ld returned 1 exit status
try.c:
try.c:
try.c: error: aborting due to previous error
try.c:
try.c: error: could not compile `crypto_scalarmult_curve25519`.
try.c:
try.c: To learn more, run the command again with --verbose.

Number of similar (implementation,compiler) pairs: 1, namely:
ImplementationCompiler
rust_cryptoclang -march=native -O -fwrapv -Qunused-arguments -fPIC -fPIE -gdwarf-4 -Wall (Debian_Clang_11.0.1)

Compiler output


try.c: error: linking with `cc` failed: exit code: 1
try.c:   |
try.c:   = note: "cc" "-Wl,--as-needed" "-Wl,-z,noexecstack" "-m64" "-Wl,--eh-frame-hdr" "-L" "/usr/lib/rustlib/x86_64-unknown-linux-gnu/lib" ".../supercop-data/alder2,1f626960,3300000/amd64/try/c/clang_-march=native_-Os_-fwrapv_-Qunused-arguments_-fPIC_-fPIE_-gdwarf-4_-Wall/constbranchindex/crypto_scalarmult/curve25519/rust_crypto/work/target/release/deps/try_small-d887ad352f24cb89.try_small.7i0lr38s-cgu.0.rcgu.o" ".../supercop-data/alder2,1f626960,3300000/amd64/try/c/clang_-march=native_-Os_-fwrapv_-Qunused-arguments_-fPIC_-fPIE_-gdwarf-4_-Wall/constbranchindex/crypto_scalarmult/curve25519/rust_crypto/work/target/release/deps/try_small-d887ad352f24cb89.try_small.7i0lr38s-cgu.1.rcgu.o" ".../supercop-data/alder2,1f626960,3300000/amd64/try/c/clang_-march=native_-Os_-fwrapv_-Qunused-arguments_-fPIC_-fPIE_-gdwarf-4_-Wall/constbranchindex/crypto_scalarmult/curve25519/rust_crypto/work/target/release/deps/try_small-d887ad352f24cb89.try_small.7i0lr38s-cgu.2.rcgu.o" ".../supercop-data/alder2,1f626960,3300000/amd64/try/c/clang_-march=native_-Os_-fwrapv_-Qunused-arguments_-fPIC_-fPIE_-gdwarf-4_-Wall/constbranchindex/crypto_scalarmult/curve25519/rust_crypto/work/target/release/deps/try_small-d887ad352f24cb89.try_small.7i0lr38s-cgu.3.rcgu.o" ".../supercop-data/alder2,1f626960,3300000/amd64/try/c/clang_-march=native_-Os_-fwrapv_-Qunused-arguments_-fPIC_-fPIE_-gdwarf-4_-Wall/constbranchindex/crypto_scalarmult/curve25519/rust_crypto/work/target/release/deps/try_small-d887ad352f24cb89.try_small.7i0lr38s-cgu.4.rcgu.o" "-o" ".../supercop-data/alder2,1f626960,3300000/amd64/try/c/clang_-march=native_-Os_-fwrapv_-Qunused-arguments_-fPIC_-fPIE_-gdwarf-4_-Wall/constbranchindex/crypto_scalarmult/curve25519/rust_crypto/work/target/release/deps/try_small-d887ad352f24cb89" ".../supercop-data/alder2,1f626960,3300000/amd64/try/c/clang_-march=native_-Os_-fwrapv_-Qunused-arguments_-fPIC_-fPIE_-gdwarf-4_-Wall/constbranchindex/crypto_scalarmult/curve25519/rust_crypto/work/target/release/deps/try_small-d887ad352f24cb89.2oefsontexx9vrvo.rcgu.o" "-Wl,--gc-sections" "-pie" "-Wl,-zrelro" "-Wl,-znow" "-Wl,-O1" "-nodefaultlibs" "-L" ".../supercop-data/alder2,1f626960,3300000/amd64/try/c/clang_-march=native_-Os_-fwrapv_-Qunused-arguments_-fPIC_-fPIE_-gdwarf-4_-Wall/constbranchindex/crypto_scalarmult/curve25519/rust_crypto/work/target/release/deps" "-L" ".../supercop-data/alder2,1f626960,3300000/amd64/lib" "-L" ".../supercop-data/alder2,1f626960,3300000/amd64/try/c/clang_-march=native_-Os_-fwrapv_-Qunused-arguments_-fPIC_-fPIE_-gdwarf-4_-Wall/constbranchindex/crypto_scalarmult/curve25519/rust_crypto/work/target/release/build/crypto_scalarmult_curve25519-d006c1bfefb27d9f/out" "-L" ".../supercop-data/alder2,1f626960,3300000/amd64/try/c/clang_-march=native_-Os_-fwrapv_-Qunused-arguments_-fPIC_-fPIE_-gdwarf-4_-Wall/constbranchindex/crypto_scalarmult/curve25519/rust_crypto/work/target/release/build/rust-crypto-afe9b4ff19c80bbc/out" "-L" "/usr/lib/rustlib/x86_64-unknown-linux-gnu/lib" "-ltry-anything" "-ltry-small" "-lknownrandombytes" "-lsupercop" "-lkernelrandombytes" "-lcpucycles" "-lcrypto" "-lnsl" "-lm" "-Wl,-Bstatic" ".../supercop-data/alder2,1f626960,3300000/amd64/try/c/clang_-march=native_-Os_-fwrapv_-Qunused-arguments_-fPIC_-fPIE_-gdwarf-4_-Wall/constbranchindex/crypto_scalarmult/curve25519/rust_crypto/work/target/release/deps/libcrypto_scalarmult_curve25519-6422eef6e46a1f1b.rlib" ".../supercop-data/alder2,1f626960,3300000/amd64/try/c/clang_-march=native_-Os_-fwrapv_-Qunused-arguments_-fPIC_-fPIE_-gdwarf-4_-Wall/constbranchindex/crypto_scalarmult/curve25519/rust_crypto/work/target/release/deps/libcrypto-83ceebf3c7290f98.rlib" ".../supercop-data/alder2,1f626960,3300000/amd64/try/c/clang_-march=native_-Os_-fwrapv_-Qunused-arguments_-fPIC_-fPIE_-gdwarf-4_-Wall/constbranchindex/crypto_scalarmult/curve25519/rust_crypto/work/target/release/deps/libtime-b473882f9f54487c.rlib" ".../supercop-data/alder2,1f626960,3300000/amd64/try/c/clang_-march=native_-Os_-fwrapv_-Qunused-arguments_-fPIC_-fPIE_-gdwarf-4_-Wall/constbranchindex/crypto_scalarmult/curve25519/rust_crypto/work/target/release/deps/librustc_serialize-72942cfdca4fb518.rlib" ".../supercop-data/alder2,1f626960,3300000/amd64/try/c/clang_-march=native_-Os_-fwrapv_-Qunused-arguments_-fPIC_-fPIE_-gdwarf-4_-Wall/constbranchindex/crypto_scalarmult/curve25519/rust_crypto/work/target/release/deps/librand-2cdf248a3f2ca473.rlib" ".../supercop-data/alder2,1f626960,3300000/amd64/try/c/clang_-march=native_-Os_-fwrapv_-Qunused-arguments_-fPIC_-fPIE_-gdwarf-4_-Wall/constbranchindex/crypto_scalarmult/curve25519/rust_crypto/work/target/release/deps/librand-7df229a95dbcb448.rlib" ".../supercop-data/alder2,1f626960,3300000/amd64/try/c/clang_-march=native_-Os_-fwrapv_-Qunused-arguments_-fPIC_-fPIE_-gdwarf-4_-Wall/constbranchindex/crypto_scalarmult/curve25519/rust_crypto/work/target/release/deps/liblibc-141c671f2ddc755d.rlib" "-Wl,--start-group" "/usr/lib/rustlib/x86_64-unknown-linux-gnu/lib/libstd-6bf3f16f340782ca.rlib" "/usr/lib/rustlib/x86_64-unknown-linux-gnu/lib/libpanic_unwind-13f3099d50c21bc6.rlib" "/usr/lib/rustlib/x86_64-unknown-linux-gnu/lib/libminiz_oxide-a2ba33c985785afe.rlib" "/usr/lib/rustlib/x86_64-unknown-linux-gnu/lib/libadler-3f6e9f8f4afbea6d.rlib" "/usr/lib/rustlib/x86_64-unknown-linux-gnu/lib/libobject-af517d7f13e7c960.rlib" "/usr/lib/rustlib/x86_64-unknown-linux-gnu/lib/libaddr2line-12740563628e601f.rlib" "/usr/lib/rustlib/x86_64-unknown-linux-gnu/lib/libgimli-0ac82a1e1820dd21.rlib" "/usr/lib/rustlib/x86_64-unknown-linux-gnu/lib/librustc_demangle-3ac2d0878c297d42.rlib" "/usr/lib/rustlib/x86_64-unknown-linux-gnu/lib/libhashbrown-c6632ca171f954dd.rlib" "/usr/lib/rustlib/x86_64-unknown-linux-gnu/lib/librustc_std_workspace_alloc-b5bfd0198c7b740d.rlib" "/usr/lib/rustlib/x86_64-unknown-linux-gnu/lib/libunwind-bd645b20c6c7b56d.rlib" "/usr/lib/rustlib/x86_64-unknown-linux-gnu/lib/libcfg_if-b9e1e523c0c29a77.rlib" "/usr/lib/rustlib/x86_64-unknown-linux-gnu/lib/liblibc-dfbef8c525de0186.rlib" "/usr/lib/rustlib/x86_64-unknown-linux-gnu/lib/liballoc-1ebf406bd4ea5769.rlib" "/usr/lib/rustlib/x86_64-unknown-linux-gnu/lib/librustc_std_workspace_core-5e0675f526ef5c6b.rlib" "/usr/lib/rustlib/x86_64-unknown-linux-gnu/lib/libcore-3375e4f89d420e7a.rlib" "-Wl,--end-group" "/usr/lib/rustlib/x86_64-unknown-linux-gnu/lib/libcompiler_builtins-f74b197469e67088.rlib" "-Wl,-Bdynamic" "-lgcc_s" "-lc" "-lm" "-lrt" "-lpthread" "-lutil" "-ldl" "-lutil"
try.c:   = note: /usr/bin/ld: cannot find -lcpucycles
try.c:           collect2: error: ld returned 1 exit status
try.c:
try.c:
try.c: error: aborting due to previous error
try.c:
try.c: error: could not compile `crypto_scalarmult_curve25519`.
try.c:
try.c: To learn more, run the command again with --verbose.

Number of similar (implementation,compiler) pairs: 1, namely:
ImplementationCompiler
rust_cryptoclang -march=native -Os -fwrapv -Qunused-arguments -fPIC -fPIE -gdwarf-4 -Wall (Debian_Clang_11.0.1)

Compiler output


try.c: error: linking with `cc` failed: exit code: 1
try.c:   |
try.c:   = note: "cc" "-Wl,--as-needed" "-Wl,-z,noexecstack" "-m64" "-Wl,--eh-frame-hdr" "-L" "/usr/lib/rustlib/x86_64-unknown-linux-gnu/lib" ".../supercop-data/alder2,1f626960,3300000/amd64/try/c/clang_-mcpu=native_-O3_-fwrapv_-Qunused-arguments_-fPIC_-fPIE_-gdwarf-4_-Wall/constbranchindex/crypto_scalarmult/curve25519/rust_crypto/work/target/release/deps/try_small-d887ad352f24cb89.try_small.7i0lr38s-cgu.0.rcgu.o" ".../supercop-data/alder2,1f626960,3300000/amd64/try/c/clang_-mcpu=native_-O3_-fwrapv_-Qunused-arguments_-fPIC_-fPIE_-gdwarf-4_-Wall/constbranchindex/crypto_scalarmult/curve25519/rust_crypto/work/target/release/deps/try_small-d887ad352f24cb89.try_small.7i0lr38s-cgu.1.rcgu.o" ".../supercop-data/alder2,1f626960,3300000/amd64/try/c/clang_-mcpu=native_-O3_-fwrapv_-Qunused-arguments_-fPIC_-fPIE_-gdwarf-4_-Wall/constbranchindex/crypto_scalarmult/curve25519/rust_crypto/work/target/release/deps/try_small-d887ad352f24cb89.try_small.7i0lr38s-cgu.2.rcgu.o" ".../supercop-data/alder2,1f626960,3300000/amd64/try/c/clang_-mcpu=native_-O3_-fwrapv_-Qunused-arguments_-fPIC_-fPIE_-gdwarf-4_-Wall/constbranchindex/crypto_scalarmult/curve25519/rust_crypto/work/target/release/deps/try_small-d887ad352f24cb89.try_small.7i0lr38s-cgu.3.rcgu.o" ".../supercop-data/alder2,1f626960,3300000/amd64/try/c/clang_-mcpu=native_-O3_-fwrapv_-Qunused-arguments_-fPIC_-fPIE_-gdwarf-4_-Wall/constbranchindex/crypto_scalarmult/curve25519/rust_crypto/work/target/release/deps/try_small-d887ad352f24cb89.try_small.7i0lr38s-cgu.4.rcgu.o" "-o" ".../supercop-data/alder2,1f626960,3300000/amd64/try/c/clang_-mcpu=native_-O3_-fwrapv_-Qunused-arguments_-fPIC_-fPIE_-gdwarf-4_-Wall/constbranchindex/crypto_scalarmult/curve25519/rust_crypto/work/target/release/deps/try_small-d887ad352f24cb89" ".../supercop-data/alder2,1f626960,3300000/amd64/try/c/clang_-mcpu=native_-O3_-fwrapv_-Qunused-arguments_-fPIC_-fPIE_-gdwarf-4_-Wall/constbranchindex/crypto_scalarmult/curve25519/rust_crypto/work/target/release/deps/try_small-d887ad352f24cb89.2oefsontexx9vrvo.rcgu.o" "-Wl,--gc-sections" "-pie" "-Wl,-zrelro" "-Wl,-znow" "-Wl,-O1" "-nodefaultlibs" "-L" ".../supercop-data/alder2,1f626960,3300000/amd64/try/c/clang_-mcpu=native_-O3_-fwrapv_-Qunused-arguments_-fPIC_-fPIE_-gdwarf-4_-Wall/constbranchindex/crypto_scalarmult/curve25519/rust_crypto/work/target/release/deps" "-L" ".../supercop-data/alder2,1f626960,3300000/amd64/lib" "-L" ".../supercop-data/alder2,1f626960,3300000/amd64/try/c/clang_-mcpu=native_-O3_-fwrapv_-Qunused-arguments_-fPIC_-fPIE_-gdwarf-4_-Wall/constbranchindex/crypto_scalarmult/curve25519/rust_crypto/work/target/release/build/crypto_scalarmult_curve25519-d006c1bfefb27d9f/out" "-L" ".../supercop-data/alder2,1f626960,3300000/amd64/try/c/clang_-mcpu=native_-O3_-fwrapv_-Qunused-arguments_-fPIC_-fPIE_-gdwarf-4_-Wall/constbranchindex/crypto_scalarmult/curve25519/rust_crypto/work/target/release/build/rust-crypto-afe9b4ff19c80bbc/out" "-L" "/usr/lib/rustlib/x86_64-unknown-linux-gnu/lib" "-ltry-anything" "-ltry-small" "-lknownrandombytes" "-lsupercop" "-lkernelrandombytes" "-lcpucycles" "-lcrypto" "-lnsl" "-lm" "-Wl,-Bstatic" ".../supercop-data/alder2,1f626960,3300000/amd64/try/c/clang_-mcpu=native_-O3_-fwrapv_-Qunused-arguments_-fPIC_-fPIE_-gdwarf-4_-Wall/constbranchindex/crypto_scalarmult/curve25519/rust_crypto/work/target/release/deps/libcrypto_scalarmult_curve25519-6422eef6e46a1f1b.rlib" ".../supercop-data/alder2,1f626960,3300000/amd64/try/c/clang_-mcpu=native_-O3_-fwrapv_-Qunused-arguments_-fPIC_-fPIE_-gdwarf-4_-Wall/constbranchindex/crypto_scalarmult/curve25519/rust_crypto/work/target/release/deps/libcrypto-83ceebf3c7290f98.rlib" ".../supercop-data/alder2,1f626960,3300000/amd64/try/c/clang_-mcpu=native_-O3_-fwrapv_-Qunused-arguments_-fPIC_-fPIE_-gdwarf-4_-Wall/constbranchindex/crypto_scalarmult/curve25519/rust_crypto/work/target/release/deps/libtime-b473882f9f54487c.rlib" ".../supercop-data/alder2,1f626960,3300000/amd64/try/c/clang_-mcpu=native_-O3_-fwrapv_-Qunused-arguments_-fPIC_-fPIE_-gdwarf-4_-Wall/constbranchindex/crypto_scalarmult/curve25519/rust_crypto/work/target/release/deps/librustc_serialize-72942cfdca4fb518.rlib" ".../supercop-data/alder2,1f626960,3300000/amd64/try/c/clang_-mcpu=native_-O3_-fwrapv_-Qunused-arguments_-fPIC_-fPIE_-gdwarf-4_-Wall/constbranchindex/crypto_scalarmult/curve25519/rust_crypto/work/target/release/deps/librand-2cdf248a3f2ca473.rlib" ".../supercop-data/alder2,1f626960,3300000/amd64/try/c/clang_-mcpu=native_-O3_-fwrapv_-Qunused-arguments_-fPIC_-fPIE_-gdwarf-4_-Wall/constbranchindex/crypto_scalarmult/curve25519/rust_crypto/work/target/release/deps/librand-7df229a95dbcb448.rlib" ".../supercop-data/alder2,1f626960,3300000/amd64/try/c/clang_-mcpu=native_-O3_-fwrapv_-Qunused-arguments_-fPIC_-fPIE_-gdwarf-4_-Wall/constbranchindex/crypto_scalarmult/curve25519/rust_crypto/work/target/release/deps/liblibc-141c671f2ddc755d.rlib" "-Wl,--start-group" "/usr/lib/rustlib/x86_64-unknown-linux-gnu/lib/libstd-6bf3f16f340782ca.rlib" "/usr/lib/rustlib/x86_64-unknown-linux-gnu/lib/libpanic_unwind-13f3099d50c21bc6.rlib" "/usr/lib/rustlib/x86_64-unknown-linux-gnu/lib/libminiz_oxide-a2ba33c985785afe.rlib" "/usr/lib/rustlib/x86_64-unknown-linux-gnu/lib/libadler-3f6e9f8f4afbea6d.rlib" "/usr/lib/rustlib/x86_64-unknown-linux-gnu/lib/libobject-af517d7f13e7c960.rlib" "/usr/lib/rustlib/x86_64-unknown-linux-gnu/lib/libaddr2line-12740563628e601f.rlib" "/usr/lib/rustlib/x86_64-unknown-linux-gnu/lib/libgimli-0ac82a1e1820dd21.rlib" "/usr/lib/rustlib/x86_64-unknown-linux-gnu/lib/librustc_demangle-3ac2d0878c297d42.rlib" "/usr/lib/rustlib/x86_64-unknown-linux-gnu/lib/libhashbrown-c6632ca171f954dd.rlib" "/usr/lib/rustlib/x86_64-unknown-linux-gnu/lib/librustc_std_workspace_alloc-b5bfd0198c7b740d.rlib" "/usr/lib/rustlib/x86_64-unknown-linux-gnu/lib/libunwind-bd645b20c6c7b56d.rlib" "/usr/lib/rustlib/x86_64-unknown-linux-gnu/lib/libcfg_if-b9e1e523c0c29a77.rlib" "/usr/lib/rustlib/x86_64-unknown-linux-gnu/lib/liblibc-dfbef8c525de0186.rlib" "/usr/lib/rustlib/x86_64-unknown-linux-gnu/lib/liballoc-1ebf406bd4ea5769.rlib" "/usr/lib/rustlib/x86_64-unknown-linux-gnu/lib/librustc_std_workspace_core-5e0675f526ef5c6b.rlib" "/usr/lib/rustlib/x86_64-unknown-linux-gnu/lib/libcore-3375e4f89d420e7a.rlib" "-Wl,--end-group" "/usr/lib/rustlib/x86_64-unknown-linux-gnu/lib/libcompiler_builtins-f74b197469e67088.rlib" "-Wl,-Bdynamic" "-lgcc_s" "-lc" "-lm" "-lrt" "-lpthread" "-lutil" "-ldl" "-lutil"
try.c:   = note: /usr/bin/ld: cannot find -lcpucycles
try.c:           collect2: error: ld returned 1 exit status
try.c:
try.c:
try.c: error: aborting due to previous error
try.c:
try.c: error: could not compile `crypto_scalarmult_curve25519`.
try.c:
try.c: To learn more, run the command again with --verbose.

Number of similar (implementation,compiler) pairs: 1, namely:
ImplementationCompiler
rust_cryptoclang -mcpu=native -O3 -fwrapv -Qunused-arguments -fPIC -fPIE -gdwarf-4 -Wall (Debian_Clang_11.0.1)

Compiler output


try.c: error: linking with `cc` failed: exit code: 1
try.c:   |
try.c:   = note: "cc" "-Wl,--as-needed" "-Wl,-z,noexecstack" "-m64" "-Wl,--eh-frame-hdr" "-L" "/usr/lib/rustlib/x86_64-unknown-linux-gnu/lib" ".../supercop-data/alder2,1f626960,3300000/amd64/try/c/gcc_-march=native_-mtune=native_-O2_-fwrapv_-fPIC_-fPIE_-gdwarf-4_-Wall/constbranchindex/crypto_scalarmult/curve25519/rust_crypto/work/target/release/deps/try-ee480e045ac5bf28.try.11q4nylm-cgu.0.rcgu.o" ".../supercop-data/alder2,1f626960,3300000/amd64/try/c/gcc_-march=native_-mtune=native_-O2_-fwrapv_-fPIC_-fPIE_-gdwarf-4_-Wall/constbranchindex/crypto_scalarmult/curve25519/rust_crypto/work/target/release/deps/try-ee480e045ac5bf28.try.11q4nylm-cgu.1.rcgu.o" ".../supercop-data/alder2,1f626960,3300000/amd64/try/c/gcc_-march=native_-mtune=native_-O2_-fwrapv_-fPIC_-fPIE_-gdwarf-4_-Wall/constbranchindex/crypto_scalarmult/curve25519/rust_crypto/work/target/release/deps/try-ee480e045ac5bf28.try.11q4nylm-cgu.2.rcgu.o" ".../supercop-data/alder2,1f626960,3300000/amd64/try/c/gcc_-march=native_-mtune=native_-O2_-fwrapv_-fPIC_-fPIE_-gdwarf-4_-Wall/constbranchindex/crypto_scalarmult/curve25519/rust_crypto/work/target/release/deps/try-ee480e045ac5bf28.try.11q4nylm-cgu.3.rcgu.o" ".../supercop-data/alder2,1f626960,3300000/amd64/try/c/gcc_-march=native_-mtune=native_-O2_-fwrapv_-fPIC_-fPIE_-gdwarf-4_-Wall/constbranchindex/crypto_scalarmult/curve25519/rust_crypto/work/target/release/deps/try-ee480e045ac5bf28.try.11q4nylm-cgu.4.rcgu.o" "-o" ".../supercop-data/alder2,1f626960,3300000/amd64/try/c/gcc_-march=native_-mtune=native_-O2_-fwrapv_-fPIC_-fPIE_-gdwarf-4_-Wall/constbranchindex/crypto_scalarmult/curve25519/rust_crypto/work/target/release/deps/try-ee480e045ac5bf28" ".../supercop-data/alder2,1f626960,3300000/amd64/try/c/gcc_-march=native_-mtune=native_-O2_-fwrapv_-fPIC_-fPIE_-gdwarf-4_-Wall/constbranchindex/crypto_scalarmult/curve25519/rust_crypto/work/target/release/deps/try-ee480e045ac5bf28.24am9u1fm0gh21g5.rcgu.o" "-Wl,--gc-sections" "-pie" "-Wl,-zrelro" "-Wl,-znow" "-Wl,-O1" "-nodefaultlibs" "-L" ".../supercop-data/alder2,1f626960,3300000/amd64/try/c/gcc_-march=native_-mtune=native_-O2_-fwrapv_-fPIC_-fPIE_-gdwarf-4_-Wall/constbranchindex/crypto_scalarmult/curve25519/rust_crypto/work/target/release/deps" "-L" ".../supercop-data/alder2,1f626960,3300000/amd64/lib" "-L" ".../supercop-data/alder2,1f626960,3300000/amd64/try/c/gcc_-march=native_-mtune=native_-O2_-fwrapv_-fPIC_-fPIE_-gdwarf-4_-Wall/constbranchindex/crypto_scalarmult/curve25519/rust_crypto/work/target/release/build/crypto_scalarmult_curve25519-d006c1bfefb27d9f/out" "-L" ".../supercop-data/alder2,1f626960,3300000/amd64/try/c/gcc_-march=native_-mtune=native_-O2_-fwrapv_-fPIC_-fPIE_-gdwarf-4_-Wall/constbranchindex/crypto_scalarmult/curve25519/rust_crypto/work/target/release/build/rust-crypto-afe9b4ff19c80bbc/out" "-L" "/usr/lib/rustlib/x86_64-unknown-linux-gnu/lib" "-ltry-anything" "-ltry" "-lknownrandombytes" "-lsupercop" "-lkernelrandombytes" "-lcpucycles" "-lcrypto" "-lnsl" "-lm" "-Wl,-Bstatic" ".../supercop-data/alder2,1f626960,3300000/amd64/try/c/gcc_-march=native_-mtune=native_-O2_-fwrapv_-fPIC_-fPIE_-gdwarf-4_-Wall/constbranchindex/crypto_scalarmult/curve25519/rust_crypto/work/target/release/deps/libcrypto_scalarmult_curve25519-6422eef6e46a1f1b.rlib" ".../supercop-data/alder2,1f626960,3300000/amd64/try/c/gcc_-march=native_-mtune=native_-O2_-fwrapv_-fPIC_-fPIE_-gdwarf-4_-Wall/constbranchindex/crypto_scalarmult/curve25519/rust_crypto/work/target/release/deps/libcrypto-83ceebf3c7290f98.rlib" ".../supercop-data/alder2,1f626960,3300000/amd64/try/c/gcc_-march=native_-mtune=native_-O2_-fwrapv_-fPIC_-fPIE_-gdwarf-4_-Wall/constbranchindex/crypto_scalarmult/curve25519/rust_crypto/work/target/release/deps/libtime-b473882f9f54487c.rlib" ".../supercop-data/alder2,1f626960,3300000/amd64/try/c/gcc_-march=native_-mtune=native_-O2_-fwrapv_-fPIC_-fPIE_-gdwarf-4_-Wall/constbranchindex/crypto_scalarmult/curve25519/rust_crypto/work/target/release/deps/librustc_serialize-72942cfdca4fb518.rlib" ".../supercop-data/alder2,1f626960,3300000/amd64/try/c/gcc_-march=native_-mtune=native_-O2_-fwrapv_-fPIC_-fPIE_-gdwarf-4_-Wall/constbranchindex/crypto_scalarmult/curve25519/rust_crypto/work/target/release/deps/librand-2cdf248a3f2ca473.rlib" ".../supercop-data/alder2,1f626960,3300000/amd64/try/c/gcc_-march=native_-mtune=native_-O2_-fwrapv_-fPIC_-fPIE_-gdwarf-4_-Wall/constbranchindex/crypto_scalarmult/curve25519/rust_crypto/work/target/release/deps/librand-7df229a95dbcb448.rlib" ".../supercop-data/alder2,1f626960,3300000/amd64/try/c/gcc_-march=native_-mtune=native_-O2_-fwrapv_-fPIC_-fPIE_-gdwarf-4_-Wall/constbranchindex/crypto_scalarmult/curve25519/rust_crypto/work/target/release/deps/liblibc-141c671f2ddc755d.rlib" "-Wl,--start-group" "/usr/lib/rustlib/x86_64-unknown-linux-gnu/lib/libstd-6bf3f16f340782ca.rlib" "/usr/lib/rustlib/x86_64-unknown-linux-gnu/lib/libpanic_unwind-13f3099d50c21bc6.rlib" "/usr/lib/rustlib/x86_64-unknown-linux-gnu/lib/libminiz_oxide-a2ba33c985785afe.rlib" "/usr/lib/rustlib/x86_64-unknown-linux-gnu/lib/libadler-3f6e9f8f4afbea6d.rlib" "/usr/lib/rustlib/x86_64-unknown-linux-gnu/lib/libobject-af517d7f13e7c960.rlib" "/usr/lib/rustlib/x86_64-unknown-linux-gnu/lib/libaddr2line-12740563628e601f.rlib" "/usr/lib/rustlib/x86_64-unknown-linux-gnu/lib/libgimli-0ac82a1e1820dd21.rlib" "/usr/lib/rustlib/x86_64-unknown-linux-gnu/lib/librustc_demangle-3ac2d0878c297d42.rlib" "/usr/lib/rustlib/x86_64-unknown-linux-gnu/lib/libhashbrown-c6632ca171f954dd.rlib" "/usr/lib/rustlib/x86_64-unknown-linux-gnu/lib/librustc_std_workspace_alloc-b5bfd0198c7b740d.rlib" "/usr/lib/rustlib/x86_64-unknown-linux-gnu/lib/libunwind-bd645b20c6c7b56d.rlib" "/usr/lib/rustlib/x86_64-unknown-linux-gnu/lib/libcfg_if-b9e1e523c0c29a77.rlib" "/usr/lib/rustlib/x86_64-unknown-linux-gnu/lib/liblibc-dfbef8c525de0186.rlib" "/usr/lib/rustlib/x86_64-unknown-linux-gnu/lib/liballoc-1ebf406bd4ea5769.rlib" "/usr/lib/rustlib/x86_64-unknown-linux-gnu/lib/librustc_std_workspace_core-5e0675f526ef5c6b.rlib" "/usr/lib/rustlib/x86_64-unknown-linux-gnu/lib/libcore-3375e4f89d420e7a.rlib" "-Wl,--end-group" "/usr/lib/rustlib/x86_64-unknown-linux-gnu/lib/libcompiler_builtins-f74b197469e67088.rlib" "-Wl,-Bdynamic" "-lgcc_s" "-lc" "-lm" "-lrt" "-lpthread" "-lutil" "-ldl" "-lutil"
try.c:   = note: /usr/bin/ld: cannot find -lcpucycles
try.c:           collect2: error: ld returned 1 exit status
try.c:
try.c:
try.c: error: aborting due to previous error
try.c:
try.c: error: could not compile `crypto_scalarmult_curve25519`.
try.c:
try.c: To learn more, run the command again with --verbose.

Number of similar (implementation,compiler) pairs: 1, namely:
ImplementationCompiler
rust_cryptogcc -march=native -mtune=native -O2 -fwrapv -fPIC -fPIE -gdwarf-4 -Wall (10.2.1_20210110)

Compiler output


try.c: error: linking with `cc` failed: exit code: 1
try.c:   |
try.c:   = note: "cc" "-Wl,--as-needed" "-Wl,-z,noexecstack" "-m64" "-Wl,--eh-frame-hdr" "-L" "/usr/lib/rustlib/x86_64-unknown-linux-gnu/lib" ".../supercop-data/alder2,1f626960,3300000/amd64/try/c/gcc_-march=native_-mtune=native_-O3_-fwrapv_-fPIC_-fPIE_-gdwarf-4_-Wall/constbranchindex/crypto_scalarmult/curve25519/rust_crypto/work/target/release/deps/measure-adbb583536850dd7.measure.ewlbjp2d-cgu.0.rcgu.o" ".../supercop-data/alder2,1f626960,3300000/amd64/try/c/gcc_-march=native_-mtune=native_-O3_-fwrapv_-fPIC_-fPIE_-gdwarf-4_-Wall/constbranchindex/crypto_scalarmult/curve25519/rust_crypto/work/target/release/deps/measure-adbb583536850dd7.measure.ewlbjp2d-cgu.1.rcgu.o" ".../supercop-data/alder2,1f626960,3300000/amd64/try/c/gcc_-march=native_-mtune=native_-O3_-fwrapv_-fPIC_-fPIE_-gdwarf-4_-Wall/constbranchindex/crypto_scalarmult/curve25519/rust_crypto/work/target/release/deps/measure-adbb583536850dd7.measure.ewlbjp2d-cgu.2.rcgu.o" ".../supercop-data/alder2,1f626960,3300000/amd64/try/c/gcc_-march=native_-mtune=native_-O3_-fwrapv_-fPIC_-fPIE_-gdwarf-4_-Wall/constbranchindex/crypto_scalarmult/curve25519/rust_crypto/work/target/release/deps/measure-adbb583536850dd7.measure.ewlbjp2d-cgu.3.rcgu.o" ".../supercop-data/alder2,1f626960,3300000/amd64/try/c/gcc_-march=native_-mtune=native_-O3_-fwrapv_-fPIC_-fPIE_-gdwarf-4_-Wall/constbranchindex/crypto_scalarmult/curve25519/rust_crypto/work/target/release/deps/measure-adbb583536850dd7.measure.ewlbjp2d-cgu.4.rcgu.o" "-o" ".../supercop-data/alder2,1f626960,3300000/amd64/try/c/gcc_-march=native_-mtune=native_-O3_-fwrapv_-fPIC_-fPIE_-gdwarf-4_-Wall/constbranchindex/crypto_scalarmult/curve25519/rust_crypto/work/target/release/deps/measure-adbb583536850dd7" ".../supercop-data/alder2,1f626960,3300000/amd64/try/c/gcc_-march=native_-mtune=native_-O3_-fwrapv_-fPIC_-fPIE_-gdwarf-4_-Wall/constbranchindex/crypto_scalarmult/curve25519/rust_crypto/work/target/release/deps/measure-adbb583536850dd7.2cxb3zllm6zjse12.rcgu.o" "-Wl,--gc-sections" "-pie" "-Wl,-zrelro" "-Wl,-znow" "-Wl,-O1" "-nodefaultlibs" "-L" ".../supercop-data/alder2,1f626960,3300000/amd64/try/c/gcc_-march=native_-mtune=native_-O3_-fwrapv_-fPIC_-fPIE_-gdwarf-4_-Wall/constbranchindex/crypto_scalarmult/curve25519/rust_crypto/work/target/release/deps" "-L" ".../supercop-data/alder2,1f626960,3300000/amd64/lib" "-L" ".../supercop-data/alder2,1f626960,3300000/amd64/try/c/gcc_-march=native_-mtune=native_-O3_-fwrapv_-fPIC_-fPIE_-gdwarf-4_-Wall/constbranchindex/crypto_scalarmult/curve25519/rust_crypto/work/target/release/build/crypto_scalarmult_curve25519-d006c1bfefb27d9f/out" "-L" ".../supercop-data/alder2,1f626960,3300000/amd64/try/c/gcc_-march=native_-mtune=native_-O3_-fwrapv_-fPIC_-fPIE_-gdwarf-4_-Wall/constbranchindex/crypto_scalarmult/curve25519/rust_crypto/work/target/release/build/rust-crypto-afe9b4ff19c80bbc/out" "-L" "/usr/lib/rustlib/x86_64-unknown-linux-gnu/lib" "-lmeasure-anything" "-lmeasure" "-lfastrandombytes" "-lsupercop" "-lkernelrandombytes" "-lcpucycles" "-lcrypto" "-lnsl" "-lm" "-Wl,-Bstatic" ".../supercop-data/alder2,1f626960,3300000/amd64/try/c/gcc_-march=native_-mtune=native_-O3_-fwrapv_-fPIC_-fPIE_-gdwarf-4_-Wall/constbranchindex/crypto_scalarmult/curve25519/rust_crypto/work/target/release/deps/libcrypto_scalarmult_curve25519-6422eef6e46a1f1b.rlib" ".../supercop-data/alder2,1f626960,3300000/amd64/try/c/gcc_-march=native_-mtune=native_-O3_-fwrapv_-fPIC_-fPIE_-gdwarf-4_-Wall/constbranchindex/crypto_scalarmult/curve25519/rust_crypto/work/target/release/deps/libcrypto-83ceebf3c7290f98.rlib" ".../supercop-data/alder2,1f626960,3300000/amd64/try/c/gcc_-march=native_-mtune=native_-O3_-fwrapv_-fPIC_-fPIE_-gdwarf-4_-Wall/constbranchindex/crypto_scalarmult/curve25519/rust_crypto/work/target/release/deps/libtime-b473882f9f54487c.rlib" ".../supercop-data/alder2,1f626960,3300000/amd64/try/c/gcc_-march=native_-mtune=native_-O3_-fwrapv_-fPIC_-fPIE_-gdwarf-4_-Wall/constbranchindex/crypto_scalarmult/curve25519/rust_crypto/work/target/release/deps/librustc_serialize-72942cfdca4fb518.rlib" ".../supercop-data/alder2,1f626960,3300000/amd64/try/c/gcc_-march=native_-mtune=native_-O3_-fwrapv_-fPIC_-fPIE_-gdwarf-4_-Wall/constbranchindex/crypto_scalarmult/curve25519/rust_crypto/work/target/release/deps/librand-2cdf248a3f2ca473.rlib" ".../supercop-data/alder2,1f626960,3300000/amd64/try/c/gcc_-march=native_-mtune=native_-O3_-fwrapv_-fPIC_-fPIE_-gdwarf-4_-Wall/constbranchindex/crypto_scalarmult/curve25519/rust_crypto/work/target/release/deps/librand-7df229a95dbcb448.rlib" ".../supercop-data/alder2,1f626960,3300000/amd64/try/c/gcc_-march=native_-mtune=native_-O3_-fwrapv_-fPIC_-fPIE_-gdwarf-4_-Wall/constbranchindex/crypto_scalarmult/curve25519/rust_crypto/work/target/release/deps/liblibc-141c671f2ddc755d.rlib" "-Wl,--start-group" "/usr/lib/rustlib/x86_64-unknown-linux-gnu/lib/libstd-6bf3f16f340782ca.rlib" "/usr/lib/rustlib/x86_64-unknown-linux-gnu/lib/libpanic_unwind-13f3099d50c21bc6.rlib" "/usr/lib/rustlib/x86_64-unknown-linux-gnu/lib/libminiz_oxide-a2ba33c985785afe.rlib" "/usr/lib/rustlib/x86_64-unknown-linux-gnu/lib/libadler-3f6e9f8f4afbea6d.rlib" "/usr/lib/rustlib/x86_64-unknown-linux-gnu/lib/libobject-af517d7f13e7c960.rlib" "/usr/lib/rustlib/x86_64-unknown-linux-gnu/lib/libaddr2line-12740563628e601f.rlib" "/usr/lib/rustlib/x86_64-unknown-linux-gnu/lib/libgimli-0ac82a1e1820dd21.rlib" "/usr/lib/rustlib/x86_64-unknown-linux-gnu/lib/librustc_demangle-3ac2d0878c297d42.rlib" "/usr/lib/rustlib/x86_64-unknown-linux-gnu/lib/libhashbrown-c6632ca171f954dd.rlib" "/usr/lib/rustlib/x86_64-unknown-linux-gnu/lib/librustc_std_workspace_alloc-b5bfd0198c7b740d.rlib" "/usr/lib/rustlib/x86_64-unknown-linux-gnu/lib/libunwind-bd645b20c6c7b56d.rlib" "/usr/lib/rustlib/x86_64-unknown-linux-gnu/lib/libcfg_if-b9e1e523c0c29a77.rlib" "/usr/lib/rustlib/x86_64-unknown-linux-gnu/lib/liblibc-dfbef8c525de0186.rlib" "/usr/lib/rustlib/x86_64-unknown-linux-gnu/lib/liballoc-1ebf406bd4ea5769.rlib" "/usr/lib/rustlib/x86_64-unknown-linux-gnu/lib/librustc_std_workspace_core-5e0675f526ef5c6b.rlib" "/usr/lib/rustlib/x86_64-unknown-linux-gnu/lib/libcore-3375e4f89d420e7a.rlib" "-Wl,--end-group" "/usr/lib/rustlib/x86_64-unknown-linux-gnu/lib/libcompiler_builtins-f74b197469e67088.rlib" "-Wl,-Bdynamic" "-lgcc_s" "-lc" "-lm" "-lrt" "-lpthread" "-lutil" "-ldl" "-lutil"
try.c:   = note: /usr/bin/ld: cannot find -lcpucycles
try.c:           collect2: error: ld returned 1 exit status
try.c:
try.c:
try.c: error: aborting due to previous error
try.c:
try.c: error: could not compile `crypto_scalarmult_curve25519`.
try.c:
try.c: To learn more, run the command again with --verbose.

Number of similar (implementation,compiler) pairs: 1, namely:
ImplementationCompiler
rust_cryptogcc -march=native -mtune=native -O3 -fwrapv -fPIC -fPIE -gdwarf-4 -Wall (10.2.1_20210110)

Compiler output


try.c: error: linking with `cc` failed: exit code: 1
try.c:   |
try.c:   = note: "cc" "-Wl,--as-needed" "-Wl,-z,noexecstack" "-m64" "-Wl,--eh-frame-hdr" "-L" "/usr/lib/rustlib/x86_64-unknown-linux-gnu/lib" ".../supercop-data/alder2,1f626960,3300000/amd64/try/c/gcc_-march=native_-mtune=native_-O_-fwrapv_-fPIC_-fPIE_-gdwarf-4_-Wall/constbranchindex/crypto_scalarmult/curve25519/rust_crypto/work/target/release/deps/try-ee480e045ac5bf28.try.11q4nylm-cgu.0.rcgu.o" ".../supercop-data/alder2,1f626960,3300000/amd64/try/c/gcc_-march=native_-mtune=native_-O_-fwrapv_-fPIC_-fPIE_-gdwarf-4_-Wall/constbranchindex/crypto_scalarmult/curve25519/rust_crypto/work/target/release/deps/try-ee480e045ac5bf28.try.11q4nylm-cgu.1.rcgu.o" ".../supercop-data/alder2,1f626960,3300000/amd64/try/c/gcc_-march=native_-mtune=native_-O_-fwrapv_-fPIC_-fPIE_-gdwarf-4_-Wall/constbranchindex/crypto_scalarmult/curve25519/rust_crypto/work/target/release/deps/try-ee480e045ac5bf28.try.11q4nylm-cgu.2.rcgu.o" ".../supercop-data/alder2,1f626960,3300000/amd64/try/c/gcc_-march=native_-mtune=native_-O_-fwrapv_-fPIC_-fPIE_-gdwarf-4_-Wall/constbranchindex/crypto_scalarmult/curve25519/rust_crypto/work/target/release/deps/try-ee480e045ac5bf28.try.11q4nylm-cgu.3.rcgu.o" ".../supercop-data/alder2,1f626960,3300000/amd64/try/c/gcc_-march=native_-mtune=native_-O_-fwrapv_-fPIC_-fPIE_-gdwarf-4_-Wall/constbranchindex/crypto_scalarmult/curve25519/rust_crypto/work/target/release/deps/try-ee480e045ac5bf28.try.11q4nylm-cgu.4.rcgu.o" "-o" ".../supercop-data/alder2,1f626960,3300000/amd64/try/c/gcc_-march=native_-mtune=native_-O_-fwrapv_-fPIC_-fPIE_-gdwarf-4_-Wall/constbranchindex/crypto_scalarmult/curve25519/rust_crypto/work/target/release/deps/try-ee480e045ac5bf28" ".../supercop-data/alder2,1f626960,3300000/amd64/try/c/gcc_-march=native_-mtune=native_-O_-fwrapv_-fPIC_-fPIE_-gdwarf-4_-Wall/constbranchindex/crypto_scalarmult/curve25519/rust_crypto/work/target/release/deps/try-ee480e045ac5bf28.24am9u1fm0gh21g5.rcgu.o" "-Wl,--gc-sections" "-pie" "-Wl,-zrelro" "-Wl,-znow" "-Wl,-O1" "-nodefaultlibs" "-L" ".../supercop-data/alder2,1f626960,3300000/amd64/try/c/gcc_-march=native_-mtune=native_-O_-fwrapv_-fPIC_-fPIE_-gdwarf-4_-Wall/constbranchindex/crypto_scalarmult/curve25519/rust_crypto/work/target/release/deps" "-L" ".../supercop-data/alder2,1f626960,3300000/amd64/lib" "-L" ".../supercop-data/alder2,1f626960,3300000/amd64/try/c/gcc_-march=native_-mtune=native_-O_-fwrapv_-fPIC_-fPIE_-gdwarf-4_-Wall/constbranchindex/crypto_scalarmult/curve25519/rust_crypto/work/target/release/build/crypto_scalarmult_curve25519-d006c1bfefb27d9f/out" "-L" ".../supercop-data/alder2,1f626960,3300000/amd64/try/c/gcc_-march=native_-mtune=native_-O_-fwrapv_-fPIC_-fPIE_-gdwarf-4_-Wall/constbranchindex/crypto_scalarmult/curve25519/rust_crypto/work/target/release/build/rust-crypto-afe9b4ff19c80bbc/out" "-L" "/usr/lib/rustlib/x86_64-unknown-linux-gnu/lib" "-ltry-anything" "-ltry" "-lknownrandombytes" "-lsupercop" "-lkernelrandombytes" "-lcpucycles" "-lcrypto" "-lnsl" "-lm" "-Wl,-Bstatic" ".../supercop-data/alder2,1f626960,3300000/amd64/try/c/gcc_-march=native_-mtune=native_-O_-fwrapv_-fPIC_-fPIE_-gdwarf-4_-Wall/constbranchindex/crypto_scalarmult/curve25519/rust_crypto/work/target/release/deps/libcrypto_scalarmult_curve25519-6422eef6e46a1f1b.rlib" ".../supercop-data/alder2,1f626960,3300000/amd64/try/c/gcc_-march=native_-mtune=native_-O_-fwrapv_-fPIC_-fPIE_-gdwarf-4_-Wall/constbranchindex/crypto_scalarmult/curve25519/rust_crypto/work/target/release/deps/libcrypto-83ceebf3c7290f98.rlib" ".../supercop-data/alder2,1f626960,3300000/amd64/try/c/gcc_-march=native_-mtune=native_-O_-fwrapv_-fPIC_-fPIE_-gdwarf-4_-Wall/constbranchindex/crypto_scalarmult/curve25519/rust_crypto/work/target/release/deps/libtime-b473882f9f54487c.rlib" ".../supercop-data/alder2,1f626960,3300000/amd64/try/c/gcc_-march=native_-mtune=native_-O_-fwrapv_-fPIC_-fPIE_-gdwarf-4_-Wall/constbranchindex/crypto_scalarmult/curve25519/rust_crypto/work/target/release/deps/librustc_serialize-72942cfdca4fb518.rlib" ".../supercop-data/alder2,1f626960,3300000/amd64/try/c/gcc_-march=native_-mtune=native_-O_-fwrapv_-fPIC_-fPIE_-gdwarf-4_-Wall/constbranchindex/crypto_scalarmult/curve25519/rust_crypto/work/target/release/deps/librand-2cdf248a3f2ca473.rlib" ".../supercop-data/alder2,1f626960,3300000/amd64/try/c/gcc_-march=native_-mtune=native_-O_-fwrapv_-fPIC_-fPIE_-gdwarf-4_-Wall/constbranchindex/crypto_scalarmult/curve25519/rust_crypto/work/target/release/deps/librand-7df229a95dbcb448.rlib" ".../supercop-data/alder2,1f626960,3300000/amd64/try/c/gcc_-march=native_-mtune=native_-O_-fwrapv_-fPIC_-fPIE_-gdwarf-4_-Wall/constbranchindex/crypto_scalarmult/curve25519/rust_crypto/work/target/release/deps/liblibc-141c671f2ddc755d.rlib" "-Wl,--start-group" "/usr/lib/rustlib/x86_64-unknown-linux-gnu/lib/libstd-6bf3f16f340782ca.rlib" "/usr/lib/rustlib/x86_64-unknown-linux-gnu/lib/libpanic_unwind-13f3099d50c21bc6.rlib" "/usr/lib/rustlib/x86_64-unknown-linux-gnu/lib/libminiz_oxide-a2ba33c985785afe.rlib" "/usr/lib/rustlib/x86_64-unknown-linux-gnu/lib/libadler-3f6e9f8f4afbea6d.rlib" "/usr/lib/rustlib/x86_64-unknown-linux-gnu/lib/libobject-af517d7f13e7c960.rlib" "/usr/lib/rustlib/x86_64-unknown-linux-gnu/lib/libaddr2line-12740563628e601f.rlib" "/usr/lib/rustlib/x86_64-unknown-linux-gnu/lib/libgimli-0ac82a1e1820dd21.rlib" "/usr/lib/rustlib/x86_64-unknown-linux-gnu/lib/librustc_demangle-3ac2d0878c297d42.rlib" "/usr/lib/rustlib/x86_64-unknown-linux-gnu/lib/libhashbrown-c6632ca171f954dd.rlib" "/usr/lib/rustlib/x86_64-unknown-linux-gnu/lib/librustc_std_workspace_alloc-b5bfd0198c7b740d.rlib" "/usr/lib/rustlib/x86_64-unknown-linux-gnu/lib/libunwind-bd645b20c6c7b56d.rlib" "/usr/lib/rustlib/x86_64-unknown-linux-gnu/lib/libcfg_if-b9e1e523c0c29a77.rlib" "/usr/lib/rustlib/x86_64-unknown-linux-gnu/lib/liblibc-dfbef8c525de0186.rlib" "/usr/lib/rustlib/x86_64-unknown-linux-gnu/lib/liballoc-1ebf406bd4ea5769.rlib" "/usr/lib/rustlib/x86_64-unknown-linux-gnu/lib/librustc_std_workspace_core-5e0675f526ef5c6b.rlib" "/usr/lib/rustlib/x86_64-unknown-linux-gnu/lib/libcore-3375e4f89d420e7a.rlib" "-Wl,--end-group" "/usr/lib/rustlib/x86_64-unknown-linux-gnu/lib/libcompiler_builtins-f74b197469e67088.rlib" "-Wl,-Bdynamic" "-lgcc_s" "-lc" "-lm" "-lrt" "-lpthread" "-lutil" "-ldl" "-lutil"
try.c:   = note: /usr/bin/ld: cannot find -lcpucycles
try.c:           collect2: error: ld returned 1 exit status
try.c:
try.c:
try.c: error: aborting due to previous error
try.c:
try.c: error: could not compile `crypto_scalarmult_curve25519`.
try.c:
try.c: To learn more, run the command again with --verbose.

Number of similar (implementation,compiler) pairs: 1, namely:
ImplementationCompiler
rust_cryptogcc -march=native -mtune=native -O -fwrapv -fPIC -fPIE -gdwarf-4 -Wall (10.2.1_20210110)

Compiler output


try.c: error: linking with `cc` failed: exit code: 1
try.c:   |
try.c:   = note: "cc" "-Wl,--as-needed" "-Wl,-z,noexecstack" "-m64" "-Wl,--eh-frame-hdr" "-L" "/usr/lib/rustlib/x86_64-unknown-linux-gnu/lib" ".../supercop-data/alder2,1f626960,3300000/amd64/try/c/gcc_-march=native_-mtune=native_-Os_-fwrapv_-fPIC_-fPIE_-gdwarf-4_-Wall/constbranchindex/crypto_scalarmult/curve25519/rust_crypto/work/target/release/deps/try_small-d887ad352f24cb89.try_small.7i0lr38s-cgu.0.rcgu.o" ".../supercop-data/alder2,1f626960,3300000/amd64/try/c/gcc_-march=native_-mtune=native_-Os_-fwrapv_-fPIC_-fPIE_-gdwarf-4_-Wall/constbranchindex/crypto_scalarmult/curve25519/rust_crypto/work/target/release/deps/try_small-d887ad352f24cb89.try_small.7i0lr38s-cgu.1.rcgu.o" ".../supercop-data/alder2,1f626960,3300000/amd64/try/c/gcc_-march=native_-mtune=native_-Os_-fwrapv_-fPIC_-fPIE_-gdwarf-4_-Wall/constbranchindex/crypto_scalarmult/curve25519/rust_crypto/work/target/release/deps/try_small-d887ad352f24cb89.try_small.7i0lr38s-cgu.2.rcgu.o" ".../supercop-data/alder2,1f626960,3300000/amd64/try/c/gcc_-march=native_-mtune=native_-Os_-fwrapv_-fPIC_-fPIE_-gdwarf-4_-Wall/constbranchindex/crypto_scalarmult/curve25519/rust_crypto/work/target/release/deps/try_small-d887ad352f24cb89.try_small.7i0lr38s-cgu.3.rcgu.o" ".../supercop-data/alder2,1f626960,3300000/amd64/try/c/gcc_-march=native_-mtune=native_-Os_-fwrapv_-fPIC_-fPIE_-gdwarf-4_-Wall/constbranchindex/crypto_scalarmult/curve25519/rust_crypto/work/target/release/deps/try_small-d887ad352f24cb89.try_small.7i0lr38s-cgu.4.rcgu.o" "-o" ".../supercop-data/alder2,1f626960,3300000/amd64/try/c/gcc_-march=native_-mtune=native_-Os_-fwrapv_-fPIC_-fPIE_-gdwarf-4_-Wall/constbranchindex/crypto_scalarmult/curve25519/rust_crypto/work/target/release/deps/try_small-d887ad352f24cb89" ".../supercop-data/alder2,1f626960,3300000/amd64/try/c/gcc_-march=native_-mtune=native_-Os_-fwrapv_-fPIC_-fPIE_-gdwarf-4_-Wall/constbranchindex/crypto_scalarmult/curve25519/rust_crypto/work/target/release/deps/try_small-d887ad352f24cb89.2oefsontexx9vrvo.rcgu.o" "-Wl,--gc-sections" "-pie" "-Wl,-zrelro" "-Wl,-znow" "-Wl,-O1" "-nodefaultlibs" "-L" ".../supercop-data/alder2,1f626960,3300000/amd64/try/c/gcc_-march=native_-mtune=native_-Os_-fwrapv_-fPIC_-fPIE_-gdwarf-4_-Wall/constbranchindex/crypto_scalarmult/curve25519/rust_crypto/work/target/release/deps" "-L" ".../supercop-data/alder2,1f626960,3300000/amd64/lib" "-L" ".../supercop-data/alder2,1f626960,3300000/amd64/try/c/gcc_-march=native_-mtune=native_-Os_-fwrapv_-fPIC_-fPIE_-gdwarf-4_-Wall/constbranchindex/crypto_scalarmult/curve25519/rust_crypto/work/target/release/build/crypto_scalarmult_curve25519-d006c1bfefb27d9f/out" "-L" ".../supercop-data/alder2,1f626960,3300000/amd64/try/c/gcc_-march=native_-mtune=native_-Os_-fwrapv_-fPIC_-fPIE_-gdwarf-4_-Wall/constbranchindex/crypto_scalarmult/curve25519/rust_crypto/work/target/release/build/rust-crypto-afe9b4ff19c80bbc/out" "-L" "/usr/lib/rustlib/x86_64-unknown-linux-gnu/lib" "-ltry-anything" "-ltry-small" "-lknownrandombytes" "-lsupercop" "-lkernelrandombytes" "-lcpucycles" "-lcrypto" "-lnsl" "-lm" "-Wl,-Bstatic" ".../supercop-data/alder2,1f626960,3300000/amd64/try/c/gcc_-march=native_-mtune=native_-Os_-fwrapv_-fPIC_-fPIE_-gdwarf-4_-Wall/constbranchindex/crypto_scalarmult/curve25519/rust_crypto/work/target/release/deps/libcrypto_scalarmult_curve25519-6422eef6e46a1f1b.rlib" ".../supercop-data/alder2,1f626960,3300000/amd64/try/c/gcc_-march=native_-mtune=native_-Os_-fwrapv_-fPIC_-fPIE_-gdwarf-4_-Wall/constbranchindex/crypto_scalarmult/curve25519/rust_crypto/work/target/release/deps/libcrypto-83ceebf3c7290f98.rlib" ".../supercop-data/alder2,1f626960,3300000/amd64/try/c/gcc_-march=native_-mtune=native_-Os_-fwrapv_-fPIC_-fPIE_-gdwarf-4_-Wall/constbranchindex/crypto_scalarmult/curve25519/rust_crypto/work/target/release/deps/libtime-b473882f9f54487c.rlib" ".../supercop-data/alder2,1f626960,3300000/amd64/try/c/gcc_-march=native_-mtune=native_-Os_-fwrapv_-fPIC_-fPIE_-gdwarf-4_-Wall/constbranchindex/crypto_scalarmult/curve25519/rust_crypto/work/target/release/deps/librustc_serialize-72942cfdca4fb518.rlib" ".../supercop-data/alder2,1f626960,3300000/amd64/try/c/gcc_-march=native_-mtune=native_-Os_-fwrapv_-fPIC_-fPIE_-gdwarf-4_-Wall/constbranchindex/crypto_scalarmult/curve25519/rust_crypto/work/target/release/deps/librand-2cdf248a3f2ca473.rlib" ".../supercop-data/alder2,1f626960,3300000/amd64/try/c/gcc_-march=native_-mtune=native_-Os_-fwrapv_-fPIC_-fPIE_-gdwarf-4_-Wall/constbranchindex/crypto_scalarmult/curve25519/rust_crypto/work/target/release/deps/librand-7df229a95dbcb448.rlib" ".../supercop-data/alder2,1f626960,3300000/amd64/try/c/gcc_-march=native_-mtune=native_-Os_-fwrapv_-fPIC_-fPIE_-gdwarf-4_-Wall/constbranchindex/crypto_scalarmult/curve25519/rust_crypto/work/target/release/deps/liblibc-141c671f2ddc755d.rlib" "-Wl,--start-group" "/usr/lib/rustlib/x86_64-unknown-linux-gnu/lib/libstd-6bf3f16f340782ca.rlib" "/usr/lib/rustlib/x86_64-unknown-linux-gnu/lib/libpanic_unwind-13f3099d50c21bc6.rlib" "/usr/lib/rustlib/x86_64-unknown-linux-gnu/lib/libminiz_oxide-a2ba33c985785afe.rlib" "/usr/lib/rustlib/x86_64-unknown-linux-gnu/lib/libadler-3f6e9f8f4afbea6d.rlib" "/usr/lib/rustlib/x86_64-unknown-linux-gnu/lib/libobject-af517d7f13e7c960.rlib" "/usr/lib/rustlib/x86_64-unknown-linux-gnu/lib/libaddr2line-12740563628e601f.rlib" "/usr/lib/rustlib/x86_64-unknown-linux-gnu/lib/libgimli-0ac82a1e1820dd21.rlib" "/usr/lib/rustlib/x86_64-unknown-linux-gnu/lib/librustc_demangle-3ac2d0878c297d42.rlib" "/usr/lib/rustlib/x86_64-unknown-linux-gnu/lib/libhashbrown-c6632ca171f954dd.rlib" "/usr/lib/rustlib/x86_64-unknown-linux-gnu/lib/librustc_std_workspace_alloc-b5bfd0198c7b740d.rlib" "/usr/lib/rustlib/x86_64-unknown-linux-gnu/lib/libunwind-bd645b20c6c7b56d.rlib" "/usr/lib/rustlib/x86_64-unknown-linux-gnu/lib/libcfg_if-b9e1e523c0c29a77.rlib" "/usr/lib/rustlib/x86_64-unknown-linux-gnu/lib/liblibc-dfbef8c525de0186.rlib" "/usr/lib/rustlib/x86_64-unknown-linux-gnu/lib/liballoc-1ebf406bd4ea5769.rlib" "/usr/lib/rustlib/x86_64-unknown-linux-gnu/lib/librustc_std_workspace_core-5e0675f526ef5c6b.rlib" "/usr/lib/rustlib/x86_64-unknown-linux-gnu/lib/libcore-3375e4f89d420e7a.rlib" "-Wl,--end-group" "/usr/lib/rustlib/x86_64-unknown-linux-gnu/lib/libcompiler_builtins-f74b197469e67088.rlib" "-Wl,-Bdynamic" "-lgcc_s" "-lc" "-lm" "-lrt" "-lpthread" "-lutil" "-ldl" "-lutil"
try.c:   = note: /usr/bin/ld: cannot find -lcpucycles
try.c:           collect2: error: ld returned 1 exit status
try.c:
try.c:
try.c: error: aborting due to previous error
try.c:
try.c: error: could not compile `crypto_scalarmult_curve25519`.
try.c:
try.c: To learn more, run the command again with --verbose.

Number of similar (implementation,compiler) pairs: 1, namely:
ImplementationCompiler
rust_cryptogcc -march=native -mtune=native -Os -fwrapv -fPIC -fPIE -gdwarf-4 -Wall (10.2.1_20210110)

Passed TIMECOP


TIMECOP iterations: 10

Number of similar (implementation,compiler) pairs: 62, namely:
ImplementationCompiler
amd64-51clang -march=native -O2 -fwrapv -Qunused-arguments -fPIC -fPIE -gdwarf-4 -Wall (Debian_Clang_11.0.1)
amd64-51clang -march=native -O3 -fwrapv -Qunused-arguments -fPIC -fPIE -gdwarf-4 -Wall (Debian_Clang_11.0.1)
amd64-51clang -march=native -O -fwrapv -Qunused-arguments -fPIC -fPIE -gdwarf-4 -Wall (Debian_Clang_11.0.1)
amd64-51clang -march=native -Os -fwrapv -Qunused-arguments -fPIC -fPIE -gdwarf-4 -Wall (Debian_Clang_11.0.1)
amd64-51clang -mcpu=native -O3 -fwrapv -Qunused-arguments -fPIC -fPIE -gdwarf-4 -Wall (Debian_Clang_11.0.1)
amd64-51gcc -march=native -mtune=native -O2 -fwrapv -fPIC -fPIE -gdwarf-4 -Wall (10.2.1_20210110)
amd64-51gcc -march=native -mtune=native -O3 -fwrapv -fPIC -fPIE -gdwarf-4 -Wall (10.2.1_20210110)
amd64-51gcc -march=native -mtune=native -O -fwrapv -fPIC -fPIE -gdwarf-4 -Wall (10.2.1_20210110)
amd64-51gcc -march=native -mtune=native -Os -fwrapv -fPIC -fPIE -gdwarf-4 -Wall (10.2.1_20210110)
amd64-64clang -march=native -O2 -fwrapv -Qunused-arguments -fPIC -fPIE -gdwarf-4 -Wall (Debian_Clang_11.0.1)
amd64-64clang -march=native -O3 -fwrapv -Qunused-arguments -fPIC -fPIE -gdwarf-4 -Wall (Debian_Clang_11.0.1)
amd64-64clang -march=native -O -fwrapv -Qunused-arguments -fPIC -fPIE -gdwarf-4 -Wall (Debian_Clang_11.0.1)
amd64-64clang -march=native -Os -fwrapv -Qunused-arguments -fPIC -fPIE -gdwarf-4 -Wall (Debian_Clang_11.0.1)
amd64-64clang -mcpu=native -O3 -fwrapv -Qunused-arguments -fPIC -fPIE -gdwarf-4 -Wall (Debian_Clang_11.0.1)
amd64-64gcc -march=native -mtune=native -O2 -fwrapv -fPIC -fPIE -gdwarf-4 -Wall (10.2.1_20210110)
amd64-64gcc -march=native -mtune=native -O3 -fwrapv -fPIC -fPIE -gdwarf-4 -Wall (10.2.1_20210110)
amd64-64gcc -march=native -mtune=native -O -fwrapv -fPIC -fPIE -gdwarf-4 -Wall (10.2.1_20210110)
amd64-64gcc -march=native -mtune=native -Os -fwrapv -fPIC -fPIE -gdwarf-4 -Wall (10.2.1_20210110)
donnaclang -march=native -O2 -fwrapv -Qunused-arguments -fPIC -fPIE -gdwarf-4 -Wall (Debian_Clang_11.0.1)
donnaclang -march=native -O3 -fwrapv -Qunused-arguments -fPIC -fPIE -gdwarf-4 -Wall (Debian_Clang_11.0.1)
donnaclang -march=native -O -fwrapv -Qunused-arguments -fPIC -fPIE -gdwarf-4 -Wall (Debian_Clang_11.0.1)
donnaclang -march=native -Os -fwrapv -Qunused-arguments -fPIC -fPIE -gdwarf-4 -Wall (Debian_Clang_11.0.1)
donnagcc -march=native -mtune=native -O2 -fwrapv -fPIC -fPIE -gdwarf-4 -Wall (10.2.1_20210110)
donnagcc -march=native -mtune=native -O3 -fwrapv -fPIC -fPIE -gdwarf-4 -Wall (10.2.1_20210110)
donnagcc -march=native -mtune=native -O -fwrapv -fPIC -fPIE -gdwarf-4 -Wall (10.2.1_20210110)
donnagcc -march=native -mtune=native -Os -fwrapv -fPIC -fPIE -gdwarf-4 -Wall (10.2.1_20210110)
donna_c64clang -march=native -O2 -fwrapv -Qunused-arguments -fPIC -fPIE -gdwarf-4 -Wall (Debian_Clang_11.0.1)
donna_c64clang -march=native -O3 -fwrapv -Qunused-arguments -fPIC -fPIE -gdwarf-4 -Wall (Debian_Clang_11.0.1)
donna_c64clang -march=native -O -fwrapv -Qunused-arguments -fPIC -fPIE -gdwarf-4 -Wall (Debian_Clang_11.0.1)
donna_c64clang -march=native -Os -fwrapv -Qunused-arguments -fPIC -fPIE -gdwarf-4 -Wall (Debian_Clang_11.0.1)
donna_c64clang -mcpu=native -O3 -fwrapv -Qunused-arguments -fPIC -fPIE -gdwarf-4 -Wall (Debian_Clang_11.0.1)
donna_c64gcc -march=native -mtune=native -O2 -fwrapv -fPIC -fPIE -gdwarf-4 -Wall (10.2.1_20210110)
donna_c64gcc -march=native -mtune=native -O3 -fwrapv -fPIC -fPIE -gdwarf-4 -Wall (10.2.1_20210110)
donna_c64gcc -march=native -mtune=native -O -fwrapv -fPIC -fPIE -gdwarf-4 -Wall (10.2.1_20210110)
donna_c64gcc -march=native -mtune=native -Os -fwrapv -fPIC -fPIE -gdwarf-4 -Wall (10.2.1_20210110)
refclang -march=native -O2 -fwrapv -Qunused-arguments -fPIC -fPIE -gdwarf-4 -Wall (Debian_Clang_11.0.1)
refclang -march=native -O3 -fwrapv -Qunused-arguments -fPIC -fPIE -gdwarf-4 -Wall (Debian_Clang_11.0.1)
refclang -march=native -O -fwrapv -Qunused-arguments -fPIC -fPIE -gdwarf-4 -Wall (Debian_Clang_11.0.1)
refclang -march=native -Os -fwrapv -Qunused-arguments -fPIC -fPIE -gdwarf-4 -Wall (Debian_Clang_11.0.1)
refclang -mcpu=native -O3 -fwrapv -Qunused-arguments -fPIC -fPIE -gdwarf-4 -Wall (Debian_Clang_11.0.1)
refgcc -march=native -mtune=native -O2 -fwrapv -fPIC -fPIE -gdwarf-4 -Wall (10.2.1_20210110)
refgcc -march=native -mtune=native -O3 -fwrapv -fPIC -fPIE -gdwarf-4 -Wall (10.2.1_20210110)
refgcc -march=native -mtune=native -O -fwrapv -fPIC -fPIE -gdwarf-4 -Wall (10.2.1_20210110)
refgcc -march=native -mtune=native -Os -fwrapv -fPIC -fPIE -gdwarf-4 -Wall (10.2.1_20210110)
ref10clang -march=native -O2 -fwrapv -Qunused-arguments -fPIC -fPIE -gdwarf-4 -Wall (Debian_Clang_11.0.1)
ref10clang -march=native -O3 -fwrapv -Qunused-arguments -fPIC -fPIE -gdwarf-4 -Wall (Debian_Clang_11.0.1)
ref10clang -march=native -O -fwrapv -Qunused-arguments -fPIC -fPIE -gdwarf-4 -Wall (Debian_Clang_11.0.1)
ref10clang -march=native -Os -fwrapv -Qunused-arguments -fPIC -fPIE -gdwarf-4 -Wall (Debian_Clang_11.0.1)
ref10clang -mcpu=native -O3 -fwrapv -Qunused-arguments -fPIC -fPIE -gdwarf-4 -Wall (Debian_Clang_11.0.1)
ref10gcc -march=native -mtune=native -O2 -fwrapv -fPIC -fPIE -gdwarf-4 -Wall (10.2.1_20210110)
ref10gcc -march=native -mtune=native -O3 -fwrapv -fPIC -fPIE -gdwarf-4 -Wall (10.2.1_20210110)
ref10gcc -march=native -mtune=native -O -fwrapv -fPIC -fPIE -gdwarf-4 -Wall (10.2.1_20210110)
ref10gcc -march=native -mtune=native -Os -fwrapv -fPIC -fPIE -gdwarf-4 -Wall (10.2.1_20210110)
sandy2xclang -march=native -O2 -fwrapv -Qunused-arguments -fPIC -fPIE -gdwarf-4 -Wall (Debian_Clang_11.0.1)
sandy2xclang -march=native -O3 -fwrapv -Qunused-arguments -fPIC -fPIE -gdwarf-4 -Wall (Debian_Clang_11.0.1)
sandy2xclang -march=native -O -fwrapv -Qunused-arguments -fPIC -fPIE -gdwarf-4 -Wall (Debian_Clang_11.0.1)
sandy2xclang -march=native -Os -fwrapv -Qunused-arguments -fPIC -fPIE -gdwarf-4 -Wall (Debian_Clang_11.0.1)
sandy2xclang -mcpu=native -O3 -fwrapv -Qunused-arguments -fPIC -fPIE -gdwarf-4 -Wall (Debian_Clang_11.0.1)
sandy2xgcc -march=native -mtune=native -O2 -fwrapv -fPIC -fPIE -gdwarf-4 -Wall (10.2.1_20210110)
sandy2xgcc -march=native -mtune=native -O3 -fwrapv -fPIC -fPIE -gdwarf-4 -Wall (10.2.1_20210110)
sandy2xgcc -march=native -mtune=native -O -fwrapv -fPIC -fPIE -gdwarf-4 -Wall (10.2.1_20210110)
sandy2xgcc -march=native -mtune=native -Os -fwrapv -fPIC -fPIE -gdwarf-4 -Wall (10.2.1_20210110)