Test results for amd64, alder, crypto_kem/ramstakers216091
[Page version: 20250418 21:20:05]
Measurements for amd64, alder, crypto_kem
Test results for amd64, alder, crypto_kem
Test results for crypto_kem/ramstakers216091
Computer: alder
Microarchitecture: amd64; Golden Cove (90675-00)
Architecture: amd64
CPU ID: GenuineIntel-00090675-00-bfebfbff
SUPERCOP version: 20250415
Operation: crypto_kem
Primitive: ramstakers216091
Compiler output
csprng.c: csprng.c:44:38: warning: incompatible pointer types passing 'unsigned char[200]' to parameter of type 'KeccakP1600_plain64_state *' [-Wincompatible-pointer-types]
csprng.c: 44 | KeccakP1600_Permute_24rounds(rng->state);
csprng.c: | ^~~~~~~~~~
csprng.c: .../supercop-data/alder/amd64/include/libkeccak.a.headers/KeccakP-1600-SnP.h:53:62: note: passing argument to parameter 'state' here
csprng.c: 53 | void KeccakP1600_Permute_24rounds(KeccakP1600_plain64_state *state);
csprng.c: | ^
csprng.c: csprng.c:52:34: warning: incompatible pointer types passing 'unsigned char[200]' to parameter of type 'KeccakP1600_plain64_state *' [-Wincompatible-pointer-types]
csprng.c: 52 | KeccakP1600_Permute_24rounds(rng->state);
csprng.c: | ^~~~~~~~~~
csprng.c: .../supercop-data/alder/amd64/include/libkeccak.a.headers/KeccakP-1600-SnP.h:53:62: note: passing argument to parameter 'state' here
csprng.c: 53 | void KeccakP1600_Permute_24rounds(KeccakP1600_plain64_state *state);
csprng.c: | ^
csprng.c: csprng.c:78:38: warning: incompatible pointer types passing 'unsigned char[200]' to parameter of type 'KeccakP1600_plain64_state *' [-Wincompatible-pointer-types]
csprng.c: 78 | KeccakP1600_Permute_24rounds(rng->state);
csprng.c: | ^~~~~~~~~~
csprng.c: .../supercop-data/alder/amd64/include/libkeccak.a.headers/KeccakP-1600-SnP.h:53:62: note: passing argument to parameter 'state' here
csprng.c: 53 | void KeccakP1600_Permute_24rounds(KeccakP1600_plain64_state *state);
csprng.c: | ^
csprng.c: csprng.c:85:34: warning: incompatible pointer types passing 'unsigned char[200]' to parameter of type 'KeccakP1600_plain64_state *' [-Wincompatible-pointer-types]
csprng.c: 85 | KeccakP1600_Permute_24rounds(rng->state);
csprng.c: | ^~~~~~~~~~
csprng.c: .../supercop-data/alder/amd64/include/libkeccak.a.headers/KeccakP-1600-SnP.h:53:62: note: passing argument to parameter 'state' here
csprng.c: 53 | void KeccakP1600_Permute_24rounds(KeccakP1600_plain64_state *state);
csprng.c: | ^
csprng.c: 4 warnings generated.
try.c: /usr/bin/ld: libcrypto_kem_ramstakers216091.a(ramstake.o): in function `ramstake_keygen':
try.c: .../supercop-data/alder/amd64/try/c/clang_-march=native_-O2_-fwrapv_-Qunused-arguments_-fPIC_-fPIE_-gdwarf-4_-Wall/timingleaks/crypto_kem/ramstakers216091/ref/work/ramstake.c:35:(.text+0x...): undefined reference to `SHAKE256'
try.c: /usr/bin/ld: libcrypto_kem_ramstakers216091.a(ramstake.o): in function `ramstake_generate_g':
try.c: .../supercop-data/alder/amd64/try/c/clang_-march=native_-O2_-fwrapv_-Qunused-arguments_-fPIC_-fPIE_-gdwarf-4_-Wall/timingleaks/crypto_kem/ramstakers216091/ref/work/ramstake.c:579:(.text+0x...): undefined reference to `SHAKE256'
try.c: /usr/bin/ld: .../supercop-data/alder/amd64/try/c/clang_-march=native_-O2_-fwrapv_-Qunused-arguments_-fPIC_-fPIE_-gdwarf-4_-Wall/timingleaks/crypto_kem/ramstakers216091/ref/work/ramstake.c:579:(.text+0x...): undefined reference to `SHAKE256'
try.c: /usr/bin/ld: libcrypto_kem_ramstakers216091.a(ramstake.o): in function `ramstake_encaps':
try.c: .../supercop-data/alder/amd64/try/c/clang_-march=native_-O2_-fwrapv_-Qunused-arguments_-fPIC_-fPIE_-gdwarf-4_-Wall/timingleaks/crypto_kem/ramstakers216091/ref/work/ramstake.c:136:(.text+0x...): undefined reference to `SHAKE256'
try.c: /usr/bin/ld: libcrypto_kem_ramstakers216091.a(ramstake.o): in function `ramstake_generate_g':
try.c: .../supercop-data/alder/amd64/try/c/clang_-march=native_-O2_-fwrapv_-Qunused-arguments_-fPIC_-fPIE_-gdwarf-4_-Wall/timingleaks/crypto_kem/ramstakers216091/ref/work/ramstake.c:579:(.text+0x...): undefined reference to `SHAKE256'
try.c: /usr/bin/ld: libcrypto_kem_ramstakers216091.a(ramstake.o): in function `ramstake_encaps':
try.c: .../supercop-data/alder/amd64/try/c/clang_-march=native_-O2_-fwrapv_-Qunused-arguments_-fPIC_-fPIE_-gdwarf-4_-Wall/timingleaks/crypto_kem/ramstakers216091/ref/work/ramstake.c:263:(.text+0x...): undefined reference to `SHA3_256'
try.c: /usr/bin/ld: .../supercop-data/alder/amd64/try/c/clang_-march=native_-O2_-fwrapv_-Qunused-arguments_-fPIC_-fPIE_-gdwarf-4_-Wall/timingleaks/crypto_kem/ramstakers216091/ref/work/ramstake.c:263:(.text+0x...): undefined reference to `SHA3_256'
try.c: /usr/bin/ld: .../supercop-data/alder/amd64/try/c/clang_-march=native_-O2_-fwrapv_-Qunused-arguments_-fPIC_-fPIE_-gdwarf-4_-Wall/timingleaks/crypto_kem/ramstakers216091/ref/work/ramstake.c:308:(.text+0x...): undefined reference to `SHA3_256'
try.c: /usr/bin/ld: libcrypto_kem_ramstakers216091.a(ramstake.o): in function `ramstake_decaps':
try.c: .../supercop-data/alder/amd64/try/c/clang_-march=native_-O2_-fwrapv_-Qunused-arguments_-fPIC_-fPIE_-gdwarf-4_-Wall/timingleaks/crypto_kem/ramstakers216091/ref/work/ramstake.c:359:(.text+0x...): undefined reference to `SHAKE256'
try.c: /usr/bin/ld: libcrypto_kem_ramstakers216091.a(ramstake.o): in function `ramstake_generate_g':
try.c: .../supercop-data/alder/amd64/try/c/clang_-march=native_-O2_-fwrapv_-Qunused-arguments_-fPIC_-fPIE_-gdwarf-4_-Wall/timingleaks/crypto_kem/ramstakers216091/ref/work/ramstake.c:579:(.text+0x...): undefined reference to `SHAKE256'
try.c: /usr/bin/ld: libcrypto_kem_ramstakers216091.a(codec_rs.o): in function `codec_rs_decode':
try.c: .../supercop-data/alder/amd64/try/c/clang_-march=native_-O2_-fwrapv_-Qunused-arguments_-fPIC_-fPIE_-gdwarf-4_-Wall/timingleaks/crypto_kem/ramstakers216091/ref/work/codec_rs.c:64:(.text+0x...): undefined reference to `SHA3_256'
try.c: clang: error: linker command failed with exit code 1 (use -v to see invocation)
Number of similar (implementation,compiler) pairs: 1, namely:
Implementation | Compiler |
T:ref | clang -march=native -O2 -fwrapv -Qunused-arguments -fPIC -fPIE -gdwarf-4 -Wall (Debian_Clang_19.1.7_(3)) |
Compiler output
csprng.c: csprng.c:44:38: warning: incompatible pointer types passing 'unsigned char[200]' to parameter of type 'KeccakP1600_plain64_state *' [-Wincompatible-pointer-types]
csprng.c: 44 | KeccakP1600_Permute_24rounds(rng->state);
csprng.c: | ^~~~~~~~~~
csprng.c: .../supercop-data/alder/amd64/include/libkeccak.a.headers/KeccakP-1600-SnP.h:53:62: note: passing argument to parameter 'state' here
csprng.c: 53 | void KeccakP1600_Permute_24rounds(KeccakP1600_plain64_state *state);
csprng.c: | ^
csprng.c: csprng.c:52:34: warning: incompatible pointer types passing 'unsigned char[200]' to parameter of type 'KeccakP1600_plain64_state *' [-Wincompatible-pointer-types]
csprng.c: 52 | KeccakP1600_Permute_24rounds(rng->state);
csprng.c: | ^~~~~~~~~~
csprng.c: .../supercop-data/alder/amd64/include/libkeccak.a.headers/KeccakP-1600-SnP.h:53:62: note: passing argument to parameter 'state' here
csprng.c: 53 | void KeccakP1600_Permute_24rounds(KeccakP1600_plain64_state *state);
csprng.c: | ^
csprng.c: csprng.c:78:38: warning: incompatible pointer types passing 'unsigned char[200]' to parameter of type 'KeccakP1600_plain64_state *' [-Wincompatible-pointer-types]
csprng.c: 78 | KeccakP1600_Permute_24rounds(rng->state);
csprng.c: | ^~~~~~~~~~
csprng.c: .../supercop-data/alder/amd64/include/libkeccak.a.headers/KeccakP-1600-SnP.h:53:62: note: passing argument to parameter 'state' here
csprng.c: 53 | void KeccakP1600_Permute_24rounds(KeccakP1600_plain64_state *state);
csprng.c: | ^
csprng.c: csprng.c:85:34: warning: incompatible pointer types passing 'unsigned char[200]' to parameter of type 'KeccakP1600_plain64_state *' [-Wincompatible-pointer-types]
csprng.c: 85 | KeccakP1600_Permute_24rounds(rng->state);
csprng.c: | ^~~~~~~~~~
csprng.c: .../supercop-data/alder/amd64/include/libkeccak.a.headers/KeccakP-1600-SnP.h:53:62: note: passing argument to parameter 'state' here
csprng.c: 53 | void KeccakP1600_Permute_24rounds(KeccakP1600_plain64_state *state);
csprng.c: | ^
csprng.c: 4 warnings generated.
try.c: /usr/bin/ld: libcrypto_kem_ramstakers216091.a(ramstake.o): in function `ramstake_keygen':
try.c: .../supercop-data/alder/amd64/try/c/clang_-march=native_-O3_-fwrapv_-Qunused-arguments_-fPIC_-fPIE_-gdwarf-4_-Wall/timingleaks/crypto_kem/ramstakers216091/ref/work/ramstake.c:35:(.text+0x...): undefined reference to `SHAKE256'
try.c: /usr/bin/ld: libcrypto_kem_ramstakers216091.a(ramstake.o): in function `ramstake_generate_g':
try.c: .../supercop-data/alder/amd64/try/c/clang_-march=native_-O3_-fwrapv_-Qunused-arguments_-fPIC_-fPIE_-gdwarf-4_-Wall/timingleaks/crypto_kem/ramstakers216091/ref/work/ramstake.c:579:(.text+0x...): undefined reference to `SHAKE256'
try.c: /usr/bin/ld: .../supercop-data/alder/amd64/try/c/clang_-march=native_-O3_-fwrapv_-Qunused-arguments_-fPIC_-fPIE_-gdwarf-4_-Wall/timingleaks/crypto_kem/ramstakers216091/ref/work/ramstake.c:579:(.text+0x...): undefined reference to `SHAKE256'
try.c: /usr/bin/ld: libcrypto_kem_ramstakers216091.a(ramstake.o): in function `ramstake_encaps':
try.c: .../supercop-data/alder/amd64/try/c/clang_-march=native_-O3_-fwrapv_-Qunused-arguments_-fPIC_-fPIE_-gdwarf-4_-Wall/timingleaks/crypto_kem/ramstakers216091/ref/work/ramstake.c:136:(.text+0x...): undefined reference to `SHAKE256'
try.c: /usr/bin/ld: libcrypto_kem_ramstakers216091.a(ramstake.o): in function `ramstake_generate_g':
try.c: .../supercop-data/alder/amd64/try/c/clang_-march=native_-O3_-fwrapv_-Qunused-arguments_-fPIC_-fPIE_-gdwarf-4_-Wall/timingleaks/crypto_kem/ramstakers216091/ref/work/ramstake.c:579:(.text+0x...): undefined reference to `SHAKE256'
try.c: /usr/bin/ld: libcrypto_kem_ramstakers216091.a(ramstake.o): in function `ramstake_encaps':
try.c: .../supercop-data/alder/amd64/try/c/clang_-march=native_-O3_-fwrapv_-Qunused-arguments_-fPIC_-fPIE_-gdwarf-4_-Wall/timingleaks/crypto_kem/ramstakers216091/ref/work/ramstake.c:263:(.text+0x...): undefined reference to `SHA3_256'
try.c: /usr/bin/ld: .../supercop-data/alder/amd64/try/c/clang_-march=native_-O3_-fwrapv_-Qunused-arguments_-fPIC_-fPIE_-gdwarf-4_-Wall/timingleaks/crypto_kem/ramstakers216091/ref/work/ramstake.c:263:(.text+0x...): undefined reference to `SHA3_256'
try.c: /usr/bin/ld: .../supercop-data/alder/amd64/try/c/clang_-march=native_-O3_-fwrapv_-Qunused-arguments_-fPIC_-fPIE_-gdwarf-4_-Wall/timingleaks/crypto_kem/ramstakers216091/ref/work/ramstake.c:308:(.text+0x...): undefined reference to `SHA3_256'
try.c: /usr/bin/ld: libcrypto_kem_ramstakers216091.a(ramstake.o): in function `ramstake_decaps':
try.c: .../supercop-data/alder/amd64/try/c/clang_-march=native_-O3_-fwrapv_-Qunused-arguments_-fPIC_-fPIE_-gdwarf-4_-Wall/timingleaks/crypto_kem/ramstakers216091/ref/work/ramstake.c:359:(.text+0x...): undefined reference to `SHAKE256'
try.c: /usr/bin/ld: libcrypto_kem_ramstakers216091.a(ramstake.o): in function `ramstake_generate_g':
try.c: .../supercop-data/alder/amd64/try/c/clang_-march=native_-O3_-fwrapv_-Qunused-arguments_-fPIC_-fPIE_-gdwarf-4_-Wall/timingleaks/crypto_kem/ramstakers216091/ref/work/ramstake.c:579:(.text+0x...): undefined reference to `SHAKE256'
try.c: /usr/bin/ld: libcrypto_kem_ramstakers216091.a(codec_rs.o): in function `codec_rs_decode':
try.c: .../supercop-data/alder/amd64/try/c/clang_-march=native_-O3_-fwrapv_-Qunused-arguments_-fPIC_-fPIE_-gdwarf-4_-Wall/timingleaks/crypto_kem/ramstakers216091/ref/work/codec_rs.c:64:(.text+0x...): undefined reference to `SHA3_256'
try.c: clang: error: linker command failed with exit code 1 (use -v to see invocation)
Number of similar (implementation,compiler) pairs: 1, namely:
Implementation | Compiler |
T:ref | clang -march=native -O3 -fwrapv -Qunused-arguments -fPIC -fPIE -gdwarf-4 -Wall (Debian_Clang_19.1.7_(3)) |
Compiler output
csprng.c: csprng.c:44:38: warning: incompatible pointer types passing 'unsigned char[200]' to parameter of type 'KeccakP1600_plain64_state *' [-Wincompatible-pointer-types]
csprng.c: 44 | KeccakP1600_Permute_24rounds(rng->state);
csprng.c: | ^~~~~~~~~~
csprng.c: .../supercop-data/alder/amd64/include/libkeccak.a.headers/KeccakP-1600-SnP.h:53:62: note: passing argument to parameter 'state' here
csprng.c: 53 | void KeccakP1600_Permute_24rounds(KeccakP1600_plain64_state *state);
csprng.c: | ^
csprng.c: csprng.c:52:34: warning: incompatible pointer types passing 'unsigned char[200]' to parameter of type 'KeccakP1600_plain64_state *' [-Wincompatible-pointer-types]
csprng.c: 52 | KeccakP1600_Permute_24rounds(rng->state);
csprng.c: | ^~~~~~~~~~
csprng.c: .../supercop-data/alder/amd64/include/libkeccak.a.headers/KeccakP-1600-SnP.h:53:62: note: passing argument to parameter 'state' here
csprng.c: 53 | void KeccakP1600_Permute_24rounds(KeccakP1600_plain64_state *state);
csprng.c: | ^
csprng.c: csprng.c:78:38: warning: incompatible pointer types passing 'unsigned char[200]' to parameter of type 'KeccakP1600_plain64_state *' [-Wincompatible-pointer-types]
csprng.c: 78 | KeccakP1600_Permute_24rounds(rng->state);
csprng.c: | ^~~~~~~~~~
csprng.c: .../supercop-data/alder/amd64/include/libkeccak.a.headers/KeccakP-1600-SnP.h:53:62: note: passing argument to parameter 'state' here
csprng.c: 53 | void KeccakP1600_Permute_24rounds(KeccakP1600_plain64_state *state);
csprng.c: | ^
csprng.c: csprng.c:85:34: warning: incompatible pointer types passing 'unsigned char[200]' to parameter of type 'KeccakP1600_plain64_state *' [-Wincompatible-pointer-types]
csprng.c: 85 | KeccakP1600_Permute_24rounds(rng->state);
csprng.c: | ^~~~~~~~~~
csprng.c: .../supercop-data/alder/amd64/include/libkeccak.a.headers/KeccakP-1600-SnP.h:53:62: note: passing argument to parameter 'state' here
csprng.c: 53 | void KeccakP1600_Permute_24rounds(KeccakP1600_plain64_state *state);
csprng.c: | ^
csprng.c: 4 warnings generated.
try.c: /usr/bin/ld: libcrypto_kem_ramstakers216091.a(ramstake.o): in function `ramstake_keygen':
try.c: .../supercop-data/alder/amd64/try/c/clang_-march=native_-O_-fwrapv_-Qunused-arguments_-fPIC_-fPIE_-gdwarf-4_-Wall/timingleaks/crypto_kem/ramstakers216091/ref/work/ramstake.c:35:(.text+0x...): undefined reference to `SHAKE256'
try.c: /usr/bin/ld: libcrypto_kem_ramstakers216091.a(ramstake.o): in function `ramstake_generate_g':
try.c: .../supercop-data/alder/amd64/try/c/clang_-march=native_-O_-fwrapv_-Qunused-arguments_-fPIC_-fPIE_-gdwarf-4_-Wall/timingleaks/crypto_kem/ramstakers216091/ref/work/ramstake.c:579:(.text+0x...): undefined reference to `SHAKE256'
try.c: /usr/bin/ld: .../supercop-data/alder/amd64/try/c/clang_-march=native_-O_-fwrapv_-Qunused-arguments_-fPIC_-fPIE_-gdwarf-4_-Wall/timingleaks/crypto_kem/ramstakers216091/ref/work/ramstake.c:579:(.text+0x...): undefined reference to `SHAKE256'
try.c: /usr/bin/ld: libcrypto_kem_ramstakers216091.a(ramstake.o): in function `ramstake_encaps':
try.c: .../supercop-data/alder/amd64/try/c/clang_-march=native_-O_-fwrapv_-Qunused-arguments_-fPIC_-fPIE_-gdwarf-4_-Wall/timingleaks/crypto_kem/ramstakers216091/ref/work/ramstake.c:136:(.text+0x...): undefined reference to `SHAKE256'
try.c: /usr/bin/ld: libcrypto_kem_ramstakers216091.a(ramstake.o): in function `ramstake_generate_g':
try.c: .../supercop-data/alder/amd64/try/c/clang_-march=native_-O_-fwrapv_-Qunused-arguments_-fPIC_-fPIE_-gdwarf-4_-Wall/timingleaks/crypto_kem/ramstakers216091/ref/work/ramstake.c:579:(.text+0x...): undefined reference to `SHAKE256'
try.c: /usr/bin/ld: libcrypto_kem_ramstakers216091.a(ramstake.o): in function `ramstake_encaps':
try.c: .../supercop-data/alder/amd64/try/c/clang_-march=native_-O_-fwrapv_-Qunused-arguments_-fPIC_-fPIE_-gdwarf-4_-Wall/timingleaks/crypto_kem/ramstakers216091/ref/work/ramstake.c:263:(.text+0x...): undefined reference to `SHA3_256'
try.c: /usr/bin/ld: .../supercop-data/alder/amd64/try/c/clang_-march=native_-O_-fwrapv_-Qunused-arguments_-fPIC_-fPIE_-gdwarf-4_-Wall/timingleaks/crypto_kem/ramstakers216091/ref/work/ramstake.c:308:(.text+0x...): undefined reference to `SHA3_256'
try.c: /usr/bin/ld: libcrypto_kem_ramstakers216091.a(ramstake.o): in function `ramstake_decaps':
try.c: .../supercop-data/alder/amd64/try/c/clang_-march=native_-O_-fwrapv_-Qunused-arguments_-fPIC_-fPIE_-gdwarf-4_-Wall/timingleaks/crypto_kem/ramstakers216091/ref/work/ramstake.c:359:(.text+0x...): undefined reference to `SHAKE256'
try.c: /usr/bin/ld: libcrypto_kem_ramstakers216091.a(ramstake.o): in function `ramstake_generate_g':
try.c: .../supercop-data/alder/amd64/try/c/clang_-march=native_-O_-fwrapv_-Qunused-arguments_-fPIC_-fPIE_-gdwarf-4_-Wall/timingleaks/crypto_kem/ramstakers216091/ref/work/ramstake.c:579:(.text+0x...): undefined reference to `SHAKE256'
try.c: /usr/bin/ld: libcrypto_kem_ramstakers216091.a(codec_rs.o): in function `codec_rs_decode':
try.c: .../supercop-data/alder/amd64/try/c/clang_-march=native_-O_-fwrapv_-Qunused-arguments_-fPIC_-fPIE_-gdwarf-4_-Wall/timingleaks/crypto_kem/ramstakers216091/ref/work/codec_rs.c:64:(.text+0x...): undefined reference to `SHA3_256'
try.c: clang: error: linker command failed with exit code 1 (use -v to see invocation)
Number of similar (implementation,compiler) pairs: 1, namely:
Implementation | Compiler |
T:ref | clang -march=native -O -fwrapv -Qunused-arguments -fPIC -fPIE -gdwarf-4 -Wall (Debian_Clang_19.1.7_(3)) |
Compiler output
csprng.c: csprng.c:44:38: warning: incompatible pointer types passing 'unsigned char[200]' to parameter of type 'KeccakP1600_plain64_state *' [-Wincompatible-pointer-types]
csprng.c: 44 | KeccakP1600_Permute_24rounds(rng->state);
csprng.c: | ^~~~~~~~~~
csprng.c: .../supercop-data/alder/amd64/include/libkeccak.a.headers/KeccakP-1600-SnP.h:53:62: note: passing argument to parameter 'state' here
csprng.c: 53 | void KeccakP1600_Permute_24rounds(KeccakP1600_plain64_state *state);
csprng.c: | ^
csprng.c: csprng.c:52:34: warning: incompatible pointer types passing 'unsigned char[200]' to parameter of type 'KeccakP1600_plain64_state *' [-Wincompatible-pointer-types]
csprng.c: 52 | KeccakP1600_Permute_24rounds(rng->state);
csprng.c: | ^~~~~~~~~~
csprng.c: .../supercop-data/alder/amd64/include/libkeccak.a.headers/KeccakP-1600-SnP.h:53:62: note: passing argument to parameter 'state' here
csprng.c: 53 | void KeccakP1600_Permute_24rounds(KeccakP1600_plain64_state *state);
csprng.c: | ^
csprng.c: csprng.c:78:38: warning: incompatible pointer types passing 'unsigned char[200]' to parameter of type 'KeccakP1600_plain64_state *' [-Wincompatible-pointer-types]
csprng.c: 78 | KeccakP1600_Permute_24rounds(rng->state);
csprng.c: | ^~~~~~~~~~
csprng.c: .../supercop-data/alder/amd64/include/libkeccak.a.headers/KeccakP-1600-SnP.h:53:62: note: passing argument to parameter 'state' here
csprng.c: 53 | void KeccakP1600_Permute_24rounds(KeccakP1600_plain64_state *state);
csprng.c: | ^
csprng.c: csprng.c:85:34: warning: incompatible pointer types passing 'unsigned char[200]' to parameter of type 'KeccakP1600_plain64_state *' [-Wincompatible-pointer-types]
csprng.c: 85 | KeccakP1600_Permute_24rounds(rng->state);
csprng.c: | ^~~~~~~~~~
csprng.c: .../supercop-data/alder/amd64/include/libkeccak.a.headers/KeccakP-1600-SnP.h:53:62: note: passing argument to parameter 'state' here
csprng.c: 53 | void KeccakP1600_Permute_24rounds(KeccakP1600_plain64_state *state);
csprng.c: | ^
csprng.c: 4 warnings generated.
try.c: /usr/bin/ld: libcrypto_kem_ramstakers216091.a(ramstake.o): in function `ramstake_keygen':
try.c: .../supercop-data/alder/amd64/try/c/clang_-march=native_-Os_-fwrapv_-Qunused-arguments_-fPIC_-fPIE_-gdwarf-4_-Wall/timingleaks/crypto_kem/ramstakers216091/ref/work/ramstake.c:35:(.text+0x...): undefined reference to `SHAKE256'
try.c: /usr/bin/ld: libcrypto_kem_ramstakers216091.a(ramstake.o): in function `ramstake_generate_g':
try.c: .../supercop-data/alder/amd64/try/c/clang_-march=native_-Os_-fwrapv_-Qunused-arguments_-fPIC_-fPIE_-gdwarf-4_-Wall/timingleaks/crypto_kem/ramstakers216091/ref/work/ramstake.c:579:(.text+0x...): undefined reference to `SHAKE256'
try.c: /usr/bin/ld: libcrypto_kem_ramstakers216091.a(ramstake.o): in function `ramstake_encaps':
try.c: .../supercop-data/alder/amd64/try/c/clang_-march=native_-Os_-fwrapv_-Qunused-arguments_-fPIC_-fPIE_-gdwarf-4_-Wall/timingleaks/crypto_kem/ramstakers216091/ref/work/ramstake.c:136:(.text+0x...): undefined reference to `SHAKE256'
try.c: /usr/bin/ld: .../supercop-data/alder/amd64/try/c/clang_-march=native_-Os_-fwrapv_-Qunused-arguments_-fPIC_-fPIE_-gdwarf-4_-Wall/timingleaks/crypto_kem/ramstakers216091/ref/work/ramstake.c:263:(.text+0x...): undefined reference to `SHA3_256'
try.c: /usr/bin/ld: .../supercop-data/alder/amd64/try/c/clang_-march=native_-Os_-fwrapv_-Qunused-arguments_-fPIC_-fPIE_-gdwarf-4_-Wall/timingleaks/crypto_kem/ramstakers216091/ref/work/ramstake.c:263:(.text+0x...): undefined reference to `SHA3_256'
try.c: /usr/bin/ld: .../supercop-data/alder/amd64/try/c/clang_-march=native_-Os_-fwrapv_-Qunused-arguments_-fPIC_-fPIE_-gdwarf-4_-Wall/timingleaks/crypto_kem/ramstakers216091/ref/work/ramstake.c:308:(.text+0x...): undefined reference to `SHA3_256'
try.c: /usr/bin/ld: libcrypto_kem_ramstakers216091.a(ramstake.o): in function `ramstake_decaps':
try.c: .../supercop-data/alder/amd64/try/c/clang_-march=native_-Os_-fwrapv_-Qunused-arguments_-fPIC_-fPIE_-gdwarf-4_-Wall/timingleaks/crypto_kem/ramstakers216091/ref/work/ramstake.c:359:(.text+0x...): undefined reference to `SHAKE256'
try.c: /usr/bin/ld: libcrypto_kem_ramstakers216091.a(codec_rs.o): in function `codec_rs_decode':
try.c: .../supercop-data/alder/amd64/try/c/clang_-march=native_-Os_-fwrapv_-Qunused-arguments_-fPIC_-fPIE_-gdwarf-4_-Wall/timingleaks/crypto_kem/ramstakers216091/ref/work/codec_rs.c:64:(.text+0x...): undefined reference to `SHA3_256'
try.c: clang: error: linker command failed with exit code 1 (use -v to see invocation)
Number of similar (implementation,compiler) pairs: 1, namely:
Implementation | Compiler |
T:ref | clang -march=native -Os -fwrapv -Qunused-arguments -fPIC -fPIE -gdwarf-4 -Wall (Debian_Clang_11.0.1) |
Compiler output
csprng.c: csprng.c:44:38: warning: incompatible pointer types passing 'unsigned char[200]' to parameter of type 'KeccakP1600_plain64_state *' [-Wincompatible-pointer-types]
csprng.c: 44 | KeccakP1600_Permute_24rounds(rng->state);
csprng.c: | ^~~~~~~~~~
csprng.c: .../supercop-data/alder/amd64/include/libkeccak.a.headers/KeccakP-1600-SnP.h:53:62: note: passing argument to parameter 'state' here
csprng.c: 53 | void KeccakP1600_Permute_24rounds(KeccakP1600_plain64_state *state);
csprng.c: | ^
csprng.c: csprng.c:52:34: warning: incompatible pointer types passing 'unsigned char[200]' to parameter of type 'KeccakP1600_plain64_state *' [-Wincompatible-pointer-types]
csprng.c: 52 | KeccakP1600_Permute_24rounds(rng->state);
csprng.c: | ^~~~~~~~~~
csprng.c: .../supercop-data/alder/amd64/include/libkeccak.a.headers/KeccakP-1600-SnP.h:53:62: note: passing argument to parameter 'state' here
csprng.c: 53 | void KeccakP1600_Permute_24rounds(KeccakP1600_plain64_state *state);
csprng.c: | ^
csprng.c: csprng.c:78:38: warning: incompatible pointer types passing 'unsigned char[200]' to parameter of type 'KeccakP1600_plain64_state *' [-Wincompatible-pointer-types]
csprng.c: 78 | KeccakP1600_Permute_24rounds(rng->state);
csprng.c: | ^~~~~~~~~~
csprng.c: .../supercop-data/alder/amd64/include/libkeccak.a.headers/KeccakP-1600-SnP.h:53:62: note: passing argument to parameter 'state' here
csprng.c: 53 | void KeccakP1600_Permute_24rounds(KeccakP1600_plain64_state *state);
csprng.c: | ^
csprng.c: csprng.c:85:34: warning: incompatible pointer types passing 'unsigned char[200]' to parameter of type 'KeccakP1600_plain64_state *' [-Wincompatible-pointer-types]
csprng.c: 85 | KeccakP1600_Permute_24rounds(rng->state);
csprng.c: | ^~~~~~~~~~
csprng.c: .../supercop-data/alder/amd64/include/libkeccak.a.headers/KeccakP-1600-SnP.h:53:62: note: passing argument to parameter 'state' here
csprng.c: 53 | void KeccakP1600_Permute_24rounds(KeccakP1600_plain64_state *state);
csprng.c: | ^
csprng.c: 4 warnings generated.
try.c: /usr/bin/ld: libcrypto_kem_ramstakers216091.a(ramstake.o): in function `ramstake_keygen':
try.c: .../supercop-data/alder/amd64/try/c/clang_-mcpu=native_-O3_-fwrapv_-Qunused-arguments_-fPIC_-fPIE_-gdwarf-4_-Wall/timingleaks/crypto_kem/ramstakers216091/ref/work/ramstake.c:35:(.text+0x...): undefined reference to `SHAKE256'
try.c: /usr/bin/ld: libcrypto_kem_ramstakers216091.a(ramstake.o): in function `ramstake_generate_g':
try.c: .../supercop-data/alder/amd64/try/c/clang_-mcpu=native_-O3_-fwrapv_-Qunused-arguments_-fPIC_-fPIE_-gdwarf-4_-Wall/timingleaks/crypto_kem/ramstakers216091/ref/work/ramstake.c:579:(.text+0x...): undefined reference to `SHAKE256'
try.c: /usr/bin/ld: .../supercop-data/alder/amd64/try/c/clang_-mcpu=native_-O3_-fwrapv_-Qunused-arguments_-fPIC_-fPIE_-gdwarf-4_-Wall/timingleaks/crypto_kem/ramstakers216091/ref/work/ramstake.c:579:(.text+0x...): undefined reference to `SHAKE256'
try.c: /usr/bin/ld: libcrypto_kem_ramstakers216091.a(ramstake.o): in function `ramstake_encaps':
try.c: .../supercop-data/alder/amd64/try/c/clang_-mcpu=native_-O3_-fwrapv_-Qunused-arguments_-fPIC_-fPIE_-gdwarf-4_-Wall/timingleaks/crypto_kem/ramstakers216091/ref/work/ramstake.c:136:(.text+0x...): undefined reference to `SHAKE256'
try.c: /usr/bin/ld: libcrypto_kem_ramstakers216091.a(ramstake.o): in function `ramstake_generate_g':
try.c: .../supercop-data/alder/amd64/try/c/clang_-mcpu=native_-O3_-fwrapv_-Qunused-arguments_-fPIC_-fPIE_-gdwarf-4_-Wall/timingleaks/crypto_kem/ramstakers216091/ref/work/ramstake.c:579:(.text+0x...): undefined reference to `SHAKE256'
try.c: /usr/bin/ld: libcrypto_kem_ramstakers216091.a(ramstake.o): in function `ramstake_encaps':
try.c: .../supercop-data/alder/amd64/try/c/clang_-mcpu=native_-O3_-fwrapv_-Qunused-arguments_-fPIC_-fPIE_-gdwarf-4_-Wall/timingleaks/crypto_kem/ramstakers216091/ref/work/ramstake.c:263:(.text+0x...): undefined reference to `SHA3_256'
try.c: /usr/bin/ld: .../supercop-data/alder/amd64/try/c/clang_-mcpu=native_-O3_-fwrapv_-Qunused-arguments_-fPIC_-fPIE_-gdwarf-4_-Wall/timingleaks/crypto_kem/ramstakers216091/ref/work/ramstake.c:263:(.text+0x...): undefined reference to `SHA3_256'
try.c: /usr/bin/ld: .../supercop-data/alder/amd64/try/c/clang_-mcpu=native_-O3_-fwrapv_-Qunused-arguments_-fPIC_-fPIE_-gdwarf-4_-Wall/timingleaks/crypto_kem/ramstakers216091/ref/work/ramstake.c:308:(.text+0x...): undefined reference to `SHA3_256'
try.c: /usr/bin/ld: libcrypto_kem_ramstakers216091.a(ramstake.o): in function `ramstake_decaps':
try.c: .../supercop-data/alder/amd64/try/c/clang_-mcpu=native_-O3_-fwrapv_-Qunused-arguments_-fPIC_-fPIE_-gdwarf-4_-Wall/timingleaks/crypto_kem/ramstakers216091/ref/work/ramstake.c:359:(.text+0x...): undefined reference to `SHAKE256'
try.c: /usr/bin/ld: libcrypto_kem_ramstakers216091.a(ramstake.o): in function `ramstake_generate_g':
try.c: .../supercop-data/alder/amd64/try/c/clang_-mcpu=native_-O3_-fwrapv_-Qunused-arguments_-fPIC_-fPIE_-gdwarf-4_-Wall/timingleaks/crypto_kem/ramstakers216091/ref/work/ramstake.c:579:(.text+0x...): undefined reference to `SHAKE256'
try.c: /usr/bin/ld: libcrypto_kem_ramstakers216091.a(codec_rs.o): in function `codec_rs_decode':
try.c: .../supercop-data/alder/amd64/try/c/clang_-mcpu=native_-O3_-fwrapv_-Qunused-arguments_-fPIC_-fPIE_-gdwarf-4_-Wall/timingleaks/crypto_kem/ramstakers216091/ref/work/codec_rs.c:64:(.text+0x...): undefined reference to `SHA3_256'
try.c: clang: error: linker command failed with exit code 1 (use -v to see invocation)
Number of similar (implementation,compiler) pairs: 1, namely:
Implementation | Compiler |
T:ref | clang -mcpu=native -O3 -fwrapv -Qunused-arguments -fPIC -fPIE -gdwarf-4 -Wall (Debian_Clang_19.1.7_(3)) |
Compiler output
csprng.c: csprng.c: In function 'csprng_seed':
csprng.c: csprng.c:44:41: error: passing argument 1 of 'KeccakP1600_Permute_24rounds' from incompatible pointer type [-Wincompatible-pointer-types]
csprng.c: 44 | KeccakP1600_Permute_24rounds(rng->state);
csprng.c: | ~~~^~~~~~~
csprng.c: | |
csprng.c: | unsigned char *
csprng.c: In file included from .../supercop-data/alder/amd64/include/libkeccak.a.headers/KeccakSponge.h:64,
csprng.c: from .../supercop-data/alder/amd64/include/libkeccak.a.headers/KeccakHash.h:25,
csprng.c: from csprng.c:2:
csprng.c: .../supercop-data/alder/amd64/include/libkeccak.a.headers/KeccakP-1600-SnP.h:53:62: note: expected 'KeccakP1600_plain64_state *' but argument is of type 'unsigned char *'
csprng.c: 53 | void KeccakP1600_Permute_24rounds(KeccakP1600_plain64_state *state);
csprng.c: | ~~~~~~~~~~~~~~~~~~~~~~~~~~~^~~~~
csprng.c: csprng.c:52:37: error: passing argument 1 of 'KeccakP1600_Permute_24rounds' from incompatible pointer type [-Wincompatible-pointer-types]
csprng.c: 52 | KeccakP1600_Permute_24rounds(rng->state);
csprng.c: | ~~~^~~~~~~
csprng.c: | |
csprng.c: | unsigned char *
csprng.c: .../supercop-data/alder/amd64/include/libkeccak.a.headers/KeccakP-1600-SnP.h:53:62: note: expected 'KeccakP1600_plain64_state *' but argument is of type 'unsigned char *'
csprng.c: 53 | void KeccakP1600_Permute_24rounds(KeccakP1600_plain64_state *state);
csprng.c: | ~~~~~~~~~~~~~~~~~~~~~~~~~~~^~~~~
csprng.c: csprng.c: In function 'csprng_generate':
csprng.c: csprng.c:78:41: error: passing argument 1 of 'KeccakP1600_Permute_24rounds' from incompatible pointer type [-Wincompatible-pointer-types]
csprng.c: 78 | KeccakP1600_Permute_24rounds(rng->state);
csprng.c: | ~~~^~~~~~~
csprng.c: | |
csprng.c: ...
Number of similar (implementation,compiler) pairs: 4, namely:
Implementation | Compiler |
T:ref | gcc -march=native -mtune=native -O2 -fwrapv -fPIC -fPIE -gdwarf-4 -Wall (14.2.0) |
T:ref | gcc -march=native -mtune=native -O3 -fwrapv -fPIC -fPIE -gdwarf-4 -Wall (14.2.0) |
T:ref | gcc -march=native -mtune=native -O -fwrapv -fPIC -fPIE -gdwarf-4 -Wall (10.2.1_20210110) |
T:ref | gcc -march=native -mtune=native -Os -fwrapv -fPIC -fPIE -gdwarf-4 -Wall (14.2.0) |