Implementation notes: aarch64, pmnod145, crypto_aead/schwaemm256128v1

Computer: pmnod145
Architecture: aarch64
CPU ID: 431f0af1
SUPERCOP version: 20191017
Operation: crypto_aead
Primitive: schwaemm256128v1
TimeObject sizeTest sizeImplementationCompilerBenchmark dateSUPERCOP version
2488755725 0 020102 880 880optgcc_-march=native_-mtune=native_-O3_-fomit-frame-pointer_-fwrapv_-fPIC_-fPIE2019101820191017
2578004625 0 017878 880 864optgcc_-march=native_-mtune=native_-O2_-fomit-frame-pointer_-fwrapv_-fPIC_-fPIE2019101820191017
2744254537 0 017830 880 864optgcc_-march=native_-mtune=native_-O_-fomit-frame-pointer_-fwrapv_-fPIC_-fPIE2019101820191017
3125505309 0 018666 888 864refgcc_-march=native_-mtune=native_-O2_-fomit-frame-pointer_-fwrapv_-fPIC_-fPIE2019101820191017
3234255189 0 018586 888 864refgcc_-march=native_-mtune=native_-O_-fomit-frame-pointer_-fwrapv_-fPIC_-fPIE2019101820191017
4198008841 0 023322 888 880refgcc_-march=native_-mtune=native_-O3_-fomit-frame-pointer_-fwrapv_-fPIC_-fPIE2019101820191017

Compiler output

Implementation: crypto_aead/schwaemm256128v1/opt
Compiler: armclang -march=armv8a+crypto -mcpu=thunderx2t99 -mtune=thunderx2t99 -O2 -fPIC -fPIE
try.c: /dibona_home_nfs/rdolbeau/opt/arm/gcc-8.2.0_Generic-AArch64_RHEL-7_aarch64-linux/lib/gcc/aarch64-linux-gnu/8.2.0/../../../../aarch64-linux-gnu/bin/ld: crypto_aead_schwaemm256128v1.a(encrypt.o): in function `crypto_aead_schwaemm256128v1_opt_encrypt':
try.c: encrypt.c:(.text+0x...): undefined reference to `encryptPT'
try.c: /dibona_home_nfs/rdolbeau/opt/arm/gcc-8.2.0_Generic-AArch64_RHEL-7_aarch64-linux/lib/gcc/aarch64-linux-gnu/8.2.0/../../../../aarch64-linux-gnu/bin/ld: crypto_aead_schwaemm256128v1.a(encrypt.o): in function `crypto_aead_schwaemm256128v1_opt_decrypt':
try.c: encrypt.c:(.text+0x...): undefined reference to `decryptCT'
try.c: clang-7: error: linker command failed with exit code 1 (use -v to see invocation)

Number of similar (compiler,implementation) pairs: 2, namely:
CompilerImplementations
armclang -march=armv8a+crypto -mcpu=thunderx2t99 -mtune=thunderx2t99 -O2 -fPIC -fPIE opt
armclang -march=armv8a+crypto -mcpu=thunderx2t99 -mtune=thunderx2t99 -O3 -fPIC -fPIE opt

Compiler output

Implementation: crypto_aead/schwaemm256128v1/ref
Compiler: armclang -march=armv8a+crypto -mcpu=thunderx2t99 -mtune=thunderx2t99 -O2 -fPIC -fPIE
try.c: /dibona_home_nfs/rdolbeau/opt/arm/gcc-8.2.0_Generic-AArch64_RHEL-7_aarch64-linux/lib/gcc/aarch64-linux-gnu/8.2.0/../../../../aarch64-linux-gnu/bin/ld: crypto_aead_schwaemm256128v1.a(encrypt.o): in function `crypto_aead_schwaemm256128v1_ref_encrypt':
try.c: encrypt.c:(.text+0x...): undefined reference to `encryptPT'
try.c: /dibona_home_nfs/rdolbeau/opt/arm/gcc-8.2.0_Generic-AArch64_RHEL-7_aarch64-linux/lib/gcc/aarch64-linux-gnu/8.2.0/../../../../aarch64-linux-gnu/bin/ld: crypto_aead_schwaemm256128v1.a(encrypt.o): in function `crypto_aead_schwaemm256128v1_ref_decrypt':
try.c: encrypt.c:(.text+0x...): undefined reference to `decryptCT'
try.c: clang-7: error: linker command failed with exit code 1 (use -v to see invocation)

Number of similar (compiler,implementation) pairs: 2, namely:
CompilerImplementations
armclang -march=armv8a+crypto -mcpu=thunderx2t99 -mtune=thunderx2t99 -O2 -fPIC -fPIE ref
armclang -march=armv8a+crypto -mcpu=thunderx2t99 -mtune=thunderx2t99 -O3 -fPIC -fPIE ref

Compiler output

Implementation: crypto_aead/schwaemm256128v1/opt
Compiler: gcc -march=native -mtune=native -Os -fomit-frame-pointer -fwrapv -fPIC -fPIE
try.c: /dibona_home_nfs/rdolbeau/gcc-9.2.0-full+isl/lib/gcc/aarch64-unknown-linux-gnu/9.2.0/../../../../aarch64-unknown-linux-gnu/bin/ld: crypto_aead_schwaemm256128v1.a(encrypt.o): in function `crypto_aead_schwaemm256128v1_opt_encrypt':
try.c: encrypt.c:(.text+0x...): undefined reference to `initialize'
try.c: /dibona_home_nfs/rdolbeau/gcc-9.2.0-full+isl/lib/gcc/aarch64-unknown-linux-gnu/9.2.0/../../../../aarch64-unknown-linux-gnu/bin/ld: encrypt.c:(.text+0x...): undefined reference to `processAD'
try.c: /dibona_home_nfs/rdolbeau/gcc-9.2.0-full+isl/lib/gcc/aarch64-unknown-linux-gnu/9.2.0/../../../../aarch64-unknown-linux-gnu/bin/ld: encrypt.c:(.text+0x...): undefined reference to `encryptPT'
try.c: /dibona_home_nfs/rdolbeau/gcc-9.2.0-full+isl/lib/gcc/aarch64-unknown-linux-gnu/9.2.0/../../../../aarch64-unknown-linux-gnu/bin/ld: crypto_aead_schwaemm256128v1.a(encrypt.o): in function `crypto_aead_schwaemm256128v1_opt_decrypt':
try.c: encrypt.c:(.text+0x...): undefined reference to `initialize'
try.c: /dibona_home_nfs/rdolbeau/gcc-9.2.0-full+isl/lib/gcc/aarch64-unknown-linux-gnu/9.2.0/../../../../aarch64-unknown-linux-gnu/bin/ld: encrypt.c:(.text+0x...): undefined reference to `processAD'
try.c: /dibona_home_nfs/rdolbeau/gcc-9.2.0-full+isl/lib/gcc/aarch64-unknown-linux-gnu/9.2.0/../../../../aarch64-unknown-linux-gnu/bin/ld: encrypt.c:(.text+0x...): undefined reference to `decryptCT'
try.c: collect2: error: ld returned 1 exit status

Number of similar (compiler,implementation) pairs: 1, namely:
CompilerImplementations
gcc -march=native -mtune=native -Os -fomit-frame-pointer -fwrapv -fPIC -fPIE opt

Compiler output

Implementation: crypto_aead/schwaemm256128v1/ref
Compiler: gcc -march=native -mtune=native -Os -fomit-frame-pointer -fwrapv -fPIC -fPIE
try.c: /dibona_home_nfs/rdolbeau/gcc-9.2.0-full+isl/lib/gcc/aarch64-unknown-linux-gnu/9.2.0/../../../../aarch64-unknown-linux-gnu/bin/ld: crypto_aead_schwaemm256128v1.a(encrypt.o): in function `crypto_aead_schwaemm256128v1_ref_encrypt':
try.c: encrypt.c:(.text+0x...): undefined reference to `initialize'
try.c: /dibona_home_nfs/rdolbeau/gcc-9.2.0-full+isl/lib/gcc/aarch64-unknown-linux-gnu/9.2.0/../../../../aarch64-unknown-linux-gnu/bin/ld: encrypt.c:(.text+0x...): undefined reference to `processAD'
try.c: /dibona_home_nfs/rdolbeau/gcc-9.2.0-full+isl/lib/gcc/aarch64-unknown-linux-gnu/9.2.0/../../../../aarch64-unknown-linux-gnu/bin/ld: encrypt.c:(.text+0x...): undefined reference to `encryptPT'
try.c: /dibona_home_nfs/rdolbeau/gcc-9.2.0-full+isl/lib/gcc/aarch64-unknown-linux-gnu/9.2.0/../../../../aarch64-unknown-linux-gnu/bin/ld: crypto_aead_schwaemm256128v1.a(encrypt.o): in function `crypto_aead_schwaemm256128v1_ref_decrypt':
try.c: encrypt.c:(.text+0x...): undefined reference to `initialize'
try.c: /dibona_home_nfs/rdolbeau/gcc-9.2.0-full+isl/lib/gcc/aarch64-unknown-linux-gnu/9.2.0/../../../../aarch64-unknown-linux-gnu/bin/ld: encrypt.c:(.text+0x...): undefined reference to `processAD'
try.c: /dibona_home_nfs/rdolbeau/gcc-9.2.0-full+isl/lib/gcc/aarch64-unknown-linux-gnu/9.2.0/../../../../aarch64-unknown-linux-gnu/bin/ld: encrypt.c:(.text+0x...): undefined reference to `decryptCT'
try.c: collect2: error: ld returned 1 exit status

Number of similar (compiler,implementation) pairs: 1, namely:
CompilerImplementations
gcc -march=native -mtune=native -Os -fomit-frame-pointer -fwrapv -fPIC -fPIE ref