Implementation notes: aarch64, pmnod145, crypto_aead/paeq64

Computer: pmnod145
Architecture: aarch64
CPU ID: 431f0af1
SUPERCOP version: 20191017
Operation: crypto_aead
Primitive: paeq64
TimeObject sizeTest sizeImplementationCompilerBenchmark dateSUPERCOP version
259330015364 28 6553633085 924 66408refarmclang++_-march=armv8a+crypto_-mcpu=thunderx2t99_-mtune=thunderx2t99_-O3_-fPIC_-fPIE2019101820191017
288740014852 28 6553632133 924 66400refarmclang++_-march=armv8a+crypto_-mcpu=thunderx2t99_-mtune=thunderx2t99_-O2_-fPIC_-fPIE2019101820191017
430645010832 28 6553624856 908 66424refg++_-march=native_-mtune=native_-O3_-fomit-frame-pointer_-fwrapv_-fPIC_-fPIE2019101820191017
97624005224 28 6553618051 892 66400refg++_-march=native_-mtune=native_-O2_-fomit-frame-pointer_-fwrapv_-fPIC_-fPIE2019101820191017
99881754176 28 6553616095 876 66392refg++_-march=native_-mtune=native_-Os_-fomit-frame-pointer_-fwrapv_-fPIC_-fPIE2019101820191017
114338255064 28 6553617947 892 66400refg++_-march=native_-mtune=native_-O_-fomit-frame-pointer_-fwrapv_-fPIC_-fPIE2019101820191017

Compiler output

Implementation: crypto_aead/paeq64/aesni
Compiler: armclang++ -march=armv8a+crypto -mcpu=thunderx2t99 -mtune=thunderx2t99 -O2 -fPIC -fPIE
encrypt.cpp: In file included from encrypt.cpp:13:
encrypt.cpp: In file included from /dibona_home_nfs/rdolbeau/opt/arm/arm-hpc-compiler-19.3_Generic-AArch64_RHEL-7_aarch64-linux/lib/clang/7.1.0/include/wmmintrin.h:27:
encrypt.cpp: In file included from /dibona_home_nfs/rdolbeau/opt/arm/arm-hpc-compiler-19.3_Generic-AArch64_RHEL-7_aarch64-linux/lib/clang/7.1.0/include/emmintrin.h:27:
encrypt.cpp: In file included from /dibona_home_nfs/rdolbeau/opt/arm/arm-hpc-compiler-19.3_Generic-AArch64_RHEL-7_aarch64-linux/lib/clang/7.1.0/include/xmmintrin.h:27:
encrypt.cpp: /dibona_home_nfs/rdolbeau/opt/arm/arm-hpc-compiler-19.3_Generic-AArch64_RHEL-7_aarch64-linux/lib/clang/7.1.0/include/mmintrin.h:47:5: error: use of undeclared identifier '__builtin_ia32_emms'; did you mean '__builtin_isless'?
encrypt.cpp: __builtin_ia32_emms();
encrypt.cpp: ^
encrypt.cpp: /dibona_home_nfs/rdolbeau/opt/arm/arm-hpc-compiler-19.3_Generic-AArch64_RHEL-7_aarch64-linux/lib/clang/7.1.0/include/mmintrin.h:47:5: note: '__builtin_isless' declared here
encrypt.cpp: /dibona_home_nfs/rdolbeau/opt/arm/arm-hpc-compiler-19.3_Generic-AArch64_RHEL-7_aarch64-linux/lib/clang/7.1.0/include/mmintrin.h:47:25: error: too few arguments to function call, expected 2, have 0
encrypt.cpp: __builtin_ia32_emms();
encrypt.cpp: ^
encrypt.cpp: /dibona_home_nfs/rdolbeau/opt/arm/arm-hpc-compiler-19.3_Generic-AArch64_RHEL-7_aarch64-linux/lib/clang/7.1.0/include/mmintrin.h:64:19: error: use of undeclared identifier '__builtin_ia32_vec_init_v2si'
encrypt.cpp: return (__m64)__builtin_ia32_vec_init_v2si(__i, 0);
encrypt.cpp: ^
encrypt.cpp: /dibona_home_nfs/rdolbeau/opt/arm/arm-hpc-compiler-19.3_Generic-AArch64_RHEL-7_aarch64-linux/lib/clang/7.1.0/include/mmintrin.h:81:12: error: use of undeclared identifier '__builtin_ia32_vec_ext_v2si'
encrypt.cpp: return __builtin_ia32_vec_ext_v2si((__v2si)__m, 0);
encrypt.cpp: ^
encrypt.cpp: /dibona_home_nfs/rdolbeau/opt/arm/arm-hpc-compiler-19.3_Generic-AArch64_RHEL-7_aarch64-linux/lib/clang/7.1.0/include/mmintrin.h:143:19: error: use of undeclared identifier '__builtin_ia32_packsswb'
encrypt.cpp: return (__m64)__builtin_ia32_packsswb((__v4hi)__m1, (__v4hi)__m2);
encrypt.cpp: ^
encrypt.cpp: /dibona_home_nfs/rdolbeau/opt/arm/arm-hpc-compiler-19.3_Generic-AArch64_RHEL-7_aarch64-linux/lib/clang/7.1.0/include/mmintrin.h:173:19: error: use of undeclared identifier '__builtin_ia32_packssdw'
encrypt.cpp: return (__m64)__builtin_ia32_packssdw((__v2si)__m1, (__v2si)__m2);
encrypt.cpp: ^
encrypt.cpp: /dibona_home_nfs/rdolbeau/opt/arm/arm-hpc-compiler-19.3_Generic-AArch64_RHEL-7_aarch64-linux/lib/clang/7.1.0/include/mmintrin.h:203:19: error: use of undeclared identifier '__builtin_ia32_packuswb'
encrypt.cpp: return (__m64)__builtin_ia32_packuswb((__v4hi)__m1, (__v4hi)__m2);
encrypt.cpp: ...

Number of similar (compiler,implementation) pairs: 2, namely:
CompilerImplementations
armclang++ -march=armv8a+crypto -mcpu=thunderx2t99 -mtune=thunderx2t99 -O2 -fPIC -fPIE aesni
armclang++ -march=armv8a+crypto -mcpu=thunderx2t99 -mtune=thunderx2t99 -O3 -fPIC -fPIE aesni

Compiler output

Implementation: crypto_aead/paeq64/aesni
Compiler: g++ -march=native -mtune=native -O2 -fomit-frame-pointer -fwrapv -fPIC -fPIE
encrypt.cpp: encrypt.cpp:13:10: fatal error: wmmintrin.h: No such file or directory
encrypt.cpp: 13 | #include "wmmintrin.h"
encrypt.cpp: | ^~~~~~~~~~~~~
encrypt.cpp: compilation terminated.

Number of similar (compiler,implementation) pairs: 4, namely:
CompilerImplementations
g++ -march=native -mtune=native -O2 -fomit-frame-pointer -fwrapv -fPIC -fPIE aesni
g++ -march=native -mtune=native -O3 -fomit-frame-pointer -fwrapv -fPIC -fPIE aesni
g++ -march=native -mtune=native -O -fomit-frame-pointer -fwrapv -fPIC -fPIE aesni
g++ -march=native -mtune=native -Os -fomit-frame-pointer -fwrapv -fPIC -fPIE aesni