Implementation notes: aarch64, pmnod145, crypto_aead/aes128otrsv3

Computer: pmnod145
Architecture: aarch64
CPU ID: 431f0af1
SUPERCOP version: 20191017
Operation: crypto_aead
Primitive: aes128otrsv3
TimeObject sizeTest sizeImplementationCompilerBenchmark dateSUPERCOP version
16962514346 4392 32031784 5256 1184refarmclang_-march=armv8a+crypto_-mcpu=thunderx2t99_-mtune=thunderx2t99_-O2_-fPIC_-fPIE2019101820191017
17147514626 4392 32032448 5256 1192refarmclang_-march=armv8a+crypto_-mcpu=thunderx2t99_-mtune=thunderx2t99_-O3_-fPIC_-fPIE2019101820191017
20082515390 4400 32029683 5280 1208refgcc_-march=native_-mtune=native_-O3_-fomit-frame-pointer_-fwrapv_-fPIC_-fPIE2019101820191017
2019757066 4392 32020214 5256 1184refgcc_-march=native_-mtune=native_-O2_-fomit-frame-pointer_-fwrapv_-fPIC_-fPIE2019101820191017
2096005938 4392 32019110 5256 1184refgcc_-march=native_-mtune=native_-O_-fomit-frame-pointer_-fwrapv_-fPIC_-fPIE2019101820191017
2107754854 4392 32017058 5240 1176refgcc_-march=native_-mtune=native_-Os_-fomit-frame-pointer_-fwrapv_-fPIC_-fPIE2019101820191017

Compiler output

Implementation: crypto_aead/aes128otrsv3/ni_p7m1
Compiler: armclang -march=armv8a+crypto -mcpu=thunderx2t99 -mtune=thunderx2t99 -O2 -fPIC -fPIE
encrypt.c: In file included from encrypt.c:33:
encrypt.c: In file included from ./otr.h:30:
encrypt.c: In file included from /dibona_home_nfs/rdolbeau/opt/arm/arm-hpc-compiler-19.3_Generic-AArch64_RHEL-7_aarch64-linux/lib/clang/7.1.0/include/x86intrin.h:29:
encrypt.c: In file included from /dibona_home_nfs/rdolbeau/opt/arm/arm-hpc-compiler-19.3_Generic-AArch64_RHEL-7_aarch64-linux/lib/clang/7.1.0/include/immintrin.h:28:
encrypt.c: /dibona_home_nfs/rdolbeau/opt/arm/arm-hpc-compiler-19.3_Generic-AArch64_RHEL-7_aarch64-linux/lib/clang/7.1.0/include/mmintrin.h:64:12: error: invalid conversion between vector type '__m64' (vector of 1 'long long' value) and integer type 'int' of different size
encrypt.c: return (__m64)__builtin_ia32_vec_init_v2si(__i, 0);
encrypt.c: ^~~~~~~~~~~~~~~~~~~~~~~~~~~~~~~~~~~~~~~~~~~
encrypt.c: /dibona_home_nfs/rdolbeau/opt/arm/arm-hpc-compiler-19.3_Generic-AArch64_RHEL-7_aarch64-linux/lib/clang/7.1.0/include/mmintrin.h:143:12: error: invalid conversion between vector type '__m64' (vector of 1 'long long' value) and integer type 'int' of different size
encrypt.c: return (__m64)__builtin_ia32_packsswb((__v4hi)__m1, (__v4hi)__m2);
encrypt.c: ^~~~~~~~~~~~~~~~~~~~~~~~~~~~~~~~~~~~~~~~~~~~~~~~~~~~~~~~~~
encrypt.c: /dibona_home_nfs/rdolbeau/opt/arm/arm-hpc-compiler-19.3_Generic-AArch64_RHEL-7_aarch64-linux/lib/clang/7.1.0/include/mmintrin.h:173:12: error: invalid conversion between vector type '__m64' (vector of 1 'long long' value) and integer type 'int' of different size
encrypt.c: return (__m64)__builtin_ia32_packssdw((__v2si)__m1, (__v2si)__m2);
encrypt.c: ^~~~~~~~~~~~~~~~~~~~~~~~~~~~~~~~~~~~~~~~~~~~~~~~~~~~~~~~~~
encrypt.c: /dibona_home_nfs/rdolbeau/opt/arm/arm-hpc-compiler-19.3_Generic-AArch64_RHEL-7_aarch64-linux/lib/clang/7.1.0/include/mmintrin.h:203:12: error: invalid conversion between vector type '__m64' (vector of 1 'long long' value) and integer type 'int' of different size
encrypt.c: return (__m64)__builtin_ia32_packuswb((__v4hi)__m1, (__v4hi)__m2);
encrypt.c: ^~~~~~~~~~~~~~~~~~~~~~~~~~~~~~~~~~~~~~~~~~~~~~~~~~~~~~~~~~
encrypt.c: /dibona_home_nfs/rdolbeau/opt/arm/arm-hpc-compiler-19.3_Generic-AArch64_RHEL-7_aarch64-linux/lib/clang/7.1.0/include/mmintrin.h:230:12: error: invalid conversion between vector type '__m64' (vector of 1 'long long' value) and integer type 'int' of different size
encrypt.c: return (__m64)__builtin_ia32_punpckhbw((__v8qi)__m1, (__v8qi)__m2);
encrypt.c: ^~~~~~~~~~~~~~~~~~~~~~~~~~~~~~~~~~~~~~~~~~~~~~~~~~~~~~~~~~~
encrypt.c: /dibona_home_nfs/rdolbeau/opt/arm/arm-hpc-compiler-19.3_Generic-AArch64_RHEL-7_aarch64-linux/lib/clang/7.1.0/include/mmintrin.h:253:12: error: invalid conversion between vector type '__m64' (vector of 1 'long long' value) and integer type 'int' of different size
encrypt.c: return (__m64)__builtin_ia32_punpckhwd((__v4hi)__m1, (__v4hi)__m2);
encrypt.c: ^~~~~~~~~~~~~~~~~~~~~~~~~~~~~~~~~~~~~~~~~~~~~~~~~~~~~~~~~~~
encrypt.c: /dibona_home_nfs/rdolbeau/opt/arm/arm-hpc-compiler-19.3_Generic-AArch64_RHEL-7_aarch64-linux/lib/clang/7.1.0/include/mmintrin.h:274:12: error: invalid conversion between vector type '__m64' (vector of 1 'long long' value) and integer type 'int' of different size
encrypt.c: return (__m64)__builtin_ia32_punpckhdq((__v2si)__m1, (__v2si)__m2);
encrypt.c: ^~~~~~~~~~~~~~~~~~~~~~~~~~~~~~~~~~~~~~~~~~~~~~~~~~~~~~~~~~~
encrypt.c: ...

Number of similar (compiler,implementation) pairs: 8, namely:
CompilerImplementations
armclang -march=armv8a+crypto -mcpu=thunderx2t99 -mtune=thunderx2t99 -O2 -fPIC -fPIE ni_p7m1 ni_p7m2 ni_p8m1 ni_p8m2
armclang -march=armv8a+crypto -mcpu=thunderx2t99 -mtune=thunderx2t99 -O3 -fPIC -fPIE ni_p7m1 ni_p7m2 ni_p8m1 ni_p8m2

Compiler output

Implementation: crypto_aead/aes128otrsv3/ni_p7m1
Compiler: gcc -march=native -mtune=native -O2 -fomit-frame-pointer -fwrapv -fPIC -fPIE
encrypt.c: In file included from encrypt.c:33:
encrypt.c: otr.h:30:10: fatal error: x86intrin.h: No such file or directory
encrypt.c: 30 | #include <x86intrin.h>
encrypt.c: | ^~~~~~~~~~~~~
encrypt.c: compilation terminated.

Number of similar (compiler,implementation) pairs: 16, namely:
CompilerImplementations
gcc -march=native -mtune=native -O2 -fomit-frame-pointer -fwrapv -fPIC -fPIE ni_p7m1 ni_p7m2 ni_p8m1 ni_p8m2
gcc -march=native -mtune=native -O3 -fomit-frame-pointer -fwrapv -fPIC -fPIE ni_p7m1 ni_p7m2 ni_p8m1 ni_p8m2
gcc -march=native -mtune=native -O -fomit-frame-pointer -fwrapv -fPIC -fPIE ni_p7m1 ni_p7m2 ni_p8m1 ni_p8m2
gcc -march=native -mtune=native -Os -fomit-frame-pointer -fwrapv -fPIC -fPIE ni_p7m1 ni_p7m2 ni_p8m1 ni_p8m2