Implementation notes: aarch64, pmnod145, crypto_aead/aegis256

Computer: pmnod145
Architecture: aarch64
CPU ID: 431f0af1
SUPERCOP version: 20191017
Operation: crypto_aead
Primitive: aegis256
TimeObject sizeTest sizeImplementationCompilerBenchmark dateSUPERCOP version
1064504320 4096 018603 4976 880refgcc_-march=native_-mtune=native_-O3_-fomit-frame-pointer_-fwrapv_-fPIC_-fPIE2019101820191017
1080504316 4096 017491 4968 864refgcc_-march=native_-mtune=native_-O2_-fomit-frame-pointer_-fwrapv_-fPIC_-fPIE2019101820191017
1094504572 4096 017755 4968 864refgcc_-march=native_-mtune=native_-O_-fomit-frame-pointer_-fwrapv_-fPIC_-fPIE2019101820191017

Compiler output

Implementation: crypto_aead/aegis256/aesni
Compiler: armclang -march=armv8a+crypto -mcpu=thunderx2t99 -mtune=thunderx2t99 -O2 -fPIC -fPIE
encrypt.c: In file included from encrypt.c:4:
encrypt.c: In file included from /dibona_home_nfs/rdolbeau/opt/arm/arm-hpc-compiler-19.3_Generic-AArch64_RHEL-7_aarch64-linux/lib/clang/7.1.0/include/immintrin.h:28:
encrypt.c: /dibona_home_nfs/rdolbeau/opt/arm/arm-hpc-compiler-19.3_Generic-AArch64_RHEL-7_aarch64-linux/lib/clang/7.1.0/include/mmintrin.h:64:12: error: invalid conversion between vector type '__m64' (vector of 1 'long long' value) and integer type 'int' of different size
encrypt.c: return (__m64)__builtin_ia32_vec_init_v2si(__i, 0);
encrypt.c: ^~~~~~~~~~~~~~~~~~~~~~~~~~~~~~~~~~~~~~~~~~~
encrypt.c: /dibona_home_nfs/rdolbeau/opt/arm/arm-hpc-compiler-19.3_Generic-AArch64_RHEL-7_aarch64-linux/lib/clang/7.1.0/include/mmintrin.h:143:12: error: invalid conversion between vector type '__m64' (vector of 1 'long long' value) and integer type 'int' of different size
encrypt.c: return (__m64)__builtin_ia32_packsswb((__v4hi)__m1, (__v4hi)__m2);
encrypt.c: ^~~~~~~~~~~~~~~~~~~~~~~~~~~~~~~~~~~~~~~~~~~~~~~~~~~~~~~~~~
encrypt.c: /dibona_home_nfs/rdolbeau/opt/arm/arm-hpc-compiler-19.3_Generic-AArch64_RHEL-7_aarch64-linux/lib/clang/7.1.0/include/mmintrin.h:173:12: error: invalid conversion between vector type '__m64' (vector of 1 'long long' value) and integer type 'int' of different size
encrypt.c: return (__m64)__builtin_ia32_packssdw((__v2si)__m1, (__v2si)__m2);
encrypt.c: ^~~~~~~~~~~~~~~~~~~~~~~~~~~~~~~~~~~~~~~~~~~~~~~~~~~~~~~~~~
encrypt.c: /dibona_home_nfs/rdolbeau/opt/arm/arm-hpc-compiler-19.3_Generic-AArch64_RHEL-7_aarch64-linux/lib/clang/7.1.0/include/mmintrin.h:203:12: error: invalid conversion between vector type '__m64' (vector of 1 'long long' value) and integer type 'int' of different size
encrypt.c: return (__m64)__builtin_ia32_packuswb((__v4hi)__m1, (__v4hi)__m2);
encrypt.c: ^~~~~~~~~~~~~~~~~~~~~~~~~~~~~~~~~~~~~~~~~~~~~~~~~~~~~~~~~~
encrypt.c: /dibona_home_nfs/rdolbeau/opt/arm/arm-hpc-compiler-19.3_Generic-AArch64_RHEL-7_aarch64-linux/lib/clang/7.1.0/include/mmintrin.h:230:12: error: invalid conversion between vector type '__m64' (vector of 1 'long long' value) and integer type 'int' of different size
encrypt.c: return (__m64)__builtin_ia32_punpckhbw((__v8qi)__m1, (__v8qi)__m2);
encrypt.c: ^~~~~~~~~~~~~~~~~~~~~~~~~~~~~~~~~~~~~~~~~~~~~~~~~~~~~~~~~~~
encrypt.c: /dibona_home_nfs/rdolbeau/opt/arm/arm-hpc-compiler-19.3_Generic-AArch64_RHEL-7_aarch64-linux/lib/clang/7.1.0/include/mmintrin.h:253:12: error: invalid conversion between vector type '__m64' (vector of 1 'long long' value) and integer type 'int' of different size
encrypt.c: return (__m64)__builtin_ia32_punpckhwd((__v4hi)__m1, (__v4hi)__m2);
encrypt.c: ^~~~~~~~~~~~~~~~~~~~~~~~~~~~~~~~~~~~~~~~~~~~~~~~~~~~~~~~~~~
encrypt.c: /dibona_home_nfs/rdolbeau/opt/arm/arm-hpc-compiler-19.3_Generic-AArch64_RHEL-7_aarch64-linux/lib/clang/7.1.0/include/mmintrin.h:274:12: error: invalid conversion between vector type '__m64' (vector of 1 'long long' value) and integer type 'int' of different size
encrypt.c: return (__m64)__builtin_ia32_punpckhdq((__v2si)__m1, (__v2si)__m2);
encrypt.c: ^~~~~~~~~~~~~~~~~~~~~~~~~~~~~~~~~~~~~~~~~~~~~~~~~~~~~~~~~~~
encrypt.c: /dibona_home_nfs/rdolbeau/opt/arm/arm-hpc-compiler-19.3_Generic-AArch64_RHEL-7_aarch64-linux/lib/clang/7.1.0/include/mmintrin.h:301:12: error: invalid conversion between vector type '__m64' (vector of 1 'long long' value) and integer type 'int' of different size
encrypt.c: return (__m64)__builtin_ia32_punpcklbw((__v8qi)__m1, (__v8qi)__m2);
encrypt.c: ...

Number of similar (compiler,implementation) pairs: 2, namely:
CompilerImplementations
armclang -march=armv8a+crypto -mcpu=thunderx2t99 -mtune=thunderx2t99 -O2 -fPIC -fPIE aesni
armclang -march=armv8a+crypto -mcpu=thunderx2t99 -mtune=thunderx2t99 -O3 -fPIC -fPIE aesni

Compiler output

Implementation: crypto_aead/aegis256/ref
Compiler: armclang -march=armv8a+crypto -mcpu=thunderx2t99 -mtune=thunderx2t99 -O2 -fPIC -fPIE
try.c: /dibona_home_nfs/rdolbeau/opt/arm/gcc-8.2.0_Generic-AArch64_RHEL-7_aarch64-linux/lib/gcc/aarch64-linux-gnu/8.2.0/../../../../aarch64-linux-gnu/bin/ld: crypto_aead_aegis256.a(encrypt.o): in function `crypto_aead_aegis256_ref_encrypt':
try.c: encrypt.c:(.text+0x...): undefined reference to `aegis256_initialization'
try.c: /dibona_home_nfs/rdolbeau/opt/arm/gcc-8.2.0_Generic-AArch64_RHEL-7_aarch64-linux/lib/gcc/aarch64-linux-gnu/8.2.0/../../../../aarch64-linux-gnu/bin/ld: crypto_aead_aegis256.a(encrypt.o): in function `crypto_aead_aegis256_ref_decrypt':
try.c: encrypt.c:(.text+0x...): undefined reference to `aegis256_initialization'
try.c: clang-7: error: linker command failed with exit code 1 (use -v to see invocation)

Number of similar (compiler,implementation) pairs: 2, namely:
CompilerImplementations
armclang -march=armv8a+crypto -mcpu=thunderx2t99 -mtune=thunderx2t99 -O2 -fPIC -fPIE ref
armclang -march=armv8a+crypto -mcpu=thunderx2t99 -mtune=thunderx2t99 -O3 -fPIC -fPIE ref

Compiler output

Implementation: crypto_aead/aegis256/aesni
Compiler: gcc -march=native -mtune=native -O2 -fomit-frame-pointer -fwrapv -fPIC -fPIE
encrypt.c: encrypt.c:4:10: fatal error: immintrin.h: No such file or directory
encrypt.c: 4 | #include <immintrin.h>
encrypt.c: | ^~~~~~~~~~~~~
encrypt.c: compilation terminated.

Number of similar (compiler,implementation) pairs: 4, namely:
CompilerImplementations
gcc -march=native -mtune=native -O2 -fomit-frame-pointer -fwrapv -fPIC -fPIE aesni
gcc -march=native -mtune=native -O3 -fomit-frame-pointer -fwrapv -fPIC -fPIE aesni
gcc -march=native -mtune=native -O -fomit-frame-pointer -fwrapv -fPIC -fPIE aesni
gcc -march=native -mtune=native -Os -fomit-frame-pointer -fwrapv -fPIC -fPIE aesni

Compiler output

Implementation: crypto_aead/aegis256/ref
Compiler: gcc -march=native -mtune=native -Os -fomit-frame-pointer -fwrapv -fPIC -fPIE
try.c: /dibona_home_nfs/rdolbeau/gcc-9.2.0-full+isl/lib/gcc/aarch64-unknown-linux-gnu/9.2.0/../../../../aarch64-unknown-linux-gnu/bin/ld: crypto_aead_aegis256.a(encrypt.o): in function `crypto_aead_aegis256_ref_encrypt':
try.c: encrypt.c:(.text+0x...): undefined reference to `aegis256_initialization'
try.c: /dibona_home_nfs/rdolbeau/gcc-9.2.0-full+isl/lib/gcc/aarch64-unknown-linux-gnu/9.2.0/../../../../aarch64-unknown-linux-gnu/bin/ld: encrypt.c:(.text+0x...): undefined reference to `aegis256_enc_aut_step'
try.c: /dibona_home_nfs/rdolbeau/gcc-9.2.0-full+isl/lib/gcc/aarch64-unknown-linux-gnu/9.2.0/../../../../aarch64-unknown-linux-gnu/bin/ld: encrypt.c:(.text+0x...): undefined reference to `aegis256_enc_aut_step'
try.c: /dibona_home_nfs/rdolbeau/gcc-9.2.0-full+isl/lib/gcc/aarch64-unknown-linux-gnu/9.2.0/../../../../aarch64-unknown-linux-gnu/bin/ld: encrypt.c:(.text+0x...): undefined reference to `aegis256_enc_aut_step'
try.c: /dibona_home_nfs/rdolbeau/gcc-9.2.0-full+isl/lib/gcc/aarch64-unknown-linux-gnu/9.2.0/../../../../aarch64-unknown-linux-gnu/bin/ld: encrypt.c:(.text+0x...): undefined reference to `aegis256_enc_aut_step'
try.c: /dibona_home_nfs/rdolbeau/gcc-9.2.0-full+isl/lib/gcc/aarch64-unknown-linux-gnu/9.2.0/../../../../aarch64-unknown-linux-gnu/bin/ld: crypto_aead_aegis256.a(encrypt.o): in function `crypto_aead_aegis256_ref_decrypt':
try.c: encrypt.c:(.text+0x...): undefined reference to `aegis256_initialization'
try.c: /dibona_home_nfs/rdolbeau/gcc-9.2.0-full+isl/lib/gcc/aarch64-unknown-linux-gnu/9.2.0/../../../../aarch64-unknown-linux-gnu/bin/ld: encrypt.c:(.text+0x...): undefined reference to `aegis256_enc_aut_step'
try.c: /dibona_home_nfs/rdolbeau/gcc-9.2.0-full+isl/lib/gcc/aarch64-unknown-linux-gnu/9.2.0/../../../../aarch64-unknown-linux-gnu/bin/ld: encrypt.c:(.text+0x...): undefined reference to `aegis256_dec_aut_step'
try.c: /dibona_home_nfs/rdolbeau/gcc-9.2.0-full+isl/lib/gcc/aarch64-unknown-linux-gnu/9.2.0/../../../../aarch64-unknown-linux-gnu/bin/ld: encrypt.c:(.text+0x...): undefined reference to `aegis256_enc_aut_step'
try.c: /dibona_home_nfs/rdolbeau/gcc-9.2.0-full+isl/lib/gcc/aarch64-unknown-linux-gnu/9.2.0/../../../../aarch64-unknown-linux-gnu/bin/ld: encrypt.c:(.text+0x...): undefined reference to `aegis256_dec_aut_step'
try.c: collect2: error: ld returned 1 exit status

Number of similar (compiler,implementation) pairs: 1, namely:
CompilerImplementations
gcc -march=native -mtune=native -Os -fomit-frame-pointer -fwrapv -fPIC -fPIE ref