Implementation notes: aarch64, pi4b, crypto_aead/ascon128v12

Computer: pi4b
Microarchitecture: aarch64; A72 (410fd083)
Architecture: aarch64
CPU ID: 410fd083
SUPERCOP version: 20221122
Operation: crypto_aead
Primitive: ascon128v12
TimeObject sizeTest sizeImplementationCompilerBenchmark dateSUPERCOP version
6540511664 0 023820 816 848opt64gcc_-march=native_-mtune=native_-O2_-fomit-frame-pointer_-fwrapv_-fPIC_-fPIE2023010320221122
6598711672 0 024788 816 864opt64gcc_-march=native_-mtune=native_-O3_-fomit-frame-pointer_-fwrapv_-fPIC_-fPIE2023010320221122
6872310204 0 024058 840 856opt64clang_-mcpu=native_-O3_-fomit-frame-pointer_-fwrapv_-Qunused-arguments_-fPIC_-fPIE2023010320221122
7227014720 0 027860 816 864refgcc_-march=native_-mtune=native_-O3_-fomit-frame-pointer_-fwrapv_-fPIC_-fPIE2023010320221122
7227211136 0 022300 800 840opt64gcc_-march=native_-mtune=native_-Os_-fomit-frame-pointer_-fwrapv_-fPIC_-fPIE2023010320221122
7654514836 0 026996 816 848opt32gcc_-march=native_-mtune=native_-O2_-fomit-frame-pointer_-fwrapv_-fPIC_-fPIE2023010320221122
7657814836 0 027948 816 864opt32gcc_-march=native_-mtune=native_-O3_-fomit-frame-pointer_-fwrapv_-fPIC_-fPIE2023010320221122
777646124 0 019866 840 856refclang_-mcpu=native_-O3_-fomit-frame-pointer_-fwrapv_-Qunused-arguments_-fPIC_-fPIE2023010320221122
8333313112 0 025299 808 848opt64gcc_-march=native_-mtune=native_-O_-fomit-frame-pointer_-fwrapv_-fPIC_-fPIE2023010320221122
839261420 0 015274 840 856opt64_lowsizeclang_-mcpu=native_-O3_-fomit-frame-pointer_-fwrapv_-Qunused-arguments_-fPIC_-fPIE2023010320221122
856441876 0 015083 824 864opt64_lowsizegcc_-march=native_-mtune=native_-O3_-fomit-frame-pointer_-fwrapv_-fPIC_-fPIE2023010320221122
866521636 0 013891 824 848opt64_lowsizegcc_-march=native_-mtune=native_-O2_-fomit-frame-pointer_-fwrapv_-fPIC_-fPIE2023010320221122
8806414496 0 025668 800 840opt32gcc_-march=native_-mtune=native_-Os_-fomit-frame-pointer_-fwrapv_-fPIC_-fPIE2023010320221122
920801916 0 015115 824 864opt32_lowsizegcc_-march=native_-mtune=native_-O3_-fomit-frame-pointer_-fwrapv_-fPIC_-fPIE2023010320221122
931861576 0 012795 808 840opt64_lowsizegcc_-march=native_-mtune=native_-Os_-fomit-frame-pointer_-fwrapv_-fPIC_-fPIE2023010320221122
938551676 0 013923 824 848opt32_lowsizegcc_-march=native_-mtune=native_-O2_-fomit-frame-pointer_-fwrapv_-fPIC_-fPIE2023010320221122
940298356 0 020540 816 848refgcc_-march=native_-mtune=native_-O2_-fomit-frame-pointer_-fwrapv_-fPIC_-fPIE2023010320221122
10099816228 0 028427 808 848opt32gcc_-march=native_-mtune=native_-O_-fomit-frame-pointer_-fwrapv_-fPIC_-fPIE2023010320221122
1023918440 0 020651 808 848refgcc_-march=native_-mtune=native_-O_-fomit-frame-pointer_-fwrapv_-fPIC_-fPIE2023010320221122
10421812176 0 026018 840 856opt32clang_-mcpu=native_-O3_-fomit-frame-pointer_-fwrapv_-Qunused-arguments_-fPIC_-fPIE2023010320221122
1065051616 0 012827 808 840opt32_lowsizegcc_-march=native_-mtune=native_-Os_-fomit-frame-pointer_-fwrapv_-fPIC_-fPIE2023010320221122
1069692428 0 014682 816 848opt64_lowsizegcc_-march=native_-mtune=native_-O_-fomit-frame-pointer_-fwrapv_-fPIC_-fPIE2023010320221122
1109331444 0 015306 840 856opt32_lowsizeclang_-mcpu=native_-O3_-fomit-frame-pointer_-fwrapv_-Qunused-arguments_-fPIC_-fPIE2023010320221122
1159122468 0 018814 816 848opt32_lowsizegcc_-march=native_-mtune=native_-O_-fomit-frame-pointer_-fwrapv_-fPIC_-fPIE2023010320221122
1448531884 0 013084 800 840refgcc_-march=native_-mtune=native_-Os_-fomit-frame-pointer_-fwrapv_-fPIC_-fPIE2023010320221122
18422810264 0 024106 848 856bi32clang_-mcpu=native_-O3_-fomit-frame-pointer_-fwrapv_-Qunused-arguments_-fPIC_-fPIE2023010320221122
2046972148 0 016018 848 856bi32_lowsizeclang_-mcpu=native_-O3_-fomit-frame-pointer_-fwrapv_-Qunused-arguments_-fPIC_-fPIE2023010320221122
2047357848 0 020124 832 848bi32_lowreggcc_-march=native_-mtune=native_-O2_-fomit-frame-pointer_-fwrapv_-fPIC_-fPIE2023010320221122
2047577832 0 021076 832 864bi32_lowreggcc_-march=native_-mtune=native_-O3_-fomit-frame-pointer_-fwrapv_-fPIC_-fPIE2023010320221122
20611412792 0 025916 824 864bi32gcc_-march=native_-mtune=native_-O3_-fomit-frame-pointer_-fwrapv_-fPIC_-fPIE2023010320221122
20649112788 0 024948 824 848bi32gcc_-march=native_-mtune=native_-O2_-fomit-frame-pointer_-fwrapv_-fPIC_-fPIE2023010320221122
2065146520 0 020482 856 856bi32_lowregclang_-mcpu=native_-O3_-fomit-frame-pointer_-fwrapv_-Qunused-arguments_-fPIC_-fPIE2023010320221122
21634412380 0 023524 808 840bi32gcc_-march=native_-mtune=native_-Os_-fomit-frame-pointer_-fwrapv_-fPIC_-fPIE2023010320221122
2202532692 0 015939 832 864bi32_lowsizegcc_-march=native_-mtune=native_-O3_-fomit-frame-pointer_-fwrapv_-fPIC_-fPIE2023010320221122
2216102400 0 014667 832 848bi32_lowsizegcc_-march=native_-mtune=native_-O2_-fomit-frame-pointer_-fwrapv_-fPIC_-fPIE2023010320221122
22716814172 0 026355 816 848bi32gcc_-march=native_-mtune=native_-O_-fomit-frame-pointer_-fwrapv_-fPIC_-fPIE2023010320221122
2544102276 0 013507 816 840bi32_lowsizegcc_-march=native_-mtune=native_-Os_-fomit-frame-pointer_-fwrapv_-fPIC_-fPIE2023010320221122
2688978852 0 025259 824 848bi32_lowreggcc_-march=native_-mtune=native_-O_-fomit-frame-pointer_-fwrapv_-fPIC_-fPIE2023010320221122
2711067400 0 018668 816 840bi32_lowreggcc_-march=native_-mtune=native_-Os_-fomit-frame-pointer_-fwrapv_-fPIC_-fPIE2023010320221122
2790802556 0 014826 824 848bi32_lowsizegcc_-march=native_-mtune=native_-O_-fomit-frame-pointer_-fwrapv_-fPIC_-fPIE2023010320221122
6621417016 0 018804 824 848bi8gcc_-march=native_-mtune=native_-O2_-fomit-frame-pointer_-fwrapv_-fPIC_-fPIE2023010320221122
7349236992 0 019740 824 864bi8gcc_-march=native_-mtune=native_-O3_-fomit-frame-pointer_-fwrapv_-fPIC_-fPIE2023010320221122
8645715408 0 019290 840 856opt8_lowsizeclang_-mcpu=native_-O3_-fomit-frame-pointer_-fwrapv_-Qunused-arguments_-fPIC_-fPIE2023010320221122
8678195508 0 019394 840 856opt8clang_-mcpu=native_-O3_-fomit-frame-pointer_-fwrapv_-Qunused-arguments_-fPIC_-fPIE2023010320221122
8819655876 0 016812 808 840bi8gcc_-march=native_-mtune=native_-Os_-fomit-frame-pointer_-fwrapv_-fPIC_-fPIE2023010320221122
8960388500 0 020299 816 848bi8gcc_-march=native_-mtune=native_-O_-fomit-frame-pointer_-fwrapv_-fPIC_-fPIE2023010320221122
12743186320 0 019500 816 864opt8gcc_-march=native_-mtune=native_-O3_-fomit-frame-pointer_-fwrapv_-fPIC_-fPIE2023010320221122
12759286160 0 019316 816 864opt8_lowsizegcc_-march=native_-mtune=native_-O3_-fomit-frame-pointer_-fwrapv_-fPIC_-fPIE2023010320221122
13532686440 0 019922 848 856bi8clang_-mcpu=native_-O3_-fomit-frame-pointer_-fwrapv_-Qunused-arguments_-fPIC_-fPIE2023010320221122
13862714064 0 016252 816 848opt8gcc_-march=native_-mtune=native_-O2_-fomit-frame-pointer_-fwrapv_-fPIC_-fPIE2023010320221122
13878593900 0 016084 816 848opt8_lowsizegcc_-march=native_-mtune=native_-O2_-fomit-frame-pointer_-fwrapv_-fPIC_-fPIE2023010320221122
14124153312 0 014492 800 840opt8gcc_-march=native_-mtune=native_-Os_-fomit-frame-pointer_-fwrapv_-fPIC_-fPIE2023010320221122
14206553156 0 014316 800 840opt8_lowsizegcc_-march=native_-mtune=native_-Os_-fomit-frame-pointer_-fwrapv_-fPIC_-fPIE2023010320221122
14899353852 0 016091 808 848opt8gcc_-march=native_-mtune=native_-O_-fomit-frame-pointer_-fwrapv_-fPIC_-fPIE2023010320221122
14915993624 0 015843 808 848opt8_lowsizegcc_-march=native_-mtune=native_-O_-fomit-frame-pointer_-fwrapv_-fPIC_-fPIE2023010320221122

Compiler output

Implementation: armv6
Security model: constbranchindex
Compiler: clang -mcpu=native -O3 -fomit-frame-pointer -fwrapv -Qunused-arguments -fPIC -fPIE
aead.c: In file included from aead.c:4:
aead.c: In file included from ./permutations.h:11:
aead.c: ./round.h:96:44: warning: value size does not match register size specified by the constraint and modifier [-Wasm-operand-widths]
aead.c: [x1_h] "+r"(s->w[1][1]), [x2_l] "+r"(s->w[2][0]), [x2_h] "+r"(s->w[2][1]),
aead.c: ^
aead.c: ./round.h:14:12: note: use constraint modifier "w"
aead.c: "eor %[x2_l], %[x2_l], %[C]\n\t"
aead.c: ^~~~~~~
aead.c: %w[x2_l]
aead.c: ./round.h:96:44: warning: value size does not match register size specified by the constraint and modifier [-Wasm-operand-widths]
aead.c: [x1_h] "+r"(s->w[1][1]), [x2_l] "+r"(s->w[2][0]), [x2_h] "+r"(s->w[2][1]),
aead.c: ^
aead.c: ./round.h:14:21: note: use constraint modifier "w"
aead.c: "eor %[x2_l], %[x2_l], %[C]\n\t"
aead.c: ^~~~~~~
aead.c: %w[x2_l]
aead.c: ./round.h:98:41: warning: value size does not match register size specified by the constraint and modifier [-Wasm-operand-widths]
aead.c: [x4_h] "+r"(s->w[4][1]), [C] "+r"(C), [tmp0] "=r"(tmp0), [tmp1] "=r"(tmp1)
aead.c: ^
aead.c: ./round.h:14:30: note: use constraint modifier "w"
aead.c: "eor %[x2_l], %[x2_l], %[C]\n\t"
aead.c: ^~~~
aead.c: %w[C]
aead.c: ./round.h:95:19: warning: value size does not match register size specified by the constraint and modifier [-Wasm-operand-widths]
aead.c: [x0_l] "+r"(s->w[0][0]), [x0_h] "+r"(s->w[0][1]), [x1_l] "+r"(s->w[1][0]),
aead.c: ...

Number of similar (compiler,implementation) pairs: 1, namely:
CompilerImplementations
clang -mcpu=native -O3 -fomit-frame-pointer -fwrapv -Qunused-arguments -fPIC -fPIE armv6

Compiler output

Implementation: armv6
Security model: constbranchindex
Compiler: gcc -march=native -mtune=native -O2 -fomit-frame-pointer -fwrapv -fPIC -fPIE
permutations.c: /tmp/ccn9ccuI.s: Assembler messages:
permutations.c: /tmp/ccn9ccuI.s:124: Error: immediate out of range at operand 3 -- `eor x13,x13,225'
permutations.c: /tmp/ccn9ccuI.s:222: Error: immediate out of range at operand 3 -- `eor x13,x13,210'
permutations.c: /tmp/ccn9ccuI.s:320: Error: immediate out of range at operand 3 -- `eor x13,x13,195'
permutations.c: /tmp/ccn9ccuI.s:418: Error: immediate out of range at operand 3 -- `eor x13,x13,180'
permutations.c: /tmp/ccn9ccuI.s:516: Error: immediate out of range at operand 3 -- `eor x13,x13,165'
permutations.c: /tmp/ccn9ccuI.s:614: Error: immediate out of range at operand 3 -- `eor x13,x13,150'
permutations.c: /tmp/ccn9ccuI.s:712: Error: immediate out of range at operand 3 -- `eor x13,x13,135'
permutations.c: /tmp/ccn9ccuI.s:908: Error: immediate out of range at operand 3 -- `eor x13,x13,105'
permutations.c: /tmp/ccn9ccuI.s:1006: Error: immediate out of range at operand 3 -- `eor x13,x13,90'
permutations.c: /tmp/ccn9ccuI.s:1104: Error: immediate out of range at operand 3 -- `eor x13,x13,75'
permutations.c: /tmp/ccn9ccuI.s:1219: Error: immediate out of range at operand 3 -- `eor x13,x13,150'
permutations.c: /tmp/ccn9ccuI.s:1317: Error: immediate out of range at operand 3 -- `eor x13,x13,135'
permutations.c: /tmp/ccn9ccuI.s:1513: Error: immediate out of range at operand 3 -- `eor x13,x13,105'
permutations.c: /tmp/ccn9ccuI.s:1611: Error: immediate out of range at operand 3 -- `eor x13,x13,90'
permutations.c: /tmp/ccn9ccuI.s:1709: Error: immediate out of range at operand 3 -- `eor x13,x13,75'

Number of similar (compiler,implementation) pairs: 1, namely:
CompilerImplementations
gcc -march=native -mtune=native -O2 -fomit-frame-pointer -fwrapv -fPIC -fPIE armv6

Compiler output

Implementation: armv6
Security model: constbranchindex
Compiler: gcc -march=native -mtune=native -O3 -fomit-frame-pointer -fwrapv -fPIC -fPIE
permutations.c: /tmp/ccGlLdro.s: Assembler messages:
permutations.c: /tmp/ccGlLdro.s:124: Error: immediate out of range at operand 3 -- `eor x13,x13,225'
permutations.c: /tmp/ccGlLdro.s:222: Error: immediate out of range at operand 3 -- `eor x13,x13,210'
permutations.c: /tmp/ccGlLdro.s:320: Error: immediate out of range at operand 3 -- `eor x13,x13,195'
permutations.c: /tmp/ccGlLdro.s:418: Error: immediate out of range at operand 3 -- `eor x13,x13,180'
permutations.c: /tmp/ccGlLdro.s:516: Error: immediate out of range at operand 3 -- `eor x13,x13,165'
permutations.c: /tmp/ccGlLdro.s:614: Error: immediate out of range at operand 3 -- `eor x13,x13,150'
permutations.c: /tmp/ccGlLdro.s:712: Error: immediate out of range at operand 3 -- `eor x13,x13,135'
permutations.c: /tmp/ccGlLdro.s:908: Error: immediate out of range at operand 3 -- `eor x13,x13,105'
permutations.c: /tmp/ccGlLdro.s:1006: Error: immediate out of range at operand 3 -- `eor x13,x13,90'
permutations.c: /tmp/ccGlLdro.s:1104: Error: immediate out of range at operand 3 -- `eor x13,x13,75'
permutations.c: /tmp/ccGlLdro.s:1219: Error: immediate out of range at operand 3 -- `eor x13,x13,150'
permutations.c: /tmp/ccGlLdro.s:1317: Error: immediate out of range at operand 3 -- `eor x13,x13,135'
permutations.c: /tmp/ccGlLdro.s:1513: Error: immediate out of range at operand 3 -- `eor x13,x13,105'
permutations.c: /tmp/ccGlLdro.s:1611: Error: immediate out of range at operand 3 -- `eor x13,x13,90'
permutations.c: /tmp/ccGlLdro.s:1709: Error: immediate out of range at operand 3 -- `eor x13,x13,75'

Number of similar (compiler,implementation) pairs: 1, namely:
CompilerImplementations
gcc -march=native -mtune=native -O3 -fomit-frame-pointer -fwrapv -fPIC -fPIE armv6

Compiler output

Implementation: armv6
Security model: constbranchindex
Compiler: gcc -march=native -mtune=native -O -fomit-frame-pointer -fwrapv -fPIC -fPIE
permutations.c: /tmp/ccYdRahI.s: Assembler messages:
permutations.c: /tmp/ccYdRahI.s:125: Error: immediate out of range at operand 3 -- `eor x13,x13,225'
permutations.c: /tmp/ccYdRahI.s:223: Error: immediate out of range at operand 3 -- `eor x13,x13,210'
permutations.c: /tmp/ccYdRahI.s:321: Error: immediate out of range at operand 3 -- `eor x13,x13,195'
permutations.c: /tmp/ccYdRahI.s:419: Error: immediate out of range at operand 3 -- `eor x13,x13,180'
permutations.c: /tmp/ccYdRahI.s:517: Error: immediate out of range at operand 3 -- `eor x13,x13,165'
permutations.c: /tmp/ccYdRahI.s:615: Error: immediate out of range at operand 3 -- `eor x13,x13,150'
permutations.c: /tmp/ccYdRahI.s:713: Error: immediate out of range at operand 3 -- `eor x13,x13,135'
permutations.c: /tmp/ccYdRahI.s:909: Error: immediate out of range at operand 3 -- `eor x13,x13,105'
permutations.c: /tmp/ccYdRahI.s:1007: Error: immediate out of range at operand 3 -- `eor x13,x13,90'
permutations.c: /tmp/ccYdRahI.s:1105: Error: immediate out of range at operand 3 -- `eor x13,x13,75'
permutations.c: /tmp/ccYdRahI.s:1223: Error: immediate out of range at operand 3 -- `eor x8,x8,150'
permutations.c: /tmp/ccYdRahI.s:1321: Error: immediate out of range at operand 3 -- `eor x13,x13,135'
permutations.c: /tmp/ccYdRahI.s:1517: Error: immediate out of range at operand 3 -- `eor x13,x13,105'
permutations.c: /tmp/ccYdRahI.s:1615: Error: immediate out of range at operand 3 -- `eor x13,x13,90'
permutations.c: /tmp/ccYdRahI.s:1713: Error: immediate out of range at operand 3 -- `eor x13,x13,75'

Number of similar (compiler,implementation) pairs: 1, namely:
CompilerImplementations
gcc -march=native -mtune=native -O -fomit-frame-pointer -fwrapv -fPIC -fPIE armv6

Compiler output

Implementation: armv6
Security model: constbranchindex
Compiler: gcc -march=native -mtune=native -Os -fomit-frame-pointer -fwrapv -fPIC -fPIE
permutations.c: /tmp/ccPEyn49.s: Assembler messages:
permutations.c: /tmp/ccPEyn49.s:123: Error: immediate out of range at operand 3 -- `eor x13,x13,225'
permutations.c: /tmp/ccPEyn49.s:221: Error: immediate out of range at operand 3 -- `eor x13,x13,210'
permutations.c: /tmp/ccPEyn49.s:319: Error: immediate out of range at operand 3 -- `eor x13,x13,195'
permutations.c: /tmp/ccPEyn49.s:417: Error: immediate out of range at operand 3 -- `eor x13,x13,180'
permutations.c: /tmp/ccPEyn49.s:515: Error: immediate out of range at operand 3 -- `eor x13,x13,165'
permutations.c: /tmp/ccPEyn49.s:613: Error: immediate out of range at operand 3 -- `eor x13,x13,150'
permutations.c: /tmp/ccPEyn49.s:711: Error: immediate out of range at operand 3 -- `eor x13,x13,135'
permutations.c: /tmp/ccPEyn49.s:907: Error: immediate out of range at operand 3 -- `eor x13,x13,105'
permutations.c: /tmp/ccPEyn49.s:1005: Error: immediate out of range at operand 3 -- `eor x13,x13,90'
permutations.c: /tmp/ccPEyn49.s:1103: Error: immediate out of range at operand 3 -- `eor x13,x13,75'
permutations.c: /tmp/ccPEyn49.s:1217: Error: immediate out of range at operand 3 -- `eor x13,x13,150'
permutations.c: /tmp/ccPEyn49.s:1315: Error: immediate out of range at operand 3 -- `eor x13,x13,135'
permutations.c: /tmp/ccPEyn49.s:1511: Error: immediate out of range at operand 3 -- `eor x13,x13,105'
permutations.c: /tmp/ccPEyn49.s:1609: Error: immediate out of range at operand 3 -- `eor x13,x13,90'
permutations.c: /tmp/ccPEyn49.s:1707: Error: immediate out of range at operand 3 -- `eor x13,x13,75'

Number of similar (compiler,implementation) pairs: 1, namely:
CompilerImplementations
gcc -march=native -mtune=native -Os -fomit-frame-pointer -fwrapv -fPIC -fPIE armv6

Compiler output

Implementation: armv6_lowsize
Security model: constbranchindex
Compiler: clang -mcpu=native -O3 -fomit-frame-pointer -fwrapv -Qunused-arguments -fPIC -fPIE
aead.c: In file included from aead.c:3:
aead.c: In file included from ./permutations.h:11:
aead.c: ./round.h:96:44: warning: value size does not match register size specified by the constraint and modifier [-Wasm-operand-widths]
aead.c: [x1_h] "+r"(s->w[1][1]), [x2_l] "+r"(s->w[2][0]), [x2_h] "+r"(s->w[2][1]),
aead.c: ^
aead.c: ./round.h:14:12: note: use constraint modifier "w"
aead.c: "eor %[x2_l], %[x2_l], %[C]\n\t"
aead.c: ^~~~~~~
aead.c: %w[x2_l]
aead.c: ./round.h:96:44: warning: value size does not match register size specified by the constraint and modifier [-Wasm-operand-widths]
aead.c: [x1_h] "+r"(s->w[1][1]), [x2_l] "+r"(s->w[2][0]), [x2_h] "+r"(s->w[2][1]),
aead.c: ^
aead.c: ./round.h:14:21: note: use constraint modifier "w"
aead.c: "eor %[x2_l], %[x2_l], %[C]\n\t"
aead.c: ^~~~~~~
aead.c: %w[x2_l]
aead.c: ./round.h:98:41: warning: value size does not match register size specified by the constraint and modifier [-Wasm-operand-widths]
aead.c: [x4_h] "+r"(s->w[4][1]), [C] "+r"(C), [tmp0] "=r"(tmp0), [tmp1] "=r"(tmp1)
aead.c: ^
aead.c: ./round.h:14:30: note: use constraint modifier "w"
aead.c: "eor %[x2_l], %[x2_l], %[C]\n\t"
aead.c: ^~~~
aead.c: %w[C]
aead.c: ./round.h:95:19: warning: value size does not match register size specified by the constraint and modifier [-Wasm-operand-widths]
aead.c: [x0_l] "+r"(s->w[0][0]), [x0_h] "+r"(s->w[0][1]), [x1_l] "+r"(s->w[1][0]),
aead.c: ...

Number of similar (compiler,implementation) pairs: 1, namely:
CompilerImplementations
clang -mcpu=native -O3 -fomit-frame-pointer -fwrapv -Qunused-arguments -fPIC -fPIE armv6_lowsize

Compiler output

Implementation: armv6_lowsize
Security model: constbranchindex
Compiler: gcc -march=native -mtune=native -O2 -fomit-frame-pointer -fwrapv -fPIC -fPIE
permutations.c: /tmp/ccgr94sj.s: Assembler messages:
permutations.c: /tmp/ccgr94sj.s:100: Error: operand 2 must be an integer or stack pointer register -- `sub x1,#15'

Number of similar (compiler,implementation) pairs: 1, namely:
CompilerImplementations
gcc -march=native -mtune=native -O2 -fomit-frame-pointer -fwrapv -fPIC -fPIE armv6_lowsize

Compiler output

Implementation: armv6_lowsize
Security model: constbranchindex
Compiler: gcc -march=native -mtune=native -O3 -fomit-frame-pointer -fwrapv -fPIC -fPIE
permutations.c: /tmp/ccs3ENdB.s: Assembler messages:
permutations.c: /tmp/ccs3ENdB.s:100: Error: operand 2 must be an integer or stack pointer register -- `sub x1,#15'

Number of similar (compiler,implementation) pairs: 1, namely:
CompilerImplementations
gcc -march=native -mtune=native -O3 -fomit-frame-pointer -fwrapv -fPIC -fPIE armv6_lowsize

Compiler output

Implementation: armv6_lowsize
Security model: constbranchindex
Compiler: gcc -march=native -mtune=native -O -fomit-frame-pointer -fwrapv -fPIC -fPIE
permutations.c: /tmp/cc79Buvi.s: Assembler messages:
permutations.c: /tmp/cc79Buvi.s:104: Error: operand 2 must be an integer or stack pointer register -- `sub x1,#15'

Number of similar (compiler,implementation) pairs: 1, namely:
CompilerImplementations
gcc -march=native -mtune=native -O -fomit-frame-pointer -fwrapv -fPIC -fPIE armv6_lowsize

Compiler output

Implementation: armv6_lowsize
Security model: constbranchindex
Compiler: gcc -march=native -mtune=native -Os -fomit-frame-pointer -fwrapv -fPIC -fPIE
permutations.c: /tmp/ccwHJLlc.s: Assembler messages:
permutations.c: /tmp/ccwHJLlc.s:100: Error: operand 2 must be an integer or stack pointer register -- `sub x1,#15'

Number of similar (compiler,implementation) pairs: 1, namely:
CompilerImplementations
gcc -march=native -mtune=native -Os -fomit-frame-pointer -fwrapv -fPIC -fPIE armv6_lowsize

Compiler output

Implementation: armv6m
Security model: constbranchindex
Compiler: clang -mcpu=native -O3 -fomit-frame-pointer -fwrapv -Qunused-arguments -fPIC -fPIE
aead.c: In file included from aead.c:4:
aead.c: In file included from ./permutations.h:11:
aead.c: ./round.h:173:14: error: invalid output constraint '+l' in asm
aead.c: [x0_l] "+l"(s->w[0][0]), [x0_h] "+h"(s->w[0][1]), [x1_l] "+l"(s->w[1][0]),
aead.c: ^
aead.c: ./round.h:338:14: error: invalid output constraint '+l' in asm
aead.c: [x0_l] "+l"(s->w[0][0]), [x0_h] "+h"(s->w[0][1]), [x1_l] "+l"(s->w[1][0]),
aead.c: ^
aead.c: 2 errors generated.

Number of similar (compiler,implementation) pairs: 1, namely:
CompilerImplementations
clang -mcpu=native -O3 -fomit-frame-pointer -fwrapv -Qunused-arguments -fPIC -fPIE armv6m

Compiler output

Implementation: armv6m
Security model: constbranchindex
Compiler: gcc -march=native -mtune=native -O2 -fomit-frame-pointer -fwrapv -fPIC -fPIE
aead.c: In file included from permutations.h:11,
aead.c: from aead.c:4:
aead.c: aead.c: In function 'crypto_aead_ascon128v12_armv6m_constbranchindex_encrypt':
aead.c: round.h:12:3: error: impossible constraint in 'asm'
aead.c: 12 | __asm__ __volatile__(
aead.c: | ^~~~~~~
aead.c: round.h:12:3: error: impossible constraint in 'asm'
aead.c: 12 | __asm__ __volatile__(
aead.c: | ^~~~~~~
aead.c: round.h:12:3: error: impossible constraint in 'asm'
aead.c: 12 | __asm__ __volatile__(
aead.c: | ^~~~~~~
aead.c: round.h:12:3: error: impossible constraint in 'asm'
aead.c: 12 | __asm__ __volatile__(
aead.c: | ^~~~~~~
aead.c: round.h:12:3: error: impossible constraint in 'asm'
aead.c: 12 | __asm__ __volatile__(
aead.c: | ^~~~~~~

Number of similar (compiler,implementation) pairs: 4, namely:
CompilerImplementations
gcc -march=native -mtune=native -O2 -fomit-frame-pointer -fwrapv -fPIC -fPIE armv6m
gcc -march=native -mtune=native -O3 -fomit-frame-pointer -fwrapv -fPIC -fPIE armv6m
gcc -march=native -mtune=native -O -fomit-frame-pointer -fwrapv -fPIC -fPIE armv6m
gcc -march=native -mtune=native -Os -fomit-frame-pointer -fwrapv -fPIC -fPIE armv6m

Compiler output

Implementation: armv6m_lowsize
Security model: constbranchindex
Compiler: clang -mcpu=native -O3 -fomit-frame-pointer -fwrapv -Qunused-arguments -fPIC -fPIE
aead.c: In file included from aead.c:3:
aead.c: In file included from ./permutations.h:11:
aead.c: ./round.h:173:14: error: invalid output constraint '+l' in asm
aead.c: [x0_l] "+l"(s->w[0][0]), [x0_h] "+h"(s->w[0][1]), [x1_l] "+l"(s->w[1][0]),
aead.c: ^
aead.c: ./round.h:338:14: error: invalid output constraint '+l' in asm
aead.c: [x0_l] "+l"(s->w[0][0]), [x0_h] "+h"(s->w[0][1]), [x1_l] "+l"(s->w[1][0]),
aead.c: ^
aead.c: 2 errors generated.

Number of similar (compiler,implementation) pairs: 1, namely:
CompilerImplementations
clang -mcpu=native -O3 -fomit-frame-pointer -fwrapv -Qunused-arguments -fPIC -fPIE armv6m_lowsize

Compiler output

Implementation: armv6m_lowsize
Security model: constbranchindex
Compiler: gcc -march=native -mtune=native -O2 -fomit-frame-pointer -fwrapv -fPIC -fPIE
permutations.c: In file included from permutations.h:11,
permutations.c: from permutations.c:1:
permutations.c: permutations.c: In function 'P':
permutations.c: round.h:12:3: error: impossible constraint in 'asm'
permutations.c: 12 | __asm__ __volatile__(
permutations.c: | ^~~~~~~

Number of similar (compiler,implementation) pairs: 4, namely:
CompilerImplementations
gcc -march=native -mtune=native -O2 -fomit-frame-pointer -fwrapv -fPIC -fPIE armv6m_lowsize
gcc -march=native -mtune=native -O3 -fomit-frame-pointer -fwrapv -fPIC -fPIE armv6m_lowsize
gcc -march=native -mtune=native -O -fomit-frame-pointer -fwrapv -fPIC -fPIE armv6m_lowsize
gcc -march=native -mtune=native -Os -fomit-frame-pointer -fwrapv -fPIC -fPIE armv6m_lowsize

Compiler output

Implementation: armv7m
Security model: constbranchindex
Compiler: clang -mcpu=native -O3 -fomit-frame-pointer -fwrapv -Qunused-arguments -fPIC -fPIE
aead.c: In file included from aead.c:4:
aead.c: In file included from ./permutations.h:11:
aead.c: ./round.h:92:44: warning: value size does not match register size specified by the constraint and modifier [-Wasm-operand-widths]
aead.c: [x1_h] "+r"(s->w[1][1]), [x2_l] "+r"(s->w[2][0]), [x2_h] "+r"(s->w[2][1]),
aead.c: ^
aead.c: ./round.h:14:12: note: use constraint modifier "w"
aead.c: "eor %[x2_l], %[x2_l], %[C]\n\t"
aead.c: ^~~~~~~
aead.c: %w[x2_l]
aead.c: ./round.h:92:44: warning: value size does not match register size specified by the constraint and modifier [-Wasm-operand-widths]
aead.c: [x1_h] "+r"(s->w[1][1]), [x2_l] "+r"(s->w[2][0]), [x2_h] "+r"(s->w[2][1]),
aead.c: ^
aead.c: ./round.h:14:21: note: use constraint modifier "w"
aead.c: "eor %[x2_l], %[x2_l], %[C]\n\t"
aead.c: ^~~~~~~
aead.c: %w[x2_l]
aead.c: ./round.h:94:41: warning: value size does not match register size specified by the constraint and modifier [-Wasm-operand-widths]
aead.c: [x4_h] "+r"(s->w[4][1]), [C] "+r"(C), [tmp0] "=r"(tmp0), [tmp1] "=r"(tmp1)
aead.c: ^
aead.c: ./round.h:14:30: note: use constraint modifier "w"
aead.c: "eor %[x2_l], %[x2_l], %[C]\n\t"
aead.c: ^~~~
aead.c: %w[C]
aead.c: ./round.h:91:19: warning: value size does not match register size specified by the constraint and modifier [-Wasm-operand-widths]
aead.c: [x0_l] "+r"(s->w[0][0]), [x0_h] "+r"(s->w[0][1]), [x1_l] "+r"(s->w[1][0]),
aead.c: ...

Number of similar (compiler,implementation) pairs: 2, namely:
CompilerImplementations
clang -mcpu=native -O3 -fomit-frame-pointer -fwrapv -Qunused-arguments -fPIC -fPIE armv7m armv7m_small

Compiler output

Implementation: armv7m
Security model: constbranchindex
Compiler: gcc -march=native -mtune=native -O2 -fomit-frame-pointer -fwrapv -fPIC -fPIE
permutations.c: /tmp/ccUj1BoR.s: Assembler messages:
permutations.c: /tmp/ccUj1BoR.s:122: Error: immediate out of range at operand 3 -- `eor x13,x13,225'
permutations.c: /tmp/ccUj1BoR.s:218: Error: immediate out of range at operand 3 -- `eor x13,x13,210'
permutations.c: /tmp/ccUj1BoR.s:314: Error: immediate out of range at operand 3 -- `eor x13,x13,195'
permutations.c: /tmp/ccUj1BoR.s:410: Error: immediate out of range at operand 3 -- `eor x13,x13,180'
permutations.c: /tmp/ccUj1BoR.s:506: Error: immediate out of range at operand 3 -- `eor x13,x13,165'
permutations.c: /tmp/ccUj1BoR.s:602: Error: immediate out of range at operand 3 -- `eor x13,x13,150'
permutations.c: /tmp/ccUj1BoR.s:698: Error: immediate out of range at operand 3 -- `eor x13,x13,135'
permutations.c: /tmp/ccUj1BoR.s:890: Error: immediate out of range at operand 3 -- `eor x13,x13,105'
permutations.c: /tmp/ccUj1BoR.s:986: Error: immediate out of range at operand 3 -- `eor x13,x13,90'
permutations.c: /tmp/ccUj1BoR.s:1082: Error: immediate out of range at operand 3 -- `eor x13,x13,75'
permutations.c: /tmp/ccUj1BoR.s:1195: Error: immediate out of range at operand 3 -- `eor x13,x13,150'
permutations.c: /tmp/ccUj1BoR.s:1291: Error: immediate out of range at operand 3 -- `eor x13,x13,135'
permutations.c: /tmp/ccUj1BoR.s:1483: Error: immediate out of range at operand 3 -- `eor x13,x13,105'
permutations.c: /tmp/ccUj1BoR.s:1579: Error: immediate out of range at operand 3 -- `eor x13,x13,90'
permutations.c: /tmp/ccUj1BoR.s:1675: Error: immediate out of range at operand 3 -- `eor x13,x13,75'

Number of similar (compiler,implementation) pairs: 1, namely:
CompilerImplementations
gcc -march=native -mtune=native -O2 -fomit-frame-pointer -fwrapv -fPIC -fPIE armv7m

Compiler output

Implementation: armv7m
Security model: constbranchindex
Compiler: gcc -march=native -mtune=native -O3 -fomit-frame-pointer -fwrapv -fPIC -fPIE
permutations.c: /tmp/cce89VLS.s: Assembler messages:
permutations.c: /tmp/cce89VLS.s:122: Error: immediate out of range at operand 3 -- `eor x13,x13,225'
permutations.c: /tmp/cce89VLS.s:218: Error: immediate out of range at operand 3 -- `eor x13,x13,210'
permutations.c: /tmp/cce89VLS.s:314: Error: immediate out of range at operand 3 -- `eor x13,x13,195'
permutations.c: /tmp/cce89VLS.s:410: Error: immediate out of range at operand 3 -- `eor x13,x13,180'
permutations.c: /tmp/cce89VLS.s:506: Error: immediate out of range at operand 3 -- `eor x13,x13,165'
permutations.c: /tmp/cce89VLS.s:602: Error: immediate out of range at operand 3 -- `eor x13,x13,150'
permutations.c: /tmp/cce89VLS.s:698: Error: immediate out of range at operand 3 -- `eor x13,x13,135'
permutations.c: /tmp/cce89VLS.s:890: Error: immediate out of range at operand 3 -- `eor x13,x13,105'
permutations.c: /tmp/cce89VLS.s:986: Error: immediate out of range at operand 3 -- `eor x13,x13,90'
permutations.c: /tmp/cce89VLS.s:1082: Error: immediate out of range at operand 3 -- `eor x13,x13,75'
permutations.c: /tmp/cce89VLS.s:1195: Error: immediate out of range at operand 3 -- `eor x13,x13,150'
permutations.c: /tmp/cce89VLS.s:1291: Error: immediate out of range at operand 3 -- `eor x13,x13,135'
permutations.c: /tmp/cce89VLS.s:1483: Error: immediate out of range at operand 3 -- `eor x13,x13,105'
permutations.c: /tmp/cce89VLS.s:1579: Error: immediate out of range at operand 3 -- `eor x13,x13,90'
permutations.c: /tmp/cce89VLS.s:1675: Error: immediate out of range at operand 3 -- `eor x13,x13,75'

Number of similar (compiler,implementation) pairs: 1, namely:
CompilerImplementations
gcc -march=native -mtune=native -O3 -fomit-frame-pointer -fwrapv -fPIC -fPIE armv7m

Compiler output

Implementation: armv7m
Security model: constbranchindex
Compiler: gcc -march=native -mtune=native -O -fomit-frame-pointer -fwrapv -fPIC -fPIE
permutations.c: /tmp/ccKaX3cv.s: Assembler messages:
permutations.c: /tmp/ccKaX3cv.s:123: Error: immediate out of range at operand 3 -- `eor x13,x13,225'
permutations.c: /tmp/ccKaX3cv.s:219: Error: immediate out of range at operand 3 -- `eor x13,x13,210'
permutations.c: /tmp/ccKaX3cv.s:315: Error: immediate out of range at operand 3 -- `eor x13,x13,195'
permutations.c: /tmp/ccKaX3cv.s:411: Error: immediate out of range at operand 3 -- `eor x13,x13,180'
permutations.c: /tmp/ccKaX3cv.s:507: Error: immediate out of range at operand 3 -- `eor x13,x13,165'
permutations.c: /tmp/ccKaX3cv.s:603: Error: immediate out of range at operand 3 -- `eor x13,x13,150'
permutations.c: /tmp/ccKaX3cv.s:699: Error: immediate out of range at operand 3 -- `eor x13,x13,135'
permutations.c: /tmp/ccKaX3cv.s:891: Error: immediate out of range at operand 3 -- `eor x13,x13,105'
permutations.c: /tmp/ccKaX3cv.s:987: Error: immediate out of range at operand 3 -- `eor x13,x13,90'
permutations.c: /tmp/ccKaX3cv.s:1083: Error: immediate out of range at operand 3 -- `eor x13,x13,75'
permutations.c: /tmp/ccKaX3cv.s:1199: Error: immediate out of range at operand 3 -- `eor x8,x8,150'
permutations.c: /tmp/ccKaX3cv.s:1295: Error: immediate out of range at operand 3 -- `eor x13,x13,135'
permutations.c: /tmp/ccKaX3cv.s:1487: Error: immediate out of range at operand 3 -- `eor x13,x13,105'
permutations.c: /tmp/ccKaX3cv.s:1583: Error: immediate out of range at operand 3 -- `eor x13,x13,90'
permutations.c: /tmp/ccKaX3cv.s:1679: Error: immediate out of range at operand 3 -- `eor x13,x13,75'

Number of similar (compiler,implementation) pairs: 1, namely:
CompilerImplementations
gcc -march=native -mtune=native -O -fomit-frame-pointer -fwrapv -fPIC -fPIE armv7m

Compiler output

Implementation: armv7m
Security model: constbranchindex
Compiler: gcc -march=native -mtune=native -Os -fomit-frame-pointer -fwrapv -fPIC -fPIE
permutations.c: /tmp/ccmnvE9o.s: Assembler messages:
permutations.c: /tmp/ccmnvE9o.s:121: Error: immediate out of range at operand 3 -- `eor x13,x13,225'
permutations.c: /tmp/ccmnvE9o.s:217: Error: immediate out of range at operand 3 -- `eor x13,x13,210'
permutations.c: /tmp/ccmnvE9o.s:313: Error: immediate out of range at operand 3 -- `eor x13,x13,195'
permutations.c: /tmp/ccmnvE9o.s:409: Error: immediate out of range at operand 3 -- `eor x13,x13,180'
permutations.c: /tmp/ccmnvE9o.s:505: Error: immediate out of range at operand 3 -- `eor x13,x13,165'
permutations.c: /tmp/ccmnvE9o.s:601: Error: immediate out of range at operand 3 -- `eor x13,x13,150'
permutations.c: /tmp/ccmnvE9o.s:697: Error: immediate out of range at operand 3 -- `eor x13,x13,135'
permutations.c: /tmp/ccmnvE9o.s:889: Error: immediate out of range at operand 3 -- `eor x13,x13,105'
permutations.c: /tmp/ccmnvE9o.s:985: Error: immediate out of range at operand 3 -- `eor x13,x13,90'
permutations.c: /tmp/ccmnvE9o.s:1081: Error: immediate out of range at operand 3 -- `eor x13,x13,75'
permutations.c: /tmp/ccmnvE9o.s:1193: Error: immediate out of range at operand 3 -- `eor x13,x13,150'
permutations.c: /tmp/ccmnvE9o.s:1289: Error: immediate out of range at operand 3 -- `eor x13,x13,135'
permutations.c: /tmp/ccmnvE9o.s:1481: Error: immediate out of range at operand 3 -- `eor x13,x13,105'
permutations.c: /tmp/ccmnvE9o.s:1577: Error: immediate out of range at operand 3 -- `eor x13,x13,90'
permutations.c: /tmp/ccmnvE9o.s:1673: Error: immediate out of range at operand 3 -- `eor x13,x13,75'

Number of similar (compiler,implementation) pairs: 1, namely:
CompilerImplementations
gcc -march=native -mtune=native -Os -fomit-frame-pointer -fwrapv -fPIC -fPIE armv7m

Compiler output

Implementation: armv7m_lowsize
Security model: constbranchindex
Compiler: clang -mcpu=native -O3 -fomit-frame-pointer -fwrapv -Qunused-arguments -fPIC -fPIE
aead.c: In file included from aead.c:3:
aead.c: In file included from ./permutations.h:11:
aead.c: ./round.h:92:44: warning: value size does not match register size specified by the constraint and modifier [-Wasm-operand-widths]
aead.c: [x1_h] "+r"(s->w[1][1]), [x2_l] "+r"(s->w[2][0]), [x2_h] "+r"(s->w[2][1]),
aead.c: ^
aead.c: ./round.h:14:12: note: use constraint modifier "w"
aead.c: "eor %[x2_l], %[x2_l], %[C]\n\t"
aead.c: ^~~~~~~
aead.c: %w[x2_l]
aead.c: ./round.h:92:44: warning: value size does not match register size specified by the constraint and modifier [-Wasm-operand-widths]
aead.c: [x1_h] "+r"(s->w[1][1]), [x2_l] "+r"(s->w[2][0]), [x2_h] "+r"(s->w[2][1]),
aead.c: ^
aead.c: ./round.h:14:21: note: use constraint modifier "w"
aead.c: "eor %[x2_l], %[x2_l], %[C]\n\t"
aead.c: ^~~~~~~
aead.c: %w[x2_l]
aead.c: ./round.h:94:41: warning: value size does not match register size specified by the constraint and modifier [-Wasm-operand-widths]
aead.c: [x4_h] "+r"(s->w[4][1]), [C] "+r"(C), [tmp0] "=r"(tmp0), [tmp1] "=r"(tmp1)
aead.c: ^
aead.c: ./round.h:14:30: note: use constraint modifier "w"
aead.c: "eor %[x2_l], %[x2_l], %[C]\n\t"
aead.c: ^~~~
aead.c: %w[C]
aead.c: ./round.h:91:19: warning: value size does not match register size specified by the constraint and modifier [-Wasm-operand-widths]
aead.c: [x0_l] "+r"(s->w[0][0]), [x0_h] "+r"(s->w[0][1]), [x1_l] "+r"(s->w[1][0]),
aead.c: ...

Number of similar (compiler,implementation) pairs: 1, namely:
CompilerImplementations
clang -mcpu=native -O3 -fomit-frame-pointer -fwrapv -Qunused-arguments -fPIC -fPIE armv7m_lowsize

Compiler output

Implementation: armv7m_lowsize
Security model: constbranchindex
Compiler: gcc -march=native -mtune=native -O2 -fomit-frame-pointer -fwrapv -fPIC -fPIE
permutations.c: /tmp/cc1E87wU.s: Assembler messages:
permutations.c: /tmp/cc1E87wU.s:96: Error: operand 2 must be an integer or stack pointer register -- `sub x1,#15'

Number of similar (compiler,implementation) pairs: 1, namely:
CompilerImplementations
gcc -march=native -mtune=native -O2 -fomit-frame-pointer -fwrapv -fPIC -fPIE armv7m_lowsize

Compiler output

Implementation: armv7m_lowsize
Security model: constbranchindex
Compiler: gcc -march=native -mtune=native -O3 -fomit-frame-pointer -fwrapv -fPIC -fPIE
permutations.c: /tmp/ccvtgGMb.s: Assembler messages:
permutations.c: /tmp/ccvtgGMb.s:96: Error: operand 2 must be an integer or stack pointer register -- `sub x1,#15'

Number of similar (compiler,implementation) pairs: 1, namely:
CompilerImplementations
gcc -march=native -mtune=native -O3 -fomit-frame-pointer -fwrapv -fPIC -fPIE armv7m_lowsize

Compiler output

Implementation: armv7m_lowsize
Security model: constbranchindex
Compiler: gcc -march=native -mtune=native -O -fomit-frame-pointer -fwrapv -fPIC -fPIE
permutations.c: /tmp/ccE5THjq.s: Assembler messages:
permutations.c: /tmp/ccE5THjq.s:100: Error: operand 2 must be an integer or stack pointer register -- `sub x1,#15'

Number of similar (compiler,implementation) pairs: 1, namely:
CompilerImplementations
gcc -march=native -mtune=native -O -fomit-frame-pointer -fwrapv -fPIC -fPIE armv7m_lowsize

Compiler output

Implementation: armv7m_lowsize
Security model: constbranchindex
Compiler: gcc -march=native -mtune=native -Os -fomit-frame-pointer -fwrapv -fPIC -fPIE
permutations.c: /tmp/cc0PktIv.s: Assembler messages:
permutations.c: /tmp/cc0PktIv.s:96: Error: operand 2 must be an integer or stack pointer register -- `sub x1,#15'

Number of similar (compiler,implementation) pairs: 1, namely:
CompilerImplementations
gcc -march=native -mtune=native -Os -fomit-frame-pointer -fwrapv -fPIC -fPIE armv7m_lowsize

Compiler output

Implementation: armv7m_small
Security model: constbranchindex
Compiler: gcc -march=native -mtune=native -O2 -fomit-frame-pointer -fwrapv -fPIC -fPIE
permutations.c: /tmp/ccBWwa7J.s: Assembler messages:
permutations.c: /tmp/ccBWwa7J.s:96: Error: operand 2 must be an integer or stack pointer register -- `sub x1,#15'

Number of similar (compiler,implementation) pairs: 1, namely:
CompilerImplementations
gcc -march=native -mtune=native -O2 -fomit-frame-pointer -fwrapv -fPIC -fPIE armv7m_small

Compiler output

Implementation: armv7m_small
Security model: constbranchindex
Compiler: gcc -march=native -mtune=native -O3 -fomit-frame-pointer -fwrapv -fPIC -fPIE
permutations.c: /tmp/ccwffwnw.s: Assembler messages:
permutations.c: /tmp/ccwffwnw.s:96: Error: operand 2 must be an integer or stack pointer register -- `sub x1,#15'

Number of similar (compiler,implementation) pairs: 1, namely:
CompilerImplementations
gcc -march=native -mtune=native -O3 -fomit-frame-pointer -fwrapv -fPIC -fPIE armv7m_small

Compiler output

Implementation: armv7m_small
Security model: constbranchindex
Compiler: gcc -march=native -mtune=native -O -fomit-frame-pointer -fwrapv -fPIC -fPIE
permutations.c: /tmp/ccxHT6Bp.s: Assembler messages:
permutations.c: /tmp/ccxHT6Bp.s:100: Error: operand 2 must be an integer or stack pointer register -- `sub x1,#15'

Number of similar (compiler,implementation) pairs: 1, namely:
CompilerImplementations
gcc -march=native -mtune=native -O -fomit-frame-pointer -fwrapv -fPIC -fPIE armv7m_small

Compiler output

Implementation: armv7m_small
Security model: constbranchindex
Compiler: gcc -march=native -mtune=native -Os -fomit-frame-pointer -fwrapv -fPIC -fPIE
permutations.c: /tmp/ccQQ3i2o.s: Assembler messages:
permutations.c: /tmp/ccQQ3i2o.s:96: Error: operand 2 must be an integer or stack pointer register -- `sub x1,#15'

Number of similar (compiler,implementation) pairs: 1, namely:
CompilerImplementations
gcc -march=native -mtune=native -Os -fomit-frame-pointer -fwrapv -fPIC -fPIE armv7m_small

Compiler output

Implementation: T:asm_bi32_rv32b
Security model: timingleaks
Compiler: clang -mcpu=native -O3 -fomit-frame-pointer -fwrapv -Qunused-arguments -fPIC -fPIE
ascon.S: ascon.S:159:5: error: unrecognized instruction mnemonic, did you mean: b?
ascon.S: j .LPloopcond
ascon.S: ^
ascon.S: ascon.S:162:5: error: unrecognized instruction mnemonic, did you mean: eor, orn, orr, ror?
ascon.S: xor s5, s5, t2
ascon.S: ^
ascon.S: ascon.S:163:14: error: unexpected token in argument list
ascon.S: lbu t2, 1(t1)
ascon.S: ^
ascon.S: ascon.S:164:5: error: unrecognized instruction mnemonic, did you mean: eor, orn, orr, ror?
ascon.S: xor s4, s4, t2
ascon.S: ^
ascon.S: <instantiation>:1:1: error: unrecognized instruction mnemonic, did you mean: eor, orn, orr, ror?
ascon.S: xor t3, s1, s9
ascon.S: ^
ascon.S: ascon.S:167:5: note: while in macro instantiation
ascon.S: sbox s1, s3, s5, s7, s9, t4, t3, t5
ascon.S: ^
ascon.S: <instantiation>:2:5: error: unrecognized instruction mnemonic, did you mean: eor, orn, orr, ror?
ascon.S: xor t5, s7, s9
ascon.S: ^
ascon.S: ascon.S:167:5: note: while in macro instantiation
ascon.S: sbox s1, s3, s5, s7, s9, t4, t3, t5
ascon.S: ^
ascon.S: <instantiation>:3:5: error: unrecognized instruction mnemonic, did you mean: eor, orn, orr, ror?
ascon.S: ...

Number of similar (compiler,implementation) pairs: 1, namely:
CompilerImplementations
clang -mcpu=native -O3 -fomit-frame-pointer -fwrapv -Qunused-arguments -fPIC -fPIE T:asm_bi32_rv32b

Compiler output

Implementation: T:asm_bi32_rv32b
Security model: timingleaks
Compiler: gcc -march=native -mtune=native -O2 -fomit-frame-pointer -fwrapv -fPIC -fPIE
ascon.S: ascon.S: Assembler messages:
ascon.S: ascon.S:159: Error: unknown mnemonic `j' -- `j .LPloopcond'
ascon.S: ascon.S:162: Error: unknown mnemonic `xor' -- `xor s5,s5,t2'
ascon.S: ascon.S:163: Error: unknown mnemonic `lbu' -- `lbu t2,1(t1)'
ascon.S: ascon.S:164: Error: unknown mnemonic `xor' -- `xor s4,s4,t2'
ascon.S: ascon.S:167: Error: unknown mnemonic `xor' -- `xor t3,s1,s9'
ascon.S: ascon.S:167: Error: unknown mnemonic `xor' -- `xor t5,s7,s9'
ascon.S: ascon.S:167: Error: unknown mnemonic `xor' -- `xor t4,s3,s5'
ascon.S: ascon.S:167: Error: operand 1 must be an integer register -- `orn s9,s7,s9'
ascon.S: ascon.S:167: Error: unknown mnemonic `xor' -- `xor s9,s9,t4'
ascon.S: ascon.S:167: Error: unknown mnemonic `xor' -- `xor s7,s7,s3'
ascon.S: ascon.S:167: Error: unknown mnemonic `or' -- `or s7,s7,t4'
ascon.S: ascon.S:167: Error: unknown mnemonic `xor' -- `xor s7,s7,t3'
ascon.S: ascon.S:167: Error: unknown mnemonic `xor' -- `xor s5,s5,t3'
ascon.S: ascon.S:167: Error: unknown mnemonic `or' -- `or s5,s5,s3'
ascon.S: ascon.S:167: Error: unknown mnemonic `xor' -- `xor s5,s5,t5'
ascon.S: ascon.S:167: Error: unknown mnemonic `or' -- `or s1,s1,t5'
ascon.S: ascon.S:167: Error: unknown mnemonic `xor' -- `xor t4,t4,s1'
ascon.S: ascon.S:167: Error: unknown mnemonic `andn' -- `andn s3,s3,t3'
ascon.S: ascon.S:167: Error: unknown mnemonic `xor' -- `xor s3,s3,t5'
ascon.S: ascon.S:168: Error: unknown mnemonic `xor' -- `xor s1,s0,s8'
ascon.S: ascon.S:168: Error: unknown mnemonic `xor' -- `xor t5,s6,s8'
ascon.S: ascon.S:168: Error: unknown mnemonic `xor' -- `xor t3,s2,s4'
ascon.S: ascon.S:168: Error: operand 1 must be an integer register -- `orn s8,s6,s8'
ascon.S: ascon.S:168: Error: unknown mnemonic `xor' -- `xor s8,s8,t3'
ascon.S: ...

Number of similar (compiler,implementation) pairs: 4, namely:
CompilerImplementations
gcc -march=native -mtune=native -O2 -fomit-frame-pointer -fwrapv -fPIC -fPIE T:asm_bi32_rv32b
gcc -march=native -mtune=native -O3 -fomit-frame-pointer -fwrapv -fPIC -fPIE T:asm_bi32_rv32b
gcc -march=native -mtune=native -O -fomit-frame-pointer -fwrapv -fPIC -fPIE T:asm_bi32_rv32b
gcc -march=native -mtune=native -Os -fomit-frame-pointer -fwrapv -fPIC -fPIE T:asm_bi32_rv32b

Compiler output

Implementation: T:asm_esp32
Security model: timingleaks
Compiler: clang -mcpu=native -O3 -fomit-frame-pointer -fwrapv -Qunused-arguments -fPIC -fPIE
ascon.S: ascon.S:1:10: fatal error: 'xtensa/coreasm.h' file not found
ascon.S: #include <xtensa/coreasm.h>
ascon.S: ^~~~~~~~~~~~~~~~~~
ascon.S: 1 error generated.

Number of similar (compiler,implementation) pairs: 1, namely:
CompilerImplementations
clang -mcpu=native -O3 -fomit-frame-pointer -fwrapv -Qunused-arguments -fPIC -fPIE T:asm_esp32

Compiler output

Implementation: T:asm_esp32
Security model: timingleaks
Compiler: gcc -march=native -mtune=native -O2 -fomit-frame-pointer -fwrapv -fPIC -fPIE
ascon.S: ascon.S:1:10: fatal error: xtensa/coreasm.h: No such file or directory
ascon.S: 1 | #include <xtensa/coreasm.h>
ascon.S: | ^~~~~~~~~~~~~~~~~~
ascon.S: compilation terminated.

Number of similar (compiler,implementation) pairs: 4, namely:
CompilerImplementations
gcc -march=native -mtune=native -O2 -fomit-frame-pointer -fwrapv -fPIC -fPIE T:asm_esp32
gcc -march=native -mtune=native -O3 -fomit-frame-pointer -fwrapv -fPIC -fPIE T:asm_esp32
gcc -march=native -mtune=native -O -fomit-frame-pointer -fwrapv -fPIC -fPIE T:asm_esp32
gcc -march=native -mtune=native -Os -fomit-frame-pointer -fwrapv -fPIC -fPIE T:asm_esp32

Compiler output

Implementation: T:asm_fsr_rv32b
Security model: timingleaks
Compiler: clang -mcpu=native -O3 -fomit-frame-pointer -fwrapv -Qunused-arguments -fPIC -fPIE
ascon.S: ascon.S:110:5: error: unrecognized instruction mnemonic, did you mean: bl, sli?
ascon.S: li t6, 0x4b
ascon.S: ^
ascon.S: ascon.S:113:5: error: unrecognized instruction mnemonic, did you mean: eor, orn, orr, ror?
ascon.S: xor s5, s5, t1
ascon.S: ^
ascon.S: <instantiation>:1:1: error: unrecognized instruction mnemonic, did you mean: eor, orn, orr, ror?
ascon.S: xor t3, s1, s9
ascon.S: ^
ascon.S: ascon.S:116:5: note: while in macro instantiation
ascon.S: sbox s1, s3, s5, s7, s9, t4, t3, t5
ascon.S: ^
ascon.S: <instantiation>:2:5: error: unrecognized instruction mnemonic, did you mean: eor, orn, orr, ror?
ascon.S: xor t5, s7, s9
ascon.S: ^
ascon.S: ascon.S:116:5: note: while in macro instantiation
ascon.S: sbox s1, s3, s5, s7, s9, t4, t3, t5
ascon.S: ^
ascon.S: <instantiation>:3:5: error: unrecognized instruction mnemonic, did you mean: eor, orn, orr, ror?
ascon.S: xor t4, s3, s5
ascon.S: ^
ascon.S: ascon.S:116:5: note: while in macro instantiation
ascon.S: sbox s1, s3, s5, s7, s9, t4, t3, t5
ascon.S: ^
ascon.S: <instantiation>:4:9: error: invalid operand for instruction
ascon.S: ...

Number of similar (compiler,implementation) pairs: 1, namely:
CompilerImplementations
clang -mcpu=native -O3 -fomit-frame-pointer -fwrapv -Qunused-arguments -fPIC -fPIE T:asm_fsr_rv32b

Compiler output

Implementation: T:asm_fsr_rv32b
Security model: timingleaks
Compiler: gcc -march=native -mtune=native -O2 -fomit-frame-pointer -fwrapv -fPIC -fPIE
ascon.S: ascon.S: Assembler messages:
ascon.S: ascon.S:110: Error: unknown mnemonic `li' -- `li t6,0x4b'
ascon.S: ascon.S:113: Error: unknown mnemonic `xor' -- `xor s5,s5,t1'
ascon.S: ascon.S:116: Error: unknown mnemonic `xor' -- `xor t3,s1,s9'
ascon.S: ascon.S:116: Error: unknown mnemonic `xor' -- `xor t5,s7,s9'
ascon.S: ascon.S:116: Error: unknown mnemonic `xor' -- `xor t4,s3,s5'
ascon.S: ascon.S:116: Error: operand 1 must be an integer register -- `orn s9,s7,s9'
ascon.S: ascon.S:116: Error: unknown mnemonic `xor' -- `xor s9,s9,t4'
ascon.S: ascon.S:116: Error: unknown mnemonic `xor' -- `xor s7,s7,s3'
ascon.S: ascon.S:116: Error: unknown mnemonic `or' -- `or s7,s7,t4'
ascon.S: ascon.S:116: Error: unknown mnemonic `xor' -- `xor s7,s7,t3'
ascon.S: ascon.S:116: Error: unknown mnemonic `xor' -- `xor s5,s5,t3'
ascon.S: ascon.S:116: Error: unknown mnemonic `or' -- `or s5,s5,s3'
ascon.S: ascon.S:116: Error: unknown mnemonic `xor' -- `xor s5,s5,t5'
ascon.S: ascon.S:116: Error: unknown mnemonic `or' -- `or s1,s1,t5'
ascon.S: ascon.S:116: Error: unknown mnemonic `xor' -- `xor t4,t4,s1'
ascon.S: ascon.S:116: Error: unknown mnemonic `andn' -- `andn s3,s3,t3'
ascon.S: ascon.S:116: Error: unknown mnemonic `xor' -- `xor s3,s3,t5'
ascon.S: ascon.S:117: Error: unknown mnemonic `xor' -- `xor s1,s0,s8'
ascon.S: ascon.S:117: Error: unknown mnemonic `xor' -- `xor t5,s6,s8'
ascon.S: ascon.S:117: Error: unknown mnemonic `xor' -- `xor t3,s2,s4'
ascon.S: ascon.S:117: Error: operand 1 must be an integer register -- `orn s8,s6,s8'
ascon.S: ascon.S:117: Error: unknown mnemonic `xor' -- `xor s8,s8,t3'
ascon.S: ascon.S:117: Error: unknown mnemonic `xor' -- `xor s6,s6,s2'
ascon.S: ascon.S:117: Error: unknown mnemonic `or' -- `or s6,s6,t3'
ascon.S: ...

Number of similar (compiler,implementation) pairs: 4, namely:
CompilerImplementations
gcc -march=native -mtune=native -O2 -fomit-frame-pointer -fwrapv -fPIC -fPIE T:asm_fsr_rv32b
gcc -march=native -mtune=native -O3 -fomit-frame-pointer -fwrapv -fPIC -fPIE T:asm_fsr_rv32b
gcc -march=native -mtune=native -O -fomit-frame-pointer -fwrapv -fPIC -fPIE T:asm_fsr_rv32b
gcc -march=native -mtune=native -Os -fomit-frame-pointer -fwrapv -fPIC -fPIE T:asm_fsr_rv32b

Compiler output

Implementation: T:asm_rv32b
Security model: timingleaks
Compiler: clang -mcpu=native -O3 -fomit-frame-pointer -fwrapv -Qunused-arguments -fPIC -fPIE
ascon.S: ascon.S:118:5: error: unrecognized instruction mnemonic, did you mean: bl, sli?
ascon.S: li t6, 0x4b
ascon.S: ^
ascon.S: ascon.S:121:5: error: unrecognized instruction mnemonic, did you mean: eor, orn, orr, ror?
ascon.S: xor s5, s5, t1
ascon.S: ^
ascon.S: <instantiation>:1:1: error: unrecognized instruction mnemonic, did you mean: eor, orn, orr, ror?
ascon.S: xor t3, s1, s9
ascon.S: ^
ascon.S: ascon.S:124:5: note: while in macro instantiation
ascon.S: sbox s1, s3, s5, s7, s9, t4, t3, t5
ascon.S: ^
ascon.S: <instantiation>:2:5: error: unrecognized instruction mnemonic, did you mean: eor, orn, orr, ror?
ascon.S: xor t5, s7, s9
ascon.S: ^
ascon.S: ascon.S:124:5: note: while in macro instantiation
ascon.S: sbox s1, s3, s5, s7, s9, t4, t3, t5
ascon.S: ^
ascon.S: <instantiation>:3:5: error: unrecognized instruction mnemonic, did you mean: eor, orn, orr, ror?
ascon.S: xor t4, s3, s5
ascon.S: ^
ascon.S: ascon.S:124:5: note: while in macro instantiation
ascon.S: sbox s1, s3, s5, s7, s9, t4, t3, t5
ascon.S: ^
ascon.S: <instantiation>:4:9: error: invalid operand for instruction
ascon.S: ...

Number of similar (compiler,implementation) pairs: 1, namely:
CompilerImplementations
clang -mcpu=native -O3 -fomit-frame-pointer -fwrapv -Qunused-arguments -fPIC -fPIE T:asm_rv32b

Compiler output

Implementation: T:asm_rv32b
Security model: timingleaks
Compiler: gcc -march=native -mtune=native -O2 -fomit-frame-pointer -fwrapv -fPIC -fPIE
ascon.S: ascon.S: Assembler messages:
ascon.S: ascon.S:118: Error: unknown mnemonic `li' -- `li t6,0x4b'
ascon.S: ascon.S:121: Error: unknown mnemonic `xor' -- `xor s5,s5,t1'
ascon.S: ascon.S:124: Error: unknown mnemonic `xor' -- `xor t3,s1,s9'
ascon.S: ascon.S:124: Error: unknown mnemonic `xor' -- `xor t5,s7,s9'
ascon.S: ascon.S:124: Error: unknown mnemonic `xor' -- `xor t4,s3,s5'
ascon.S: ascon.S:124: Error: operand 1 must be an integer register -- `orn s9,s7,s9'
ascon.S: ascon.S:124: Error: unknown mnemonic `xor' -- `xor s9,s9,t4'
ascon.S: ascon.S:124: Error: unknown mnemonic `xor' -- `xor s7,s7,s3'
ascon.S: ascon.S:124: Error: unknown mnemonic `or' -- `or s7,s7,t4'
ascon.S: ascon.S:124: Error: unknown mnemonic `xor' -- `xor s7,s7,t3'
ascon.S: ascon.S:124: Error: unknown mnemonic `xor' -- `xor s5,s5,t3'
ascon.S: ascon.S:124: Error: unknown mnemonic `or' -- `or s5,s5,s3'
ascon.S: ascon.S:124: Error: unknown mnemonic `xor' -- `xor s5,s5,t5'
ascon.S: ascon.S:124: Error: unknown mnemonic `or' -- `or s1,s1,t5'
ascon.S: ascon.S:124: Error: unknown mnemonic `xor' -- `xor t4,t4,s1'
ascon.S: ascon.S:124: Error: unknown mnemonic `andn' -- `andn s3,s3,t3'
ascon.S: ascon.S:124: Error: unknown mnemonic `xor' -- `xor s3,s3,t5'
ascon.S: ascon.S:125: Error: unknown mnemonic `xor' -- `xor s1,s0,s8'
ascon.S: ascon.S:125: Error: unknown mnemonic `xor' -- `xor t5,s6,s8'
ascon.S: ascon.S:125: Error: unknown mnemonic `xor' -- `xor t3,s2,s4'
ascon.S: ascon.S:125: Error: operand 1 must be an integer register -- `orn s8,s6,s8'
ascon.S: ascon.S:125: Error: unknown mnemonic `xor' -- `xor s8,s8,t3'
ascon.S: ascon.S:125: Error: unknown mnemonic `xor' -- `xor s6,s6,s2'
ascon.S: ascon.S:125: Error: unknown mnemonic `or' -- `or s6,s6,t3'
ascon.S: ...

Number of similar (compiler,implementation) pairs: 4, namely:
CompilerImplementations
gcc -march=native -mtune=native -O2 -fomit-frame-pointer -fwrapv -fPIC -fPIE T:asm_rv32b
gcc -march=native -mtune=native -O3 -fomit-frame-pointer -fwrapv -fPIC -fPIE T:asm_rv32b
gcc -march=native -mtune=native -O -fomit-frame-pointer -fwrapv -fPIC -fPIE T:asm_rv32b
gcc -march=native -mtune=native -Os -fomit-frame-pointer -fwrapv -fPIC -fPIE T:asm_rv32b

Compiler output

Implementation: T:asm_rv32i
Security model: timingleaks
Compiler: clang -mcpu=native -O3 -fomit-frame-pointer -fwrapv -Qunused-arguments -fPIC -fPIE
ascon.S: ascon.S:120:5: error: unrecognized instruction mnemonic, did you mean: bl, sli?
ascon.S: li t6, 0x4b
ascon.S: ^
ascon.S: ascon.S:123:5: error: unrecognized instruction mnemonic, did you mean: eor, orn, orr, ror?
ascon.S: xor s5, s5, t1
ascon.S: ^
ascon.S: <instantiation>:1:1: error: unrecognized instruction mnemonic, did you mean: eor, orn, orr, ror?
ascon.S: xor t3, s1, s9
ascon.S: ^
ascon.S: ascon.S:126:5: note: while in macro instantiation
ascon.S: sbox s1, s3, s5, s7, s9, t4, t3, t5
ascon.S: ^
ascon.S: <instantiation>:2:5: error: unrecognized instruction mnemonic, did you mean: eor, orn, orr, ror?
ascon.S: xor t5, s7, s9
ascon.S: ^
ascon.S: ascon.S:126:5: note: while in macro instantiation
ascon.S: sbox s1, s3, s5, s7, s9, t4, t3, t5
ascon.S: ^
ascon.S: <instantiation>:3:5: error: unrecognized instruction mnemonic
ascon.S: xori s9, s9, -1
ascon.S: ^
ascon.S: ascon.S:126:5: note: while in macro instantiation
ascon.S: sbox s1, s3, s5, s7, s9, t4, t3, t5
ascon.S: ^
ascon.S: <instantiation>:4:5: error: unrecognized instruction mnemonic, did you mean: eor, orn, orr, ror?
ascon.S: ...

Number of similar (compiler,implementation) pairs: 1, namely:
CompilerImplementations
clang -mcpu=native -O3 -fomit-frame-pointer -fwrapv -Qunused-arguments -fPIC -fPIE T:asm_rv32i

Compiler output

Implementation: T:asm_rv32i
Security model: timingleaks
Compiler: gcc -march=native -mtune=native -O2 -fomit-frame-pointer -fwrapv -fPIC -fPIE
ascon.S: ascon.S: Assembler messages:
ascon.S: ascon.S:120: Error: unknown mnemonic `li' -- `li t6,0x4b'
ascon.S: ascon.S:123: Error: unknown mnemonic `xor' -- `xor s5,s5,t1'
ascon.S: ascon.S:126: Error: unknown mnemonic `xor' -- `xor t3,s1,s9'
ascon.S: ascon.S:126: Error: unknown mnemonic `xor' -- `xor t5,s7,s9'
ascon.S: ascon.S:126: Error: unknown mnemonic `xori' -- `xori s9,s9,-1'
ascon.S: ascon.S:126: Error: unknown mnemonic `xor' -- `xor t4,s3,s5'
ascon.S: ascon.S:126: Error: unknown mnemonic `or' -- `or s9,s9,s7'
ascon.S: ascon.S:126: Error: unknown mnemonic `xor' -- `xor s9,s9,t4'
ascon.S: ascon.S:126: Error: unknown mnemonic `xor' -- `xor s7,s7,s3'
ascon.S: ascon.S:126: Error: unknown mnemonic `or' -- `or s7,s7,t4'
ascon.S: ascon.S:126: Error: unknown mnemonic `xor' -- `xor s7,s7,t3'
ascon.S: ascon.S:126: Error: unknown mnemonic `xor' -- `xor s5,s5,t3'
ascon.S: ascon.S:126: Error: unknown mnemonic `or' -- `or s5,s5,s3'
ascon.S: ascon.S:126: Error: unknown mnemonic `xor' -- `xor s5,s5,t5'
ascon.S: ascon.S:126: Error: unknown mnemonic `or' -- `or s1,s1,t5'
ascon.S: ascon.S:126: Error: unknown mnemonic `xor' -- `xor t4,t4,s1'
ascon.S: ascon.S:126: Error: unknown mnemonic `xori' -- `xori t3,t3,-1'
ascon.S: ascon.S:126: Error: operand 1 must be an integer or stack pointer register -- `and s3,s3,t3'
ascon.S: ascon.S:126: Error: unknown mnemonic `xor' -- `xor s3,s3,t5'
ascon.S: ascon.S:127: Error: unknown mnemonic `xor' -- `xor s1,s0,s8'
ascon.S: ascon.S:127: Error: unknown mnemonic `xor' -- `xor t5,s6,s8'
ascon.S: ascon.S:127: Error: unknown mnemonic `xori' -- `xori s8,s8,-1'
ascon.S: ascon.S:127: Error: unknown mnemonic `xor' -- `xor t3,s2,s4'
ascon.S: ascon.S:127: Error: unknown mnemonic `or' -- `or s8,s8,s6'
ascon.S: ...

Number of similar (compiler,implementation) pairs: 4, namely:
CompilerImplementations
gcc -march=native -mtune=native -O2 -fomit-frame-pointer -fwrapv -fPIC -fPIE T:asm_rv32i
gcc -march=native -mtune=native -O3 -fomit-frame-pointer -fwrapv -fPIC -fPIE T:asm_rv32i
gcc -march=native -mtune=native -O -fomit-frame-pointer -fwrapv -fPIC -fPIE T:asm_rv32i
gcc -march=native -mtune=native -Os -fomit-frame-pointer -fwrapv -fPIC -fPIE T:asm_rv32i

Compiler output

Implementation: avr
Security model: constbranchindex
Compiler: clang -mcpu=native -O3 -fomit-frame-pointer -fwrapv -Qunused-arguments -fPIC -fPIE
permutations.S: permutations.S:29:10: fatal error: 'avr/io.h' file not found
permutations.S: #include "avr/io.h"
permutations.S: ^~~~~~~~~~
permutations.S: 1 error generated.

Number of similar (compiler,implementation) pairs: 2, namely:
CompilerImplementations
clang -mcpu=native -O3 -fomit-frame-pointer -fwrapv -Qunused-arguments -fPIC -fPIE avr avr_lowsize

Compiler output

Implementation: avr
Security model: constbranchindex
Compiler: gcc -march=native -mtune=native -O2 -fomit-frame-pointer -fwrapv -fPIC -fPIE
permutations.S: permutations.S:29:10: fatal error: avr/io.h: No such file or directory
permutations.S: 29 | #include "avr/io.h"
permutations.S: | ^~~~~~~~~~
permutations.S: compilation terminated.

Number of similar (compiler,implementation) pairs: 8, namely:
CompilerImplementations
gcc -march=native -mtune=native -O2 -fomit-frame-pointer -fwrapv -fPIC -fPIE avr
gcc -march=native -mtune=native -O3 -fomit-frame-pointer -fwrapv -fPIC -fPIE avr
gcc -march=native -mtune=native -O -fomit-frame-pointer -fwrapv -fPIC -fPIE avr
gcc -march=native -mtune=native -Os -fomit-frame-pointer -fwrapv -fPIC -fPIE avr
gcc -march=native -mtune=native -O2 -fomit-frame-pointer -fwrapv -fPIC -fPIE avr_lowsize
gcc -march=native -mtune=native -O3 -fomit-frame-pointer -fwrapv -fPIC -fPIE avr_lowsize
gcc -march=native -mtune=native -O -fomit-frame-pointer -fwrapv -fPIC -fPIE avr_lowsize
gcc -march=native -mtune=native -Os -fomit-frame-pointer -fwrapv -fPIC -fPIE avr_lowsize

Compiler output

Implementation: bi32_armv6
Security model: constbranchindex
Compiler: clang -mcpu=native -O3 -fomit-frame-pointer -fwrapv -Qunused-arguments -fPIC -fPIE
aead.c: In file included from aead.c:4:
aead.c: In file included from ./permutations.h:11:
aead.c: ./round.h:82:19: warning: value size does not match register size specified by the constraint and modifier [-Wasm-operand-widths]
aead.c: [tmp1] "=r"(tmp1)
aead.c: ^
aead.c: ./round.h:15:13: note: use constraint modifier "w"
aead.c: "ldrb %[tmp1], [%[C]], #1\n\t"
aead.c: ^~~~~~~
aead.c: %w[tmp1]
aead.c: ./round.h:78:19: warning: value size does not match register size specified by the constraint and modifier [-Wasm-operand-widths]
aead.c: [x0_l] "+r"(s->w[0][0]), [x0_h] "+r"(s->w[0][1]), [x1_l] "+r"(s->w[1][0]),
aead.c: ^
aead.c: ./round.h:16:12: note: use constraint modifier "w"
aead.c: "eor %[x0_l], %[x0_l], %[x4_l]\n\t"
aead.c: ^~~~~~~
aead.c: %w[x0_l]
aead.c: ./round.h:78:19: warning: value size does not match register size specified by the constraint and modifier [-Wasm-operand-widths]
aead.c: [x0_l] "+r"(s->w[0][0]), [x0_h] "+r"(s->w[0][1]), [x1_l] "+r"(s->w[1][0]),
aead.c: ^
aead.c: ./round.h:16:21: note: use constraint modifier "w"
aead.c: "eor %[x0_l], %[x0_l], %[x4_l]\n\t"
aead.c: ^~~~~~~
aead.c: %w[x0_l]
aead.c: ./round.h:80:69: warning: value size does not match register size specified by the constraint and modifier [-Wasm-operand-widths]
aead.c: [x3_l] "+r"(s->w[3][0]), [x3_h] "+r"(s->w[3][1]), [x4_l] "+r"(s->w[4][0]),
aead.c: ...

Number of similar (compiler,implementation) pairs: 1, namely:
CompilerImplementations
clang -mcpu=native -O3 -fomit-frame-pointer -fwrapv -Qunused-arguments -fPIC -fPIE bi32_armv6

Compiler output

Implementation: bi32_armv6
Security model: constbranchindex
Compiler: gcc -march=native -mtune=native -O2 -fomit-frame-pointer -fwrapv -fPIC -fPIE
permutations.c: /tmp/ccyCIfyw.s: Assembler messages:
permutations.c: /tmp/ccyCIfyw.s:105: Error: immediate out of range at operand 3 -- `eor x13,x13,9'
permutations.c: /tmp/ccyCIfyw.s:201: Error: immediate out of range at operand 3 -- `eor x8,x8,9'
permutations.c: /tmp/ccyCIfyw.s:263: Error: immediate out of range at operand 3 -- `eor x13,x13,9'
permutations.c: /tmp/ccyCIfyw.s:280: Error: immediate out of range at operand 3 -- `eor x6,x6,9'
permutations.c: /tmp/ccyCIfyw.s:517: Error: immediate out of range at operand 3 -- `eor x6,x6,9'
permutations.c: /tmp/ccyCIfyw.s:596: Error: immediate out of range at operand 3 -- `eor x7,x7,9'
permutations.c: /tmp/ccyCIfyw.s:737: Error: immediate out of range at operand 3 -- `eor x13,x13,9'
permutations.c: /tmp/ccyCIfyw.s:895: Error: immediate out of range at operand 3 -- `eor x13,x13,9'
permutations.c: /tmp/ccyCIfyw.s:1008: Error: immediate out of range at operand 3 -- `eor x6,x6,9'
permutations.c: /tmp/ccyCIfyw.s:1087: Error: immediate out of range at operand 3 -- `eor x7,x7,9'
permutations.c: /tmp/ccyCIfyw.s:1228: Error: immediate out of range at operand 3 -- `eor x13,x13,9'
permutations.c: /tmp/ccyCIfyw.s:1386: Error: immediate out of range at operand 3 -- `eor x13,x13,9'

Number of similar (compiler,implementation) pairs: 1, namely:
CompilerImplementations
gcc -march=native -mtune=native -O2 -fomit-frame-pointer -fwrapv -fPIC -fPIE bi32_armv6

Compiler output

Implementation: bi32_armv6
Security model: constbranchindex
Compiler: gcc -march=native -mtune=native -O3 -fomit-frame-pointer -fwrapv -fPIC -fPIE
permutations.c: /tmp/ccrDoawX.s: Assembler messages:
permutations.c: /tmp/ccrDoawX.s:105: Error: immediate out of range at operand 3 -- `eor x13,x13,9'
permutations.c: /tmp/ccrDoawX.s:201: Error: immediate out of range at operand 3 -- `eor x8,x8,9'
permutations.c: /tmp/ccrDoawX.s:263: Error: immediate out of range at operand 3 -- `eor x13,x13,9'
permutations.c: /tmp/ccrDoawX.s:280: Error: immediate out of range at operand 3 -- `eor x6,x6,9'
permutations.c: /tmp/ccrDoawX.s:517: Error: immediate out of range at operand 3 -- `eor x6,x6,9'
permutations.c: /tmp/ccrDoawX.s:596: Error: immediate out of range at operand 3 -- `eor x7,x7,9'
permutations.c: /tmp/ccrDoawX.s:737: Error: immediate out of range at operand 3 -- `eor x13,x13,9'
permutations.c: /tmp/ccrDoawX.s:895: Error: immediate out of range at operand 3 -- `eor x13,x13,9'
permutations.c: /tmp/ccrDoawX.s:1008: Error: immediate out of range at operand 3 -- `eor x6,x6,9'
permutations.c: /tmp/ccrDoawX.s:1087: Error: immediate out of range at operand 3 -- `eor x7,x7,9'
permutations.c: /tmp/ccrDoawX.s:1228: Error: immediate out of range at operand 3 -- `eor x13,x13,9'
permutations.c: /tmp/ccrDoawX.s:1386: Error: immediate out of range at operand 3 -- `eor x13,x13,9'

Number of similar (compiler,implementation) pairs: 1, namely:
CompilerImplementations
gcc -march=native -mtune=native -O3 -fomit-frame-pointer -fwrapv -fPIC -fPIE bi32_armv6

Compiler output

Implementation: bi32_armv6
Security model: constbranchindex
Compiler: gcc -march=native -mtune=native -O -fomit-frame-pointer -fwrapv -fPIC -fPIE
permutations.c: /tmp/cccUmYiM.s: Assembler messages:
permutations.c: /tmp/cccUmYiM.s:106: Error: immediate out of range at operand 3 -- `eor x13,x13,9'
permutations.c: /tmp/cccUmYiM.s:202: Error: immediate out of range at operand 3 -- `eor x8,x8,9'
permutations.c: /tmp/cccUmYiM.s:264: Error: immediate out of range at operand 3 -- `eor x13,x13,9'
permutations.c: /tmp/cccUmYiM.s:281: Error: immediate out of range at operand 3 -- `eor x8,x8,9'
permutations.c: /tmp/cccUmYiM.s:518: Error: immediate out of range at operand 3 -- `eor x8,x8,9'
permutations.c: /tmp/cccUmYiM.s:597: Error: immediate out of range at operand 3 -- `eor x8,x8,9'
permutations.c: /tmp/cccUmYiM.s:738: Error: immediate out of range at operand 3 -- `eor x13,x13,9'
permutations.c: /tmp/cccUmYiM.s:896: Error: immediate out of range at operand 3 -- `eor x13,x13,9'
permutations.c: /tmp/cccUmYiM.s:1012: Error: immediate out of range at operand 3 -- `eor x13,x13,9'
permutations.c: /tmp/cccUmYiM.s:1091: Error: immediate out of range at operand 3 -- `eor x8,x8,9'
permutations.c: /tmp/cccUmYiM.s:1232: Error: immediate out of range at operand 3 -- `eor x13,x13,9'
permutations.c: /tmp/cccUmYiM.s:1390: Error: immediate out of range at operand 3 -- `eor x13,x13,9'

Number of similar (compiler,implementation) pairs: 1, namely:
CompilerImplementations
gcc -march=native -mtune=native -O -fomit-frame-pointer -fwrapv -fPIC -fPIE bi32_armv6

Compiler output

Implementation: bi32_armv6
Security model: constbranchindex
Compiler: gcc -march=native -mtune=native -Os -fomit-frame-pointer -fwrapv -fPIC -fPIE
permutations.c: /tmp/ccEnCQwO.s: Assembler messages:
permutations.c: /tmp/ccEnCQwO.s:104: Error: immediate out of range at operand 3 -- `eor x13,x13,9'
permutations.c: /tmp/ccEnCQwO.s:200: Error: immediate out of range at operand 3 -- `eor x8,x8,9'
permutations.c: /tmp/ccEnCQwO.s:262: Error: immediate out of range at operand 3 -- `eor x13,x13,9'
permutations.c: /tmp/ccEnCQwO.s:279: Error: immediate out of range at operand 3 -- `eor x8,x8,9'
permutations.c: /tmp/ccEnCQwO.s:516: Error: immediate out of range at operand 3 -- `eor x8,x8,9'
permutations.c: /tmp/ccEnCQwO.s:595: Error: immediate out of range at operand 3 -- `eor x8,x8,9'
permutations.c: /tmp/ccEnCQwO.s:736: Error: immediate out of range at operand 3 -- `eor x13,x13,9'
permutations.c: /tmp/ccEnCQwO.s:894: Error: immediate out of range at operand 3 -- `eor x13,x13,9'
permutations.c: /tmp/ccEnCQwO.s:1006: Error: immediate out of range at operand 3 -- `eor x8,x8,9'
permutations.c: /tmp/ccEnCQwO.s:1085: Error: immediate out of range at operand 3 -- `eor x8,x8,9'
permutations.c: /tmp/ccEnCQwO.s:1226: Error: immediate out of range at operand 3 -- `eor x13,x13,9'
permutations.c: /tmp/ccEnCQwO.s:1384: Error: immediate out of range at operand 3 -- `eor x13,x13,9'

Number of similar (compiler,implementation) pairs: 1, namely:
CompilerImplementations
gcc -march=native -mtune=native -Os -fomit-frame-pointer -fwrapv -fPIC -fPIE bi32_armv6

Compiler output

Implementation: bi32_armv6m
Security model: constbranchindex
Compiler: clang -mcpu=native -O3 -fomit-frame-pointer -fwrapv -Qunused-arguments -fPIC -fPIE
aead.c: In file included from aead.c:4:
aead.c: In file included from ./permutations.h:11:
aead.c: ./round.h:164:14: error: invalid output constraint '+l' in asm
aead.c: [x0_l] "+l"(s->w[0][0]), [x0_h] "+h"(s->w[0][1]), [x1_l] "+l"(s->w[1][0]),
aead.c: ^
aead.c: ./round.h:314:14: error: invalid output constraint '+l' in asm
aead.c: [x0_l] "+l"(s->w[0][0]), [x0_h] "+h"(s->w[0][1]), [x1_l] "+l"(s->w[1][0]),
aead.c: ^
aead.c: 2 errors generated.

Number of similar (compiler,implementation) pairs: 1, namely:
CompilerImplementations
clang -mcpu=native -O3 -fomit-frame-pointer -fwrapv -Qunused-arguments -fPIC -fPIE bi32_armv6m

Compiler output

Implementation: bi32_armv6m
Security model: constbranchindex
Compiler: gcc -march=native -mtune=native -O2 -fomit-frame-pointer -fwrapv -fPIC -fPIE
aead.c: In file included from permutations.h:11,
aead.c: from aead.c:4:
aead.c: aead.c: In function 'crypto_aead_ascon128v12_bi32_armv6m_constbranchindex_encrypt':
aead.c: round.h:13:3: error: impossible constraint in 'asm'
aead.c: 13 | __asm__ __volatile__(
aead.c: | ^~~~~~~
aead.c: round.h:13:3: error: impossible constraint in 'asm'
aead.c: 13 | __asm__ __volatile__(
aead.c: | ^~~~~~~
aead.c: round.h:13:3: error: impossible constraint in 'asm'
aead.c: 13 | __asm__ __volatile__(
aead.c: | ^~~~~~~
aead.c: round.h:13:3: error: impossible constraint in 'asm'
aead.c: 13 | __asm__ __volatile__(
aead.c: | ^~~~~~~
aead.c: round.h:13:3: error: impossible constraint in 'asm'
aead.c: 13 | __asm__ __volatile__(
aead.c: | ^~~~~~~

Number of similar (compiler,implementation) pairs: 4, namely:
CompilerImplementations
gcc -march=native -mtune=native -O2 -fomit-frame-pointer -fwrapv -fPIC -fPIE bi32_armv6m
gcc -march=native -mtune=native -O3 -fomit-frame-pointer -fwrapv -fPIC -fPIE bi32_armv6m
gcc -march=native -mtune=native -O -fomit-frame-pointer -fwrapv -fPIC -fPIE bi32_armv6m
gcc -march=native -mtune=native -Os -fomit-frame-pointer -fwrapv -fPIC -fPIE bi32_armv6m

Compiler output

Implementation: bi32_armv7m
Security model: constbranchindex
Compiler: clang -mcpu=native -O3 -fomit-frame-pointer -fwrapv -Qunused-arguments -fPIC -fPIE
aead.c: In file included from aead.c:4:
aead.c: In file included from ./permutations.h:11:
aead.c: ./round.h:78:19: warning: value size does not match register size specified by the constraint and modifier [-Wasm-operand-widths]
aead.c: [tmp1] "=r"(tmp1)
aead.c: ^
aead.c: ./round.h:15:13: note: use constraint modifier "w"
aead.c: "ldrb %[tmp1], [%[C]], #1\n\t"
aead.c: ^~~~~~~
aead.c: %w[tmp1]
aead.c: ./round.h:74:19: warning: value size does not match register size specified by the constraint and modifier [-Wasm-operand-widths]
aead.c: [x0_l] "+r"(s->w[0][0]), [x0_h] "+r"(s->w[0][1]), [x1_l] "+r"(s->w[1][0]),
aead.c: ^
aead.c: ./round.h:16:12: note: use constraint modifier "w"
aead.c: "eor %[x0_l], %[x0_l], %[x4_l]\n\t"
aead.c: ^~~~~~~
aead.c: %w[x0_l]
aead.c: ./round.h:74:19: warning: value size does not match register size specified by the constraint and modifier [-Wasm-operand-widths]
aead.c: [x0_l] "+r"(s->w[0][0]), [x0_h] "+r"(s->w[0][1]), [x1_l] "+r"(s->w[1][0]),
aead.c: ^
aead.c: ./round.h:16:21: note: use constraint modifier "w"
aead.c: "eor %[x0_l], %[x0_l], %[x4_l]\n\t"
aead.c: ^~~~~~~
aead.c: %w[x0_l]
aead.c: ./round.h:76:69: warning: value size does not match register size specified by the constraint and modifier [-Wasm-operand-widths]
aead.c: [x3_l] "+r"(s->w[3][0]), [x3_h] "+r"(s->w[3][1]), [x4_l] "+r"(s->w[4][0]),
aead.c: ...

Number of similar (compiler,implementation) pairs: 2, namely:
CompilerImplementations
clang -mcpu=native -O3 -fomit-frame-pointer -fwrapv -Qunused-arguments -fPIC -fPIE bi32_armv7m bi32_armv7m_small

Compiler output

Implementation: bi32_armv7m
Security model: constbranchindex
Compiler: gcc -march=native -mtune=native -O2 -fomit-frame-pointer -fwrapv -fPIC -fPIE
aead.c: /tmp/ccnxQlXb.s: Assembler messages:
aead.c: /tmp/ccnxQlXb.s:302: Error: immediate out of range at operand 3 -- `eor x13,x13,9'
aead.c: /tmp/ccnxQlXb.s:395: Error: immediate out of range at operand 3 -- `eor x9,x9,9'
aead.c: /tmp/ccnxQlXb.s:456: Error: immediate out of range at operand 3 -- `eor x13,x13,9'
aead.c: /tmp/ccnxQlXb.s:472: Error: immediate out of range at operand 3 -- `eor x9,x9,9'
aead.c: /tmp/ccnxQlXb.s:703: Error: immediate out of range at operand 3 -- `eor x9,x9,9'
aead.c: /tmp/ccnxQlXb.s:780: Error: immediate out of range at operand 3 -- `eor x9,x9,9'
aead.c: /tmp/ccnxQlXb.s:918: Error: immediate out of range at operand 3 -- `eor x13,x13,9'
aead.c: /tmp/ccnxQlXb.s:1051: Error: immediate out of range at operand 3 -- `eor x6,x6,9'
aead.c: /tmp/ccnxQlXb.s:1202: Error: immediate out of range at operand 3 -- `eor x12,x12,9'
aead.c: /tmp/ccnxQlXb.s:1279: Error: immediate out of range at operand 3 -- `eor x9,x9,9'
aead.c: /tmp/ccnxQlXb.s:1417: Error: immediate out of range at operand 3 -- `eor x12,x12,9'
aead.c: /tmp/ccnxQlXb.s:1571: Error: immediate out of range at operand 3 -- `eor x7,x7,9'
aead.c: /tmp/ccnxQlXb.s:1677: Error: immediate out of range at operand 3 -- `eor x8,x8,9'
aead.c: /tmp/ccnxQlXb.s:1754: Error: immediate out of range at operand 3 -- `eor x8,x8,9'
aead.c: /tmp/ccnxQlXb.s:1892: Error: immediate out of range at operand 3 -- `eor x13,x13,9'
aead.c: /tmp/ccnxQlXb.s:2045: Error: immediate out of range at operand 3 -- `eor x5,x5,9'
aead.c: /tmp/ccnxQlXb.s:2231: Error: immediate out of range at operand 3 -- `eor x19,x19,9'
aead.c: /tmp/ccnxQlXb.s:2308: Error: immediate out of range at operand 3 -- `eor x8,x8,9'
aead.c: /tmp/ccnxQlXb.s:2446: Error: immediate out of range at operand 3 -- `eor x20,x20,9'
aead.c: /tmp/ccnxQlXb.s:2600: Error: immediate out of range at operand 3 -- `eor x6,x6,9'
aead.c: /tmp/ccnxQlXb.s:2901: Error: immediate out of range at operand 3 -- `eor x16,x16,9'
aead.c: /tmp/ccnxQlXb.s:2994: Error: immediate out of range at operand 3 -- `eor x8,x8,9'
aead.c: /tmp/ccnxQlXb.s:3055: Error: immediate out of range at operand 3 -- `eor x16,x16,9'
aead.c: /tmp/ccnxQlXb.s:3071: Error: immediate out of range at operand 3 -- `eor x9,x9,9'
aead.c: ...

Number of similar (compiler,implementation) pairs: 1, namely:
CompilerImplementations
gcc -march=native -mtune=native -O2 -fomit-frame-pointer -fwrapv -fPIC -fPIE bi32_armv7m

Compiler output

Implementation: bi32_armv7m
Security model: constbranchindex
Compiler: gcc -march=native -mtune=native -O3 -fomit-frame-pointer -fwrapv -fPIC -fPIE
aead.c: /tmp/cclt1EpV.s: Assembler messages:
aead.c: /tmp/cclt1EpV.s:302: Error: immediate out of range at operand 3 -- `eor x13,x13,9'
aead.c: /tmp/cclt1EpV.s:395: Error: immediate out of range at operand 3 -- `eor x9,x9,9'
aead.c: /tmp/cclt1EpV.s:456: Error: immediate out of range at operand 3 -- `eor x13,x13,9'
aead.c: /tmp/cclt1EpV.s:472: Error: immediate out of range at operand 3 -- `eor x9,x9,9'
aead.c: /tmp/cclt1EpV.s:703: Error: immediate out of range at operand 3 -- `eor x9,x9,9'
aead.c: /tmp/cclt1EpV.s:780: Error: immediate out of range at operand 3 -- `eor x9,x9,9'
aead.c: /tmp/cclt1EpV.s:918: Error: immediate out of range at operand 3 -- `eor x13,x13,9'
aead.c: /tmp/cclt1EpV.s:1051: Error: immediate out of range at operand 3 -- `eor x6,x6,9'
aead.c: /tmp/cclt1EpV.s:1202: Error: immediate out of range at operand 3 -- `eor x12,x12,9'
aead.c: /tmp/cclt1EpV.s:1279: Error: immediate out of range at operand 3 -- `eor x9,x9,9'
aead.c: /tmp/cclt1EpV.s:1417: Error: immediate out of range at operand 3 -- `eor x12,x12,9'
aead.c: /tmp/cclt1EpV.s:1571: Error: immediate out of range at operand 3 -- `eor x7,x7,9'
aead.c: /tmp/cclt1EpV.s:1677: Error: immediate out of range at operand 3 -- `eor x8,x8,9'
aead.c: /tmp/cclt1EpV.s:1754: Error: immediate out of range at operand 3 -- `eor x8,x8,9'
aead.c: /tmp/cclt1EpV.s:1892: Error: immediate out of range at operand 3 -- `eor x13,x13,9'
aead.c: /tmp/cclt1EpV.s:2045: Error: immediate out of range at operand 3 -- `eor x5,x5,9'
aead.c: /tmp/cclt1EpV.s:2232: Error: immediate out of range at operand 3 -- `eor x19,x19,9'
aead.c: /tmp/cclt1EpV.s:2309: Error: immediate out of range at operand 3 -- `eor x8,x8,9'
aead.c: /tmp/cclt1EpV.s:2447: Error: immediate out of range at operand 3 -- `eor x20,x20,9'
aead.c: /tmp/cclt1EpV.s:2601: Error: immediate out of range at operand 3 -- `eor x6,x6,9'
aead.c: /tmp/cclt1EpV.s:2902: Error: immediate out of range at operand 3 -- `eor x16,x16,9'
aead.c: /tmp/cclt1EpV.s:2995: Error: immediate out of range at operand 3 -- `eor x8,x8,9'
aead.c: /tmp/cclt1EpV.s:3056: Error: immediate out of range at operand 3 -- `eor x16,x16,9'
aead.c: /tmp/cclt1EpV.s:3072: Error: immediate out of range at operand 3 -- `eor x9,x9,9'
aead.c: ...

Number of similar (compiler,implementation) pairs: 1, namely:
CompilerImplementations
gcc -march=native -mtune=native -O3 -fomit-frame-pointer -fwrapv -fPIC -fPIE bi32_armv7m

Compiler output

Implementation: bi32_armv7m
Security model: constbranchindex
Compiler: gcc -march=native -mtune=native -O -fomit-frame-pointer -fwrapv -fPIC -fPIE
aead.c: /tmp/ccpKZ0dS.s: Assembler messages:
aead.c: /tmp/ccpKZ0dS.s:376: Error: immediate out of range at operand 3 -- `eor x19,x19,9'
aead.c: /tmp/ccpKZ0dS.s:469: Error: immediate out of range at operand 3 -- `eor x12,x12,9'
aead.c: /tmp/ccpKZ0dS.s:530: Error: immediate out of range at operand 3 -- `eor x19,x19,9'
aead.c: /tmp/ccpKZ0dS.s:546: Error: immediate out of range at operand 3 -- `eor x12,x12,9'
aead.c: /tmp/ccpKZ0dS.s:777: Error: immediate out of range at operand 3 -- `eor x12,x12,9'
aead.c: /tmp/ccpKZ0dS.s:854: Error: immediate out of range at operand 3 -- `eor x12,x12,9'
aead.c: /tmp/ccpKZ0dS.s:992: Error: immediate out of range at operand 3 -- `eor x19,x19,9'
aead.c: /tmp/ccpKZ0dS.s:1125: Error: immediate out of range at operand 3 -- `eor x7,x7,9'
aead.c: /tmp/ccpKZ0dS.s:1302: Error: immediate out of range at operand 3 -- `eor x23,x23,9'
aead.c: /tmp/ccpKZ0dS.s:1379: Error: immediate out of range at operand 3 -- `eor x13,x13,9'
aead.c: /tmp/ccpKZ0dS.s:1517: Error: immediate out of range at operand 3 -- `eor x25,x25,9'
aead.c: /tmp/ccpKZ0dS.s:1670: Error: immediate out of range at operand 3 -- `eor x7,x7,9'
aead.c: /tmp/ccpKZ0dS.s:1783: Error: immediate out of range at operand 3 -- `eor x15,x15,9'
aead.c: /tmp/ccpKZ0dS.s:1860: Error: immediate out of range at operand 3 -- `eor x10,x10,9'
aead.c: /tmp/ccpKZ0dS.s:1998: Error: immediate out of range at operand 3 -- `eor x15,x15,9'
aead.c: /tmp/ccpKZ0dS.s:2151: Error: immediate out of range at operand 3 -- `eor x5,x5,9'
aead.c: /tmp/ccpKZ0dS.s:2382: Error: immediate out of range at operand 3 -- `eor x23,x23,9'
aead.c: /tmp/ccpKZ0dS.s:2459: Error: immediate out of range at operand 3 -- `eor x10,x10,9'
aead.c: /tmp/ccpKZ0dS.s:2597: Error: immediate out of range at operand 3 -- `eor x23,x23,9'
aead.c: /tmp/ccpKZ0dS.s:2750: Error: immediate out of range at operand 3 -- `eor x5,x5,9'
aead.c: /tmp/ccpKZ0dS.s:3062: Error: immediate out of range at operand 3 -- `eor x14,x14,9'
aead.c: /tmp/ccpKZ0dS.s:3155: Error: immediate out of range at operand 3 -- `eor x9,x9,9'
aead.c: /tmp/ccpKZ0dS.s:3216: Error: immediate out of range at operand 3 -- `eor x14,x14,9'
aead.c: /tmp/ccpKZ0dS.s:3232: Error: immediate out of range at operand 3 -- `eor x9,x9,9'
aead.c: ...

Number of similar (compiler,implementation) pairs: 1, namely:
CompilerImplementations
gcc -march=native -mtune=native -O -fomit-frame-pointer -fwrapv -fPIC -fPIE bi32_armv7m

Compiler output

Implementation: bi32_armv7m
Security model: constbranchindex
Compiler: gcc -march=native -mtune=native -Os -fomit-frame-pointer -fwrapv -fPIC -fPIE
aead.c: /tmp/cc9hqwbx.s: Assembler messages:
aead.c: /tmp/cc9hqwbx.s:295: Error: immediate out of range at operand 3 -- `eor x21,x21,9'
aead.c: /tmp/cc9hqwbx.s:388: Error: immediate out of range at operand 3 -- `eor x16,x16,9'
aead.c: /tmp/cc9hqwbx.s:449: Error: immediate out of range at operand 3 -- `eor x21,x21,9'
aead.c: /tmp/cc9hqwbx.s:465: Error: immediate out of range at operand 3 -- `eor x16,x16,9'
aead.c: /tmp/cc9hqwbx.s:696: Error: immediate out of range at operand 3 -- `eor x16,x16,9'
aead.c: /tmp/cc9hqwbx.s:773: Error: immediate out of range at operand 3 -- `eor x16,x16,9'
aead.c: /tmp/cc9hqwbx.s:911: Error: immediate out of range at operand 3 -- `eor x21,x21,9'
aead.c: /tmp/cc9hqwbx.s:1044: Error: immediate out of range at operand 3 -- `eor x7,x7,9'
aead.c: /tmp/cc9hqwbx.s:1358: Error: immediate out of range at operand 3 -- `eor x17,x17,9'
aead.c: /tmp/cc9hqwbx.s:1451: Error: immediate out of range at operand 3 -- `eor x12,x12,9'
aead.c: /tmp/cc9hqwbx.s:1512: Error: immediate out of range at operand 3 -- `eor x17,x17,9'
aead.c: /tmp/cc9hqwbx.s:1528: Error: immediate out of range at operand 3 -- `eor x12,x12,9'
aead.c: /tmp/cc9hqwbx.s:1759: Error: immediate out of range at operand 3 -- `eor x12,x12,9'
aead.c: /tmp/cc9hqwbx.s:1836: Error: immediate out of range at operand 3 -- `eor x12,x12,9'
aead.c: /tmp/cc9hqwbx.s:1974: Error: immediate out of range at operand 3 -- `eor x17,x17,9'
aead.c: /tmp/cc9hqwbx.s:2107: Error: immediate out of range at operand 3 -- `eor x1,x1,9'
aead.c: /tmp/cc9hqwbx.s:2330: Error: immediate out of range at operand 3 -- `eor x16,x16,9'
aead.c: /tmp/cc9hqwbx.s:2407: Error: immediate out of range at operand 3 -- `eor x16,x16,9'
aead.c: /tmp/cc9hqwbx.s:2545: Error: immediate out of range at operand 3 -- `eor x22,x22,9'
aead.c: /tmp/cc9hqwbx.s:2698: Error: immediate out of range at operand 3 -- `eor x7,x7,9'
aead.c: /tmp/cc9hqwbx.s:2876: Error: immediate out of range at operand 3 -- `eor x22,x22,9'
aead.c: /tmp/cc9hqwbx.s:2953: Error: immediate out of range at operand 3 -- `eor x13,x13,9'
aead.c: /tmp/cc9hqwbx.s:3091: Error: immediate out of range at operand 3 -- `eor x18,x18,9'
aead.c: /tmp/cc9hqwbx.s:3244: Error: immediate out of range at operand 3 -- `eor x7,x7,9'
aead.c: ...

Number of similar (compiler,implementation) pairs: 1, namely:
CompilerImplementations
gcc -march=native -mtune=native -Os -fomit-frame-pointer -fwrapv -fPIC -fPIE bi32_armv7m

Compiler output

Implementation: bi32_armv7m_small
Security model: constbranchindex
Compiler: gcc -march=native -mtune=native -O2 -fomit-frame-pointer -fwrapv -fPIC -fPIE
permutations.c: /tmp/cc8htAVf.s: Assembler messages:
permutations.c: /tmp/cc8htAVf.s:26: Error: operand mismatch -- `ldrb x14,[x1],#1'
permutations.c: /tmp/cc8htAVf.s:26: Info: did you mean this?
permutations.c: /tmp/cc8htAVf.s:26: Info: ldrb w14, [x1], #1
permutations.c: /tmp/cc8htAVf.s:41: Error: operand mismatch -- `ldrb x14,[x1],#1'
permutations.c: /tmp/cc8htAVf.s:41: Info: did you mean this?
permutations.c: /tmp/cc8htAVf.s:41: Info: ldrb w14, [x1], #1

Number of similar (compiler,implementation) pairs: 1, namely:
CompilerImplementations
gcc -march=native -mtune=native -O2 -fomit-frame-pointer -fwrapv -fPIC -fPIE bi32_armv7m_small

Compiler output

Implementation: bi32_armv7m_small
Security model: constbranchindex
Compiler: gcc -march=native -mtune=native -O3 -fomit-frame-pointer -fwrapv -fPIC -fPIE
permutations.c: /tmp/ccZIX8gI.s: Assembler messages:
permutations.c: /tmp/ccZIX8gI.s:26: Error: operand mismatch -- `ldrb x14,[x1],#1'
permutations.c: /tmp/ccZIX8gI.s:26: Info: did you mean this?
permutations.c: /tmp/ccZIX8gI.s:26: Info: ldrb w14, [x1], #1
permutations.c: /tmp/ccZIX8gI.s:41: Error: operand mismatch -- `ldrb x14,[x1],#1'
permutations.c: /tmp/ccZIX8gI.s:41: Info: did you mean this?
permutations.c: /tmp/ccZIX8gI.s:41: Info: ldrb w14, [x1], #1

Number of similar (compiler,implementation) pairs: 1, namely:
CompilerImplementations
gcc -march=native -mtune=native -O3 -fomit-frame-pointer -fwrapv -fPIC -fPIE bi32_armv7m_small

Compiler output

Implementation: bi32_armv7m_small
Security model: constbranchindex
Compiler: gcc -march=native -mtune=native -O -fomit-frame-pointer -fwrapv -fPIC -fPIE
permutations.c: /tmp/ccOE3rkG.s: Assembler messages:
permutations.c: /tmp/ccOE3rkG.s:30: Error: operand mismatch -- `ldrb x14,[x1],#1'
permutations.c: /tmp/ccOE3rkG.s:30: Info: did you mean this?
permutations.c: /tmp/ccOE3rkG.s:30: Info: ldrb w14, [x1], #1
permutations.c: /tmp/ccOE3rkG.s:45: Error: operand mismatch -- `ldrb x14,[x1],#1'
permutations.c: /tmp/ccOE3rkG.s:45: Info: did you mean this?
permutations.c: /tmp/ccOE3rkG.s:45: Info: ldrb w14, [x1], #1

Number of similar (compiler,implementation) pairs: 1, namely:
CompilerImplementations
gcc -march=native -mtune=native -O -fomit-frame-pointer -fwrapv -fPIC -fPIE bi32_armv7m_small

Compiler output

Implementation: bi32_armv7m_small
Security model: constbranchindex
Compiler: gcc -march=native -mtune=native -Os -fomit-frame-pointer -fwrapv -fPIC -fPIE
permutations.c: /tmp/ccc8FFWR.s: Assembler messages:
permutations.c: /tmp/ccc8FFWR.s:25: Error: operand mismatch -- `ldrb x14,[x1],#1'
permutations.c: /tmp/ccc8FFWR.s:25: Info: did you mean this?
permutations.c: /tmp/ccc8FFWR.s:25: Info: ldrb w14, [x1], #1
permutations.c: /tmp/ccc8FFWR.s:40: Error: operand mismatch -- `ldrb x14,[x1],#1'
permutations.c: /tmp/ccc8FFWR.s:40: Info: did you mean this?
permutations.c: /tmp/ccc8FFWR.s:40: Info: ldrb w14, [x1], #1

Number of similar (compiler,implementation) pairs: 1, namely:
CompilerImplementations
gcc -march=native -mtune=native -Os -fomit-frame-pointer -fwrapv -fPIC -fPIE bi32_armv7m_small

Compiler output

Implementation: T:esp32
Security model: timingleaks
Compiler: clang -mcpu=native -O3 -fomit-frame-pointer -fwrapv -Qunused-arguments -fPIC -fPIE
try.c: /usr/bin/ld: /tmp/try-small-23c526.o: in function `doit':
try.c: try-small.c:(.text+0x...): undefined reference to `crypto_aead_ascon128v12_esp32_timingleaks_encrypt'
try.c: /usr/bin/ld: try-small.c:(.text+0x...): undefined reference to `crypto_aead_ascon128v12_esp32_timingleaks_decrypt'
try.c: /usr/bin/ld: /tmp/try-small-23c526.o: in function `test':
try.c: try-small.c:(.text+0x...): undefined reference to `crypto_aead_ascon128v12_esp32_timingleaks_encrypt'
try.c: /usr/bin/ld: try-small.c:(.text+0x...): undefined reference to `crypto_aead_ascon128v12_esp32_timingleaks_encrypt'
try.c: /usr/bin/ld: try-small.c:(.text+0x...): undefined reference to `crypto_aead_ascon128v12_esp32_timingleaks_decrypt'
try.c: /usr/bin/ld: try-small.c:(.text+0x...): undefined reference to `crypto_aead_ascon128v12_esp32_timingleaks_decrypt'
try.c: /usr/bin/ld: try-small.c:(.text+0x...): undefined reference to `crypto_aead_ascon128v12_esp32_timingleaks_decrypt'
try.c: /usr/bin/ld: try-small.c:(.text+0x...): undefined reference to `crypto_aead_ascon128v12_esp32_timingleaks_decrypt'
try.c: /usr/bin/ld: try-small.c:(.text+0x...): undefined reference to `crypto_aead_ascon128v12_esp32_timingleaks_decrypt'
try.c: clang: error: linker command failed with exit code 1 (use -v to see invocation)

Number of similar (compiler,implementation) pairs: 1, namely:
CompilerImplementations
clang -mcpu=native -O3 -fomit-frame-pointer -fwrapv -Qunused-arguments -fPIC -fPIE T:esp32

Compiler output

Implementation: T:esp32
Security model: timingleaks
Compiler: gcc -march=native -mtune=native -O2 -fomit-frame-pointer -fwrapv -fPIC -fPIE
try.c: /usr/bin/ld: /tmp/cc4O8d1z.o: in function `doit':
try.c: try-small.c:(.text+0x...): undefined reference to `crypto_aead_ascon128v12_esp32_timingleaks_encrypt'
try.c: /usr/bin/ld: try-small.c:(.text+0x...): undefined reference to `crypto_aead_ascon128v12_esp32_timingleaks_decrypt'
try.c: /usr/bin/ld: /tmp/cc4O8d1z.o: in function `test':
try.c: try-small.c:(.text+0x...): undefined reference to `crypto_aead_ascon128v12_esp32_timingleaks_encrypt'
try.c: /usr/bin/ld: try-small.c:(.text+0x...): undefined reference to `crypto_aead_ascon128v12_esp32_timingleaks_decrypt'
try.c: /usr/bin/ld: try-small.c:(.text+0x...): undefined reference to `crypto_aead_ascon128v12_esp32_timingleaks_decrypt'
try.c: /usr/bin/ld: try-small.c:(.text+0x...): undefined reference to `crypto_aead_ascon128v12_esp32_timingleaks_decrypt'
try.c: /usr/bin/ld: try-small.c:(.text+0x...): undefined reference to `crypto_aead_ascon128v12_esp32_timingleaks_decrypt'
try.c: /usr/bin/ld: try-small.c:(.text+0x...): undefined reference to `crypto_aead_ascon128v12_esp32_timingleaks_decrypt'
try.c: /usr/bin/ld: try-small.c:(.text+0x...): undefined reference to `crypto_aead_ascon128v12_esp32_timingleaks_encrypt'
try.c: collect2: error: ld returned 1 exit status

Number of similar (compiler,implementation) pairs: 1, namely:
CompilerImplementations
gcc -march=native -mtune=native -O2 -fomit-frame-pointer -fwrapv -fPIC -fPIE T:esp32

Compiler output

Implementation: T:esp32
Security model: timingleaks
Compiler: gcc -march=native -mtune=native -O3 -fomit-frame-pointer -fwrapv -fPIC -fPIE
try.c: /usr/bin/ld: /tmp/ccSogNS0.o: in function `doit':
try.c: try-small.c:(.text+0x...): undefined reference to `crypto_aead_ascon128v12_esp32_timingleaks_encrypt'
try.c: /usr/bin/ld: try-small.c:(.text+0x...): undefined reference to `crypto_aead_ascon128v12_esp32_timingleaks_decrypt'
try.c: /usr/bin/ld: /tmp/ccSogNS0.o: in function `test':
try.c: try-small.c:(.text+0x...): undefined reference to `crypto_aead_ascon128v12_esp32_timingleaks_encrypt'
try.c: /usr/bin/ld: try-small.c:(.text+0x...): undefined reference to `crypto_aead_ascon128v12_esp32_timingleaks_decrypt'
try.c: /usr/bin/ld: try-small.c:(.text+0x...): undefined reference to `crypto_aead_ascon128v12_esp32_timingleaks_decrypt'
try.c: /usr/bin/ld: try-small.c:(.text+0x...): undefined reference to `crypto_aead_ascon128v12_esp32_timingleaks_decrypt'
try.c: /usr/bin/ld: try-small.c:(.text+0x...): undefined reference to `crypto_aead_ascon128v12_esp32_timingleaks_decrypt'
try.c: /usr/bin/ld: try-small.c:(.text+0x...): undefined reference to `crypto_aead_ascon128v12_esp32_timingleaks_decrypt'
try.c: /usr/bin/ld: try-small.c:(.text+0x...): undefined reference to `crypto_aead_ascon128v12_esp32_timingleaks_encrypt'
try.c: collect2: error: ld returned 1 exit status

Number of similar (compiler,implementation) pairs: 1, namely:
CompilerImplementations
gcc -march=native -mtune=native -O3 -fomit-frame-pointer -fwrapv -fPIC -fPIE T:esp32

Compiler output

Implementation: T:esp32
Security model: timingleaks
Compiler: gcc -march=native -mtune=native -O -fomit-frame-pointer -fwrapv -fPIC -fPIE
try.c: /usr/bin/ld: /tmp/cc59wEAf.o: in function `doit':
try.c: try-small.c:(.text+0x...): undefined reference to `crypto_aead_ascon128v12_esp32_timingleaks_encrypt'
try.c: /usr/bin/ld: try-small.c:(.text+0x...): undefined reference to `crypto_aead_ascon128v12_esp32_timingleaks_decrypt'
try.c: /usr/bin/ld: /tmp/cc59wEAf.o: in function `test':
try.c: try-small.c:(.text+0x...): undefined reference to `crypto_aead_ascon128v12_esp32_timingleaks_encrypt'
try.c: /usr/bin/ld: try-small.c:(.text+0x...): undefined reference to `crypto_aead_ascon128v12_esp32_timingleaks_encrypt'
try.c: /usr/bin/ld: try-small.c:(.text+0x...): undefined reference to `crypto_aead_ascon128v12_esp32_timingleaks_decrypt'
try.c: /usr/bin/ld: try-small.c:(.text+0x...): undefined reference to `crypto_aead_ascon128v12_esp32_timingleaks_decrypt'
try.c: /usr/bin/ld: try-small.c:(.text+0x...): undefined reference to `crypto_aead_ascon128v12_esp32_timingleaks_decrypt'
try.c: /usr/bin/ld: try-small.c:(.text+0x...): undefined reference to `crypto_aead_ascon128v12_esp32_timingleaks_decrypt'
try.c: /usr/bin/ld: try-small.c:(.text+0x...): undefined reference to `crypto_aead_ascon128v12_esp32_timingleaks_decrypt'
try.c: collect2: error: ld returned 1 exit status

Number of similar (compiler,implementation) pairs: 1, namely:
CompilerImplementations
gcc -march=native -mtune=native -O -fomit-frame-pointer -fwrapv -fPIC -fPIE T:esp32

Compiler output

Implementation: T:esp32
Security model: timingleaks
Compiler: gcc -march=native -mtune=native -Os -fomit-frame-pointer -fwrapv -fPIC -fPIE
try.c: /usr/bin/ld: /tmp/ccf2S21z.o: in function `doit':
try.c: try-small.c:(.text+0x...): undefined reference to `crypto_aead_ascon128v12_esp32_timingleaks_encrypt'
try.c: /usr/bin/ld: try-small.c:(.text+0x...): undefined reference to `crypto_aead_ascon128v12_esp32_timingleaks_decrypt'
try.c: /usr/bin/ld: /tmp/ccf2S21z.o: in function `test':
try.c: try-small.c:(.text+0x...): undefined reference to `crypto_aead_ascon128v12_esp32_timingleaks_encrypt'
try.c: /usr/bin/ld: try-small.c:(.text+0x...): undefined reference to `crypto_aead_ascon128v12_esp32_timingleaks_encrypt'
try.c: /usr/bin/ld: try-small.c:(.text+0x...): undefined reference to `crypto_aead_ascon128v12_esp32_timingleaks_decrypt'
try.c: /usr/bin/ld: try-small.c:(.text+0x...): undefined reference to `crypto_aead_ascon128v12_esp32_timingleaks_decrypt'
try.c: /usr/bin/ld: try-small.c:(.text+0x...): undefined reference to `crypto_aead_ascon128v12_esp32_timingleaks_decrypt'
try.c: /usr/bin/ld: try-small.c:(.text+0x...): undefined reference to `crypto_aead_ascon128v12_esp32_timingleaks_decrypt'
try.c: /usr/bin/ld: try-small.c:(.text+0x...): undefined reference to `crypto_aead_ascon128v12_esp32_timingleaks_decrypt'
try.c: collect2: error: ld returned 1 exit status

Number of similar (compiler,implementation) pairs: 1, namely:
CompilerImplementations
gcc -march=native -mtune=native -Os -fomit-frame-pointer -fwrapv -fPIC -fPIE T:esp32

Compiler output

Implementation: neon
Security model: constbranchindex
Compiler: clang -mcpu=native -O3 -fomit-frame-pointer -fwrapv -Qunused-arguments -fPIC -fPIE
aead.c: aead.c:162:5: warning: value size does not match register size specified by the constraint and modifier [-Wasm-operand-widths]
aead.c: AD(6, 8, "d0", "d16");
aead.c: ^
aead.c: aead.c:32:28: note: expanded from macro 'AD'
aead.c: : [adlen_hi] "+r" (adlen_hi), [adlen_lo] "+r" (adlen_lo), \
aead.c: ^
aead.c: aead.c:162:5: note: use constraint modifier "w"
aead.c: aead.c:14:14: note: expanded from macro 'AD'
aead.c: "cmp %[adlen_hi], #0 \n\t" \
aead.c: ^
aead.c: aead.c:162:5: warning: value size does not match register size specified by the constraint and modifier [-Wasm-operand-widths]
aead.c: AD(6, 8, "d0", "d16");
aead.c: ^
aead.c: aead.c:32:56: note: expanded from macro 'AD'
aead.c: : [adlen_hi] "+r" (adlen_hi), [adlen_lo] "+r" (adlen_lo), \
aead.c: ^
aead.c: aead.c:162:5: note: use constraint modifier "w"
aead.c: aead.c:15:16: note: expanded from macro 'AD'
aead.c: "cmpeq %[adlen_lo], #(%c[R]-1) \n\t" \
aead.c: ^
aead.c: aead.c:162:5: warning: value size does not match register size specified by the constraint and modifier [-Wasm-operand-widths]
aead.c: AD(6, 8, "d0", "d16");
aead.c: ^
aead.c: aead.c:32:56: note: expanded from macro 'AD'
aead.c: : [adlen_hi] "+r" (adlen_hi), [adlen_lo] "+r" (adlen_lo), \
aead.c: ...

Number of similar (compiler,implementation) pairs: 1, namely:
CompilerImplementations
clang -mcpu=native -O3 -fomit-frame-pointer -fwrapv -Qunused-arguments -fPIC -fPIE neon

Compiler output

Implementation: neon
Security model: constbranchindex
Compiler: gcc -march=native -mtune=native -O2 -fomit-frame-pointer -fwrapv -fPIC -fPIE
aead.c: /tmp/cc4j8cWM.s: Assembler messages:
aead.c: /tmp/cc4j8cWM.s:52: Error: unknown pseudo-op: `.arm'
aead.c: /tmp/cc4j8cWM.s:53: Error: unknown pseudo-op: `.fpu'
aead.c: /tmp/cc4j8cWM.s:54: Error: unknown mnemonic `vldm' -- `vldm x0,{d0-d4}'
aead.c: /tmp/cc4j8cWM.s:55: Error: unknown mnemonic `vmvn' -- `vmvn d2,d2'
aead.c: /tmp/cc4j8cWM.s:56: Error: unknown mnemonic `vldr' -- `vldr d31,[x3,#0]'
aead.c: /tmp/cc4j8cWM.s:57: Error: unknown mnemonic `veor' -- `veor d0,d0,d4'
aead.c: /tmp/cc4j8cWM.s:58: Error: unknown mnemonic `veor' -- `veor d4,d4,d3'
aead.c: /tmp/cc4j8cWM.s:59: Error: unknown mnemonic `veor' -- `veor d2,d2,d31'
aead.c: /tmp/cc4j8cWM.s:60: Error: unknown mnemonic `vbic' -- `vbic d13,d0,d4'
aead.c: /tmp/cc4j8cWM.s:61: Error: unknown mnemonic `vbic' -- `vbic d12,d4,d3'
aead.c: /tmp/cc4j8cWM.s:62: Error: unknown mnemonic `veor' -- `veor d2,d2,d1'
aead.c: /tmp/cc4j8cWM.s:63: Error: unknown mnemonic `vbic' -- `vbic d14,d1,d0'
aead.c: /tmp/cc4j8cWM.s:64: Error: unknown mnemonic `vbic' -- `vbic d11,d3,d2'
aead.c: /tmp/cc4j8cWM.s:65: Error: unknown mnemonic `vbic' -- `vbic d10,d2,d1'
aead.c: /tmp/cc4j8cWM.s:66: Error: unknown mnemonic `veor' -- `veor q0,q0,q5'
aead.c: /tmp/cc4j8cWM.s:67: Error: unknown mnemonic `veor' -- `veor q1,q1,q6'
aead.c: /tmp/cc4j8cWM.s:68: Error: unknown mnemonic `veor' -- `veor d4,d4,d14'
aead.c: /tmp/cc4j8cWM.s:69: Error: unknown mnemonic `veor' -- `veor d1,d1,d0'
aead.c: /tmp/cc4j8cWM.s:70: Error: unknown mnemonic `veor' -- `veor d3,d3,d2'
aead.c: /tmp/cc4j8cWM.s:71: Error: unknown mnemonic `veor' -- `veor d0,d0,d4'
aead.c: /tmp/cc4j8cWM.s:72: Error: unknown mnemonic `vsri.64' -- `vsri.64 d14,d4,#7'
aead.c: /tmp/cc4j8cWM.s:73: Error: unknown mnemonic `vsri.64' -- `vsri.64 d24,d4,#41'
aead.c: /tmp/cc4j8cWM.s:74: Error: unknown mnemonic `vsri.64' -- `vsri.64 d11,d1,#39'
aead.c: /tmp/cc4j8cWM.s:75: Error: unknown mnemonic `vsri.64' -- `vsri.64 d21,d1,#61'
aead.c: ...

Number of similar (compiler,implementation) pairs: 1, namely:
CompilerImplementations
gcc -march=native -mtune=native -O2 -fomit-frame-pointer -fwrapv -fPIC -fPIE neon

Compiler output

Implementation: neon
Security model: constbranchindex
Compiler: gcc -march=native -mtune=native -O3 -fomit-frame-pointer -fwrapv -fPIC -fPIE
aead.c: /tmp/ccDoYVsi.s: Assembler messages:
aead.c: /tmp/ccDoYVsi.s:52: Error: unknown pseudo-op: `.arm'
aead.c: /tmp/ccDoYVsi.s:53: Error: unknown pseudo-op: `.fpu'
aead.c: /tmp/ccDoYVsi.s:54: Error: unknown mnemonic `vldm' -- `vldm x0,{d0-d4}'
aead.c: /tmp/ccDoYVsi.s:55: Error: unknown mnemonic `vmvn' -- `vmvn d2,d2'
aead.c: /tmp/ccDoYVsi.s:56: Error: unknown mnemonic `vldr' -- `vldr d31,[x3,#0]'
aead.c: /tmp/ccDoYVsi.s:57: Error: unknown mnemonic `veor' -- `veor d0,d0,d4'
aead.c: /tmp/ccDoYVsi.s:58: Error: unknown mnemonic `veor' -- `veor d4,d4,d3'
aead.c: /tmp/ccDoYVsi.s:59: Error: unknown mnemonic `veor' -- `veor d2,d2,d31'
aead.c: /tmp/ccDoYVsi.s:60: Error: unknown mnemonic `vbic' -- `vbic d13,d0,d4'
aead.c: /tmp/ccDoYVsi.s:61: Error: unknown mnemonic `vbic' -- `vbic d12,d4,d3'
aead.c: /tmp/ccDoYVsi.s:62: Error: unknown mnemonic `veor' -- `veor d2,d2,d1'
aead.c: /tmp/ccDoYVsi.s:63: Error: unknown mnemonic `vbic' -- `vbic d14,d1,d0'
aead.c: /tmp/ccDoYVsi.s:64: Error: unknown mnemonic `vbic' -- `vbic d11,d3,d2'
aead.c: /tmp/ccDoYVsi.s:65: Error: unknown mnemonic `vbic' -- `vbic d10,d2,d1'
aead.c: /tmp/ccDoYVsi.s:66: Error: unknown mnemonic `veor' -- `veor q0,q0,q5'
aead.c: /tmp/ccDoYVsi.s:67: Error: unknown mnemonic `veor' -- `veor q1,q1,q6'
aead.c: /tmp/ccDoYVsi.s:68: Error: unknown mnemonic `veor' -- `veor d4,d4,d14'
aead.c: /tmp/ccDoYVsi.s:69: Error: unknown mnemonic `veor' -- `veor d1,d1,d0'
aead.c: /tmp/ccDoYVsi.s:70: Error: unknown mnemonic `veor' -- `veor d3,d3,d2'
aead.c: /tmp/ccDoYVsi.s:71: Error: unknown mnemonic `veor' -- `veor d0,d0,d4'
aead.c: /tmp/ccDoYVsi.s:72: Error: unknown mnemonic `vsri.64' -- `vsri.64 d14,d4,#7'
aead.c: /tmp/ccDoYVsi.s:73: Error: unknown mnemonic `vsri.64' -- `vsri.64 d24,d4,#41'
aead.c: /tmp/ccDoYVsi.s:74: Error: unknown mnemonic `vsri.64' -- `vsri.64 d11,d1,#39'
aead.c: /tmp/ccDoYVsi.s:75: Error: unknown mnemonic `vsri.64' -- `vsri.64 d21,d1,#61'
aead.c: ...

Number of similar (compiler,implementation) pairs: 1, namely:
CompilerImplementations
gcc -march=native -mtune=native -O3 -fomit-frame-pointer -fwrapv -fPIC -fPIE neon

Compiler output

Implementation: neon
Security model: constbranchindex
Compiler: gcc -march=native -mtune=native -O -fomit-frame-pointer -fwrapv -fPIC -fPIE
aead.c: /tmp/cclFVEFZ.s: Assembler messages:
aead.c: /tmp/cclFVEFZ.s:128: Error: unknown pseudo-op: `.arm'
aead.c: /tmp/cclFVEFZ.s:129: Error: unknown pseudo-op: `.fpu'
aead.c: /tmp/cclFVEFZ.s:130: Error: unknown mnemonic `vldm' -- `vldm x0,{d0-d4}'
aead.c: /tmp/cclFVEFZ.s:131: Error: unknown mnemonic `vmvn' -- `vmvn d2,d2'
aead.c: /tmp/cclFVEFZ.s:132: Error: unknown mnemonic `vldr' -- `vldr d31,[x2,#0]'
aead.c: /tmp/cclFVEFZ.s:133: Error: unknown mnemonic `veor' -- `veor d0,d0,d4'
aead.c: /tmp/cclFVEFZ.s:134: Error: unknown mnemonic `veor' -- `veor d4,d4,d3'
aead.c: /tmp/cclFVEFZ.s:135: Error: unknown mnemonic `veor' -- `veor d2,d2,d31'
aead.c: /tmp/cclFVEFZ.s:136: Error: unknown mnemonic `vbic' -- `vbic d13,d0,d4'
aead.c: /tmp/cclFVEFZ.s:137: Error: unknown mnemonic `vbic' -- `vbic d12,d4,d3'
aead.c: /tmp/cclFVEFZ.s:138: Error: unknown mnemonic `veor' -- `veor d2,d2,d1'
aead.c: /tmp/cclFVEFZ.s:139: Error: unknown mnemonic `vbic' -- `vbic d14,d1,d0'
aead.c: /tmp/cclFVEFZ.s:140: Error: unknown mnemonic `vbic' -- `vbic d11,d3,d2'
aead.c: /tmp/cclFVEFZ.s:141: Error: unknown mnemonic `vbic' -- `vbic d10,d2,d1'
aead.c: /tmp/cclFVEFZ.s:142: Error: unknown mnemonic `veor' -- `veor q0,q0,q5'
aead.c: /tmp/cclFVEFZ.s:143: Error: unknown mnemonic `veor' -- `veor q1,q1,q6'
aead.c: /tmp/cclFVEFZ.s:144: Error: unknown mnemonic `veor' -- `veor d4,d4,d14'
aead.c: /tmp/cclFVEFZ.s:145: Error: unknown mnemonic `veor' -- `veor d1,d1,d0'
aead.c: /tmp/cclFVEFZ.s:146: Error: unknown mnemonic `veor' -- `veor d3,d3,d2'
aead.c: /tmp/cclFVEFZ.s:147: Error: unknown mnemonic `veor' -- `veor d0,d0,d4'
aead.c: /tmp/cclFVEFZ.s:148: Error: unknown mnemonic `vsri.64' -- `vsri.64 d14,d4,#7'
aead.c: /tmp/cclFVEFZ.s:149: Error: unknown mnemonic `vsri.64' -- `vsri.64 d24,d4,#41'
aead.c: /tmp/cclFVEFZ.s:150: Error: unknown mnemonic `vsri.64' -- `vsri.64 d11,d1,#39'
aead.c: /tmp/cclFVEFZ.s:151: Error: unknown mnemonic `vsri.64' -- `vsri.64 d21,d1,#61'
aead.c: ...

Number of similar (compiler,implementation) pairs: 1, namely:
CompilerImplementations
gcc -march=native -mtune=native -O -fomit-frame-pointer -fwrapv -fPIC -fPIE neon

Compiler output

Implementation: neon
Security model: constbranchindex
Compiler: gcc -march=native -mtune=native -Os -fomit-frame-pointer -fwrapv -fPIC -fPIE
aead.c: /tmp/ccsKF19H.s: Assembler messages:
aead.c: /tmp/ccsKF19H.s:52: Error: unknown pseudo-op: `.arm'
aead.c: /tmp/ccsKF19H.s:53: Error: unknown pseudo-op: `.fpu'
aead.c: /tmp/ccsKF19H.s:54: Error: unknown mnemonic `vldm' -- `vldm x0,{d0-d4}'
aead.c: /tmp/ccsKF19H.s:55: Error: unknown mnemonic `vmvn' -- `vmvn d2,d2'
aead.c: /tmp/ccsKF19H.s:56: Error: unknown mnemonic `vldr' -- `vldr d31,[x2,#0]'
aead.c: /tmp/ccsKF19H.s:57: Error: unknown mnemonic `veor' -- `veor d0,d0,d4'
aead.c: /tmp/ccsKF19H.s:58: Error: unknown mnemonic `veor' -- `veor d4,d4,d3'
aead.c: /tmp/ccsKF19H.s:59: Error: unknown mnemonic `veor' -- `veor d2,d2,d31'
aead.c: /tmp/ccsKF19H.s:60: Error: unknown mnemonic `vbic' -- `vbic d13,d0,d4'
aead.c: /tmp/ccsKF19H.s:61: Error: unknown mnemonic `vbic' -- `vbic d12,d4,d3'
aead.c: /tmp/ccsKF19H.s:62: Error: unknown mnemonic `veor' -- `veor d2,d2,d1'
aead.c: /tmp/ccsKF19H.s:63: Error: unknown mnemonic `vbic' -- `vbic d14,d1,d0'
aead.c: /tmp/ccsKF19H.s:64: Error: unknown mnemonic `vbic' -- `vbic d11,d3,d2'
aead.c: /tmp/ccsKF19H.s:65: Error: unknown mnemonic `vbic' -- `vbic d10,d2,d1'
aead.c: /tmp/ccsKF19H.s:66: Error: unknown mnemonic `veor' -- `veor q0,q0,q5'
aead.c: /tmp/ccsKF19H.s:67: Error: unknown mnemonic `veor' -- `veor q1,q1,q6'
aead.c: /tmp/ccsKF19H.s:68: Error: unknown mnemonic `veor' -- `veor d4,d4,d14'
aead.c: /tmp/ccsKF19H.s:69: Error: unknown mnemonic `veor' -- `veor d1,d1,d0'
aead.c: /tmp/ccsKF19H.s:70: Error: unknown mnemonic `veor' -- `veor d3,d3,d2'
aead.c: /tmp/ccsKF19H.s:71: Error: unknown mnemonic `veor' -- `veor d0,d0,d4'
aead.c: /tmp/ccsKF19H.s:72: Error: unknown mnemonic `vsri.64' -- `vsri.64 d14,d4,#7'
aead.c: /tmp/ccsKF19H.s:73: Error: unknown mnemonic `vsri.64' -- `vsri.64 d24,d4,#41'
aead.c: /tmp/ccsKF19H.s:74: Error: unknown mnemonic `vsri.64' -- `vsri.64 d11,d1,#39'
aead.c: /tmp/ccsKF19H.s:75: Error: unknown mnemonic `vsri.64' -- `vsri.64 d21,d1,#61'
aead.c: ...

Number of similar (compiler,implementation) pairs: 1, namely:
CompilerImplementations
gcc -march=native -mtune=native -Os -fomit-frame-pointer -fwrapv -fPIC -fPIE neon