Implementation notes: aarch64, pi4b, crypto_aead/ascon128av12

Computer: pi4b
Microarchitecture: aarch64; A72 (410fd083)
Architecture: aarch64
CPU ID: 410fd083
SUPERCOP version: 20221122
Operation: crypto_aead
Primitive: ascon128av12
TimeObject sizeTest sizeImplementationCompilerBenchmark dateSUPERCOP version
4412413812 0 025980 816 848opt64gcc_-march=native_-mtune=native_-O2_-fomit-frame-pointer_-fwrapv_-fPIC_-fPIE2023010320221122
4422113780 0 026900 816 864opt64gcc_-march=native_-mtune=native_-O3_-fomit-frame-pointer_-fwrapv_-fPIC_-fPIE2023010320221122
4677211872 0 025730 840 856opt64clang_-mcpu=native_-O3_-fomit-frame-pointer_-fwrapv_-Qunused-arguments_-fPIC_-fPIE2023010320221122
4795213372 0 024532 800 840opt64gcc_-march=native_-mtune=native_-Os_-fomit-frame-pointer_-fwrapv_-fPIC_-fPIE2023010320221122
4943112848 0 025988 816 864refgcc_-march=native_-mtune=native_-O3_-fomit-frame-pointer_-fwrapv_-fPIC_-fPIE2023010320221122
5258917324 0 030452 816 864opt32gcc_-march=native_-mtune=native_-O3_-fomit-frame-pointer_-fwrapv_-fPIC_-fPIE2023010320221122
5287117324 0 029500 816 848opt32gcc_-march=native_-mtune=native_-O2_-fomit-frame-pointer_-fwrapv_-fPIC_-fPIE2023010320221122
537389168 0 022906 840 856refclang_-mcpu=native_-O3_-fomit-frame-pointer_-fwrapv_-Qunused-arguments_-fPIC_-fPIE2023010320221122
580091892 0 015107 824 864opt64_lowsizegcc_-march=native_-mtune=native_-O3_-fomit-frame-pointer_-fwrapv_-fPIC_-fPIE2023010320221122
5858816340 0 028539 808 848opt64gcc_-march=native_-mtune=native_-O_-fomit-frame-pointer_-fwrapv_-fPIC_-fPIE2023010320221122
586801572 0 015426 840 856opt64_lowsizeclang_-mcpu=native_-O3_-fomit-frame-pointer_-fwrapv_-Qunused-arguments_-fPIC_-fPIE2023010320221122
5914917244 0 028420 800 840opt32gcc_-march=native_-mtune=native_-Os_-fomit-frame-pointer_-fwrapv_-fPIC_-fPIE2023010320221122
608911640 0 013883 824 848opt64_lowsizegcc_-march=native_-mtune=native_-O2_-fomit-frame-pointer_-fwrapv_-fPIC_-fPIE2023010320221122
632831932 0 015139 824 864opt32_lowsizegcc_-march=native_-mtune=native_-O3_-fomit-frame-pointer_-fwrapv_-fPIC_-fPIE2023010320221122
643801680 0 013915 824 848opt32_lowsizegcc_-march=native_-mtune=native_-O2_-fomit-frame-pointer_-fwrapv_-fPIC_-fPIE2023010320221122
651121640 0 012851 808 840opt64_lowsizegcc_-march=native_-mtune=native_-Os_-fomit-frame-pointer_-fwrapv_-fPIC_-fPIE2023010320221122
6986314164 0 028018 840 856opt32clang_-mcpu=native_-O3_-fomit-frame-pointer_-fwrapv_-Qunused-arguments_-fPIC_-fPIE2023010320221122
7257410928 0 023108 816 848refgcc_-march=native_-mtune=native_-O2_-fomit-frame-pointer_-fwrapv_-fPIC_-fPIE2023010320221122
7295219788 0 031995 808 848opt32gcc_-march=native_-mtune=native_-O_-fomit-frame-pointer_-fwrapv_-fPIC_-fPIE2023010320221122
738361680 0 012899 808 840opt32_lowsizegcc_-march=native_-mtune=native_-Os_-fomit-frame-pointer_-fwrapv_-fPIC_-fPIE2023010320221122
7636011128 0 023339 808 848refgcc_-march=native_-mtune=native_-O_-fomit-frame-pointer_-fwrapv_-fPIC_-fPIE2023010320221122
766121596 0 015458 840 856opt32_lowsizeclang_-mcpu=native_-O3_-fomit-frame-pointer_-fwrapv_-Qunused-arguments_-fPIC_-fPIE2023010320221122
795872508 0 014746 816 848opt64_lowsizegcc_-march=native_-mtune=native_-O_-fomit-frame-pointer_-fwrapv_-fPIC_-fPIE2023010320221122
847772548 0 018894 816 848opt32_lowsizegcc_-march=native_-mtune=native_-O_-fomit-frame-pointer_-fwrapv_-fPIC_-fPIE2023010320221122
1123202436 0 013628 800 840refgcc_-march=native_-mtune=native_-Os_-fomit-frame-pointer_-fwrapv_-fPIC_-fPIE2023010320221122
14184213152 0 026994 848 856bi32clang_-mcpu=native_-O3_-fomit-frame-pointer_-fwrapv_-Qunused-arguments_-fPIC_-fPIE2023010320221122
14550015592 0 027748 824 848bi32gcc_-march=native_-mtune=native_-O2_-fomit-frame-pointer_-fwrapv_-fPIC_-fPIE2023010320221122
14554515596 0 028716 824 864bi32gcc_-march=native_-mtune=native_-O3_-fomit-frame-pointer_-fwrapv_-fPIC_-fPIE2023010320221122
1486189704 0 022948 832 864bi32_lowreggcc_-march=native_-mtune=native_-O3_-fomit-frame-pointer_-fwrapv_-fPIC_-fPIE2023010320221122
1488069704 0 021980 832 848bi32_lowreggcc_-march=native_-mtune=native_-O2_-fomit-frame-pointer_-fwrapv_-fPIC_-fPIE2023010320221122
1516618456 0 022418 856 856bi32_lowregclang_-mcpu=native_-O3_-fomit-frame-pointer_-fwrapv_-Qunused-arguments_-fPIC_-fPIE2023010320221122
1529472328 0 016194 848 856bi32_lowsizeclang_-mcpu=native_-O3_-fomit-frame-pointer_-fwrapv_-Qunused-arguments_-fPIC_-fPIE2023010320221122
15470215284 0 026436 808 840bi32gcc_-march=native_-mtune=native_-Os_-fomit-frame-pointer_-fwrapv_-fPIC_-fPIE2023010320221122
1579922740 0 015979 832 864bi32_lowsizegcc_-march=native_-mtune=native_-O3_-fomit-frame-pointer_-fwrapv_-fPIC_-fPIE2023010320221122
1594252428 0 014699 832 848bi32_lowsizegcc_-march=native_-mtune=native_-O2_-fomit-frame-pointer_-fwrapv_-fPIC_-fPIE2023010320221122
16895817896 0 030091 816 848bi32gcc_-march=native_-mtune=native_-O_-fomit-frame-pointer_-fwrapv_-fPIC_-fPIE2023010320221122
1877229304 0 020572 816 840bi32_lowreggcc_-march=native_-mtune=native_-Os_-fomit-frame-pointer_-fwrapv_-fPIC_-fPIE2023010320221122
1897212344 0 013571 816 840bi32_lowsizegcc_-march=native_-mtune=native_-Os_-fomit-frame-pointer_-fwrapv_-fPIC_-fPIE2023010320221122
19855011460 0 023755 824 848bi32_lowreggcc_-march=native_-mtune=native_-O_-fomit-frame-pointer_-fwrapv_-fPIC_-fPIE2023010320221122
2039152608 0 014866 824 848bi32_lowsizegcc_-march=native_-mtune=native_-O_-fomit-frame-pointer_-fwrapv_-fPIC_-fPIE2023010320221122
4457478368 0 020148 824 848bi8gcc_-march=native_-mtune=native_-O2_-fomit-frame-pointer_-fwrapv_-fPIC_-fPIE2023010320221122
4947838368 0 021100 824 864bi8gcc_-march=native_-mtune=native_-O3_-fomit-frame-pointer_-fwrapv_-fPIC_-fPIE2023010320221122
5826596468 0 020346 840 856opt8_lowsizeclang_-mcpu=native_-O3_-fomit-frame-pointer_-fwrapv_-Qunused-arguments_-fPIC_-fPIE2023010320221122
5829646548 0 020434 840 856opt8clang_-mcpu=native_-O3_-fomit-frame-pointer_-fwrapv_-Qunused-arguments_-fPIC_-fPIE2023010320221122
5925977096 0 018028 808 840bi8gcc_-march=native_-mtune=native_-Os_-fomit-frame-pointer_-fwrapv_-fPIC_-fPIE2023010320221122
61111510792 0 022595 816 848bi8gcc_-march=native_-mtune=native_-O_-fomit-frame-pointer_-fwrapv_-fPIC_-fPIE2023010320221122
8596687664 0 020844 816 864opt8gcc_-march=native_-mtune=native_-O3_-fomit-frame-pointer_-fwrapv_-fPIC_-fPIE2023010320221122
8612807520 0 020668 816 864opt8_lowsizegcc_-march=native_-mtune=native_-O3_-fomit-frame-pointer_-fwrapv_-fPIC_-fPIE2023010320221122
9130137764 0 021250 848 856bi8clang_-mcpu=native_-O3_-fomit-frame-pointer_-fwrapv_-Qunused-arguments_-fPIC_-fPIE2023010320221122
9343794496 0 016684 816 848opt8gcc_-march=native_-mtune=native_-O2_-fomit-frame-pointer_-fwrapv_-fPIC_-fPIE2023010320221122
9350084240 0 016428 816 848opt8_lowsizegcc_-march=native_-mtune=native_-O2_-fomit-frame-pointer_-fwrapv_-fPIC_-fPIE2023010320221122
9549113656 0 014852 800 840opt8gcc_-march=native_-mtune=native_-Os_-fomit-frame-pointer_-fwrapv_-fPIC_-fPIE2023010320221122
9584563488 0 014652 800 840opt8_lowsizegcc_-march=native_-mtune=native_-Os_-fomit-frame-pointer_-fwrapv_-fPIC_-fPIE2023010320221122
10039244184 0 016419 808 848opt8gcc_-march=native_-mtune=native_-O_-fomit-frame-pointer_-fwrapv_-fPIC_-fPIE2023010320221122
10056583980 0 016195 808 848opt8_lowsizegcc_-march=native_-mtune=native_-O_-fomit-frame-pointer_-fwrapv_-fPIC_-fPIE2023010320221122

Compiler output

Implementation: armv6
Security model: constbranchindex
Compiler: clang -mcpu=native -O3 -fomit-frame-pointer -fwrapv -Qunused-arguments -fPIC -fPIE
aead.c: In file included from aead.c:4:
aead.c: In file included from ./permutations.h:11:
aead.c: ./round.h:96:44: warning: value size does not match register size specified by the constraint and modifier [-Wasm-operand-widths]
aead.c: [x1_h] "+r"(s->w[1][1]), [x2_l] "+r"(s->w[2][0]), [x2_h] "+r"(s->w[2][1]),
aead.c: ^
aead.c: ./round.h:14:12: note: use constraint modifier "w"
aead.c: "eor %[x2_l], %[x2_l], %[C]\n\t"
aead.c: ^~~~~~~
aead.c: %w[x2_l]
aead.c: ./round.h:96:44: warning: value size does not match register size specified by the constraint and modifier [-Wasm-operand-widths]
aead.c: [x1_h] "+r"(s->w[1][1]), [x2_l] "+r"(s->w[2][0]), [x2_h] "+r"(s->w[2][1]),
aead.c: ^
aead.c: ./round.h:14:21: note: use constraint modifier "w"
aead.c: "eor %[x2_l], %[x2_l], %[C]\n\t"
aead.c: ^~~~~~~
aead.c: %w[x2_l]
aead.c: ./round.h:98:41: warning: value size does not match register size specified by the constraint and modifier [-Wasm-operand-widths]
aead.c: [x4_h] "+r"(s->w[4][1]), [C] "+r"(C), [tmp0] "=r"(tmp0), [tmp1] "=r"(tmp1)
aead.c: ^
aead.c: ./round.h:14:30: note: use constraint modifier "w"
aead.c: "eor %[x2_l], %[x2_l], %[C]\n\t"
aead.c: ^~~~
aead.c: %w[C]
aead.c: ./round.h:95:19: warning: value size does not match register size specified by the constraint and modifier [-Wasm-operand-widths]
aead.c: [x0_l] "+r"(s->w[0][0]), [x0_h] "+r"(s->w[0][1]), [x1_l] "+r"(s->w[1][0]),
aead.c: ...

Number of similar (compiler,implementation) pairs: 1, namely:
CompilerImplementations
clang -mcpu=native -O3 -fomit-frame-pointer -fwrapv -Qunused-arguments -fPIC -fPIE armv6

Compiler output

Implementation: armv6
Security model: constbranchindex
Compiler: gcc -march=native -mtune=native -O2 -fomit-frame-pointer -fwrapv -fPIC -fPIE
permutations.c: /tmp/cchZa8gY.s: Assembler messages:
permutations.c: /tmp/cchZa8gY.s:124: Error: immediate out of range at operand 3 -- `eor x13,x13,225'
permutations.c: /tmp/cchZa8gY.s:222: Error: immediate out of range at operand 3 -- `eor x13,x13,210'
permutations.c: /tmp/cchZa8gY.s:320: Error: immediate out of range at operand 3 -- `eor x13,x13,195'
permutations.c: /tmp/cchZa8gY.s:418: Error: immediate out of range at operand 3 -- `eor x13,x13,180'
permutations.c: /tmp/cchZa8gY.s:516: Error: immediate out of range at operand 3 -- `eor x13,x13,165'
permutations.c: /tmp/cchZa8gY.s:614: Error: immediate out of range at operand 3 -- `eor x13,x13,150'
permutations.c: /tmp/cchZa8gY.s:712: Error: immediate out of range at operand 3 -- `eor x13,x13,135'
permutations.c: /tmp/cchZa8gY.s:908: Error: immediate out of range at operand 3 -- `eor x13,x13,105'
permutations.c: /tmp/cchZa8gY.s:1006: Error: immediate out of range at operand 3 -- `eor x13,x13,90'
permutations.c: /tmp/cchZa8gY.s:1104: Error: immediate out of range at operand 3 -- `eor x13,x13,75'
permutations.c: /tmp/cchZa8gY.s:1219: Error: immediate out of range at operand 3 -- `eor x13,x13,180'
permutations.c: /tmp/cchZa8gY.s:1317: Error: immediate out of range at operand 3 -- `eor x13,x13,165'
permutations.c: /tmp/cchZa8gY.s:1415: Error: immediate out of range at operand 3 -- `eor x13,x13,150'
permutations.c: /tmp/cchZa8gY.s:1513: Error: immediate out of range at operand 3 -- `eor x13,x13,135'
permutations.c: /tmp/cchZa8gY.s:1709: Error: immediate out of range at operand 3 -- `eor x13,x13,105'
permutations.c: /tmp/cchZa8gY.s:1807: Error: immediate out of range at operand 3 -- `eor x13,x13,90'
permutations.c: /tmp/cchZa8gY.s:1905: Error: immediate out of range at operand 3 -- `eor x13,x13,75'

Number of similar (compiler,implementation) pairs: 1, namely:
CompilerImplementations
gcc -march=native -mtune=native -O2 -fomit-frame-pointer -fwrapv -fPIC -fPIE armv6

Compiler output

Implementation: armv6
Security model: constbranchindex
Compiler: gcc -march=native -mtune=native -O3 -fomit-frame-pointer -fwrapv -fPIC -fPIE
permutations.c: /tmp/ccpDOSKE.s: Assembler messages:
permutations.c: /tmp/ccpDOSKE.s:124: Error: immediate out of range at operand 3 -- `eor x13,x13,225'
permutations.c: /tmp/ccpDOSKE.s:222: Error: immediate out of range at operand 3 -- `eor x13,x13,210'
permutations.c: /tmp/ccpDOSKE.s:320: Error: immediate out of range at operand 3 -- `eor x13,x13,195'
permutations.c: /tmp/ccpDOSKE.s:418: Error: immediate out of range at operand 3 -- `eor x13,x13,180'
permutations.c: /tmp/ccpDOSKE.s:516: Error: immediate out of range at operand 3 -- `eor x13,x13,165'
permutations.c: /tmp/ccpDOSKE.s:614: Error: immediate out of range at operand 3 -- `eor x13,x13,150'
permutations.c: /tmp/ccpDOSKE.s:712: Error: immediate out of range at operand 3 -- `eor x13,x13,135'
permutations.c: /tmp/ccpDOSKE.s:908: Error: immediate out of range at operand 3 -- `eor x13,x13,105'
permutations.c: /tmp/ccpDOSKE.s:1006: Error: immediate out of range at operand 3 -- `eor x13,x13,90'
permutations.c: /tmp/ccpDOSKE.s:1104: Error: immediate out of range at operand 3 -- `eor x13,x13,75'
permutations.c: /tmp/ccpDOSKE.s:1219: Error: immediate out of range at operand 3 -- `eor x13,x13,180'
permutations.c: /tmp/ccpDOSKE.s:1317: Error: immediate out of range at operand 3 -- `eor x13,x13,165'
permutations.c: /tmp/ccpDOSKE.s:1415: Error: immediate out of range at operand 3 -- `eor x13,x13,150'
permutations.c: /tmp/ccpDOSKE.s:1513: Error: immediate out of range at operand 3 -- `eor x13,x13,135'
permutations.c: /tmp/ccpDOSKE.s:1709: Error: immediate out of range at operand 3 -- `eor x13,x13,105'
permutations.c: /tmp/ccpDOSKE.s:1807: Error: immediate out of range at operand 3 -- `eor x13,x13,90'
permutations.c: /tmp/ccpDOSKE.s:1905: Error: immediate out of range at operand 3 -- `eor x13,x13,75'

Number of similar (compiler,implementation) pairs: 1, namely:
CompilerImplementations
gcc -march=native -mtune=native -O3 -fomit-frame-pointer -fwrapv -fPIC -fPIE armv6

Compiler output

Implementation: armv6
Security model: constbranchindex
Compiler: gcc -march=native -mtune=native -O -fomit-frame-pointer -fwrapv -fPIC -fPIE
permutations.c: /tmp/ccW1US1h.s: Assembler messages:
permutations.c: /tmp/ccW1US1h.s:125: Error: immediate out of range at operand 3 -- `eor x13,x13,225'
permutations.c: /tmp/ccW1US1h.s:223: Error: immediate out of range at operand 3 -- `eor x13,x13,210'
permutations.c: /tmp/ccW1US1h.s:321: Error: immediate out of range at operand 3 -- `eor x13,x13,195'
permutations.c: /tmp/ccW1US1h.s:419: Error: immediate out of range at operand 3 -- `eor x13,x13,180'
permutations.c: /tmp/ccW1US1h.s:517: Error: immediate out of range at operand 3 -- `eor x13,x13,165'
permutations.c: /tmp/ccW1US1h.s:615: Error: immediate out of range at operand 3 -- `eor x13,x13,150'
permutations.c: /tmp/ccW1US1h.s:713: Error: immediate out of range at operand 3 -- `eor x13,x13,135'
permutations.c: /tmp/ccW1US1h.s:909: Error: immediate out of range at operand 3 -- `eor x13,x13,105'
permutations.c: /tmp/ccW1US1h.s:1007: Error: immediate out of range at operand 3 -- `eor x13,x13,90'
permutations.c: /tmp/ccW1US1h.s:1105: Error: immediate out of range at operand 3 -- `eor x13,x13,75'
permutations.c: /tmp/ccW1US1h.s:1223: Error: immediate out of range at operand 3 -- `eor x8,x8,180'
permutations.c: /tmp/ccW1US1h.s:1321: Error: immediate out of range at operand 3 -- `eor x13,x13,165'
permutations.c: /tmp/ccW1US1h.s:1419: Error: immediate out of range at operand 3 -- `eor x13,x13,150'
permutations.c: /tmp/ccW1US1h.s:1517: Error: immediate out of range at operand 3 -- `eor x13,x13,135'
permutations.c: /tmp/ccW1US1h.s:1713: Error: immediate out of range at operand 3 -- `eor x13,x13,105'
permutations.c: /tmp/ccW1US1h.s:1811: Error: immediate out of range at operand 3 -- `eor x13,x13,90'
permutations.c: /tmp/ccW1US1h.s:1909: Error: immediate out of range at operand 3 -- `eor x13,x13,75'

Number of similar (compiler,implementation) pairs: 1, namely:
CompilerImplementations
gcc -march=native -mtune=native -O -fomit-frame-pointer -fwrapv -fPIC -fPIE armv6

Compiler output

Implementation: armv6
Security model: constbranchindex
Compiler: gcc -march=native -mtune=native -Os -fomit-frame-pointer -fwrapv -fPIC -fPIE
permutations.c: /tmp/ccwYe8QN.s: Assembler messages:
permutations.c: /tmp/ccwYe8QN.s:123: Error: immediate out of range at operand 3 -- `eor x13,x13,225'
permutations.c: /tmp/ccwYe8QN.s:221: Error: immediate out of range at operand 3 -- `eor x13,x13,210'
permutations.c: /tmp/ccwYe8QN.s:319: Error: immediate out of range at operand 3 -- `eor x13,x13,195'
permutations.c: /tmp/ccwYe8QN.s:417: Error: immediate out of range at operand 3 -- `eor x13,x13,180'
permutations.c: /tmp/ccwYe8QN.s:515: Error: immediate out of range at operand 3 -- `eor x13,x13,165'
permutations.c: /tmp/ccwYe8QN.s:613: Error: immediate out of range at operand 3 -- `eor x13,x13,150'
permutations.c: /tmp/ccwYe8QN.s:711: Error: immediate out of range at operand 3 -- `eor x13,x13,135'
permutations.c: /tmp/ccwYe8QN.s:907: Error: immediate out of range at operand 3 -- `eor x13,x13,105'
permutations.c: /tmp/ccwYe8QN.s:1005: Error: immediate out of range at operand 3 -- `eor x13,x13,90'
permutations.c: /tmp/ccwYe8QN.s:1103: Error: immediate out of range at operand 3 -- `eor x13,x13,75'
permutations.c: /tmp/ccwYe8QN.s:1217: Error: immediate out of range at operand 3 -- `eor x13,x13,180'
permutations.c: /tmp/ccwYe8QN.s:1315: Error: immediate out of range at operand 3 -- `eor x13,x13,165'
permutations.c: /tmp/ccwYe8QN.s:1413: Error: immediate out of range at operand 3 -- `eor x13,x13,150'
permutations.c: /tmp/ccwYe8QN.s:1511: Error: immediate out of range at operand 3 -- `eor x13,x13,135'
permutations.c: /tmp/ccwYe8QN.s:1707: Error: immediate out of range at operand 3 -- `eor x13,x13,105'
permutations.c: /tmp/ccwYe8QN.s:1805: Error: immediate out of range at operand 3 -- `eor x13,x13,90'
permutations.c: /tmp/ccwYe8QN.s:1903: Error: immediate out of range at operand 3 -- `eor x13,x13,75'

Number of similar (compiler,implementation) pairs: 1, namely:
CompilerImplementations
gcc -march=native -mtune=native -Os -fomit-frame-pointer -fwrapv -fPIC -fPIE armv6

Compiler output

Implementation: armv6_lowsize
Security model: constbranchindex
Compiler: clang -mcpu=native -O3 -fomit-frame-pointer -fwrapv -Qunused-arguments -fPIC -fPIE
aead.c: In file included from aead.c:3:
aead.c: In file included from ./permutations.h:11:
aead.c: ./round.h:96:44: warning: value size does not match register size specified by the constraint and modifier [-Wasm-operand-widths]
aead.c: [x1_h] "+r"(s->w[1][1]), [x2_l] "+r"(s->w[2][0]), [x2_h] "+r"(s->w[2][1]),
aead.c: ^
aead.c: ./round.h:14:12: note: use constraint modifier "w"
aead.c: "eor %[x2_l], %[x2_l], %[C]\n\t"
aead.c: ^~~~~~~
aead.c: %w[x2_l]
aead.c: ./round.h:96:44: warning: value size does not match register size specified by the constraint and modifier [-Wasm-operand-widths]
aead.c: [x1_h] "+r"(s->w[1][1]), [x2_l] "+r"(s->w[2][0]), [x2_h] "+r"(s->w[2][1]),
aead.c: ^
aead.c: ./round.h:14:21: note: use constraint modifier "w"
aead.c: "eor %[x2_l], %[x2_l], %[C]\n\t"
aead.c: ^~~~~~~
aead.c: %w[x2_l]
aead.c: ./round.h:98:41: warning: value size does not match register size specified by the constraint and modifier [-Wasm-operand-widths]
aead.c: [x4_h] "+r"(s->w[4][1]), [C] "+r"(C), [tmp0] "=r"(tmp0), [tmp1] "=r"(tmp1)
aead.c: ^
aead.c: ./round.h:14:30: note: use constraint modifier "w"
aead.c: "eor %[x2_l], %[x2_l], %[C]\n\t"
aead.c: ^~~~
aead.c: %w[C]
aead.c: ./round.h:95:19: warning: value size does not match register size specified by the constraint and modifier [-Wasm-operand-widths]
aead.c: [x0_l] "+r"(s->w[0][0]), [x0_h] "+r"(s->w[0][1]), [x1_l] "+r"(s->w[1][0]),
aead.c: ...

Number of similar (compiler,implementation) pairs: 1, namely:
CompilerImplementations
clang -mcpu=native -O3 -fomit-frame-pointer -fwrapv -Qunused-arguments -fPIC -fPIE armv6_lowsize

Compiler output

Implementation: armv6_lowsize
Security model: constbranchindex
Compiler: gcc -march=native -mtune=native -O2 -fomit-frame-pointer -fwrapv -fPIC -fPIE
permutations.c: /tmp/ccgIswPG.s: Assembler messages:
permutations.c: /tmp/ccgIswPG.s:100: Error: operand 2 must be an integer or stack pointer register -- `sub x1,#15'

Number of similar (compiler,implementation) pairs: 1, namely:
CompilerImplementations
gcc -march=native -mtune=native -O2 -fomit-frame-pointer -fwrapv -fPIC -fPIE armv6_lowsize

Compiler output

Implementation: armv6_lowsize
Security model: constbranchindex
Compiler: gcc -march=native -mtune=native -O3 -fomit-frame-pointer -fwrapv -fPIC -fPIE
permutations.c: /tmp/ccAlGTdm.s: Assembler messages:
permutations.c: /tmp/ccAlGTdm.s:100: Error: operand 2 must be an integer or stack pointer register -- `sub x1,#15'

Number of similar (compiler,implementation) pairs: 1, namely:
CompilerImplementations
gcc -march=native -mtune=native -O3 -fomit-frame-pointer -fwrapv -fPIC -fPIE armv6_lowsize

Compiler output

Implementation: armv6_lowsize
Security model: constbranchindex
Compiler: gcc -march=native -mtune=native -O -fomit-frame-pointer -fwrapv -fPIC -fPIE
permutations.c: /tmp/ccnbhneo.s: Assembler messages:
permutations.c: /tmp/ccnbhneo.s:104: Error: operand 2 must be an integer or stack pointer register -- `sub x1,#15'

Number of similar (compiler,implementation) pairs: 1, namely:
CompilerImplementations
gcc -march=native -mtune=native -O -fomit-frame-pointer -fwrapv -fPIC -fPIE armv6_lowsize

Compiler output

Implementation: armv6_lowsize
Security model: constbranchindex
Compiler: gcc -march=native -mtune=native -Os -fomit-frame-pointer -fwrapv -fPIC -fPIE
permutations.c: /tmp/cc0dOlN3.s: Assembler messages:
permutations.c: /tmp/cc0dOlN3.s:100: Error: operand 2 must be an integer or stack pointer register -- `sub x1,#15'

Number of similar (compiler,implementation) pairs: 1, namely:
CompilerImplementations
gcc -march=native -mtune=native -Os -fomit-frame-pointer -fwrapv -fPIC -fPIE armv6_lowsize

Compiler output

Implementation: armv6m
Security model: constbranchindex
Compiler: clang -mcpu=native -O3 -fomit-frame-pointer -fwrapv -Qunused-arguments -fPIC -fPIE
aead.c: In file included from aead.c:4:
aead.c: In file included from ./permutations.h:11:
aead.c: ./round.h:173:14: error: invalid output constraint '+l' in asm
aead.c: [x0_l] "+l"(s->w[0][0]), [x0_h] "+h"(s->w[0][1]), [x1_l] "+l"(s->w[1][0]),
aead.c: ^
aead.c: ./round.h:338:14: error: invalid output constraint '+l' in asm
aead.c: [x0_l] "+l"(s->w[0][0]), [x0_h] "+h"(s->w[0][1]), [x1_l] "+l"(s->w[1][0]),
aead.c: ^
aead.c: 2 errors generated.

Number of similar (compiler,implementation) pairs: 1, namely:
CompilerImplementations
clang -mcpu=native -O3 -fomit-frame-pointer -fwrapv -Qunused-arguments -fPIC -fPIE armv6m

Compiler output

Implementation: armv6m
Security model: constbranchindex
Compiler: gcc -march=native -mtune=native -O2 -fomit-frame-pointer -fwrapv -fPIC -fPIE
aead.c: In file included from permutations.h:11,
aead.c: from aead.c:4:
aead.c: aead.c: In function 'crypto_aead_ascon128av12_armv6m_constbranchindex_encrypt':
aead.c: round.h:12:3: error: impossible constraint in 'asm'
aead.c: 12 | __asm__ __volatile__(
aead.c: | ^~~~~~~
aead.c: round.h:12:3: error: impossible constraint in 'asm'
aead.c: 12 | __asm__ __volatile__(
aead.c: | ^~~~~~~
aead.c: round.h:12:3: error: impossible constraint in 'asm'
aead.c: 12 | __asm__ __volatile__(
aead.c: | ^~~~~~~
aead.c: round.h:12:3: error: impossible constraint in 'asm'
aead.c: 12 | __asm__ __volatile__(
aead.c: | ^~~~~~~
aead.c: round.h:12:3: error: impossible constraint in 'asm'
aead.c: 12 | __asm__ __volatile__(
aead.c: | ^~~~~~~

Number of similar (compiler,implementation) pairs: 4, namely:
CompilerImplementations
gcc -march=native -mtune=native -O2 -fomit-frame-pointer -fwrapv -fPIC -fPIE armv6m
gcc -march=native -mtune=native -O3 -fomit-frame-pointer -fwrapv -fPIC -fPIE armv6m
gcc -march=native -mtune=native -O -fomit-frame-pointer -fwrapv -fPIC -fPIE armv6m
gcc -march=native -mtune=native -Os -fomit-frame-pointer -fwrapv -fPIC -fPIE armv6m

Compiler output

Implementation: armv6m_lowsize
Security model: constbranchindex
Compiler: clang -mcpu=native -O3 -fomit-frame-pointer -fwrapv -Qunused-arguments -fPIC -fPIE
aead.c: In file included from aead.c:3:
aead.c: In file included from ./permutations.h:11:
aead.c: ./round.h:173:14: error: invalid output constraint '+l' in asm
aead.c: [x0_l] "+l"(s->w[0][0]), [x0_h] "+h"(s->w[0][1]), [x1_l] "+l"(s->w[1][0]),
aead.c: ^
aead.c: ./round.h:338:14: error: invalid output constraint '+l' in asm
aead.c: [x0_l] "+l"(s->w[0][0]), [x0_h] "+h"(s->w[0][1]), [x1_l] "+l"(s->w[1][0]),
aead.c: ^
aead.c: 2 errors generated.

Number of similar (compiler,implementation) pairs: 1, namely:
CompilerImplementations
clang -mcpu=native -O3 -fomit-frame-pointer -fwrapv -Qunused-arguments -fPIC -fPIE armv6m_lowsize

Compiler output

Implementation: armv6m_lowsize
Security model: constbranchindex
Compiler: gcc -march=native -mtune=native -O2 -fomit-frame-pointer -fwrapv -fPIC -fPIE
permutations.c: In file included from permutations.h:11,
permutations.c: from permutations.c:1:
permutations.c: permutations.c: In function 'P':
permutations.c: round.h:12:3: error: impossible constraint in 'asm'
permutations.c: 12 | __asm__ __volatile__(
permutations.c: | ^~~~~~~

Number of similar (compiler,implementation) pairs: 4, namely:
CompilerImplementations
gcc -march=native -mtune=native -O2 -fomit-frame-pointer -fwrapv -fPIC -fPIE armv6m_lowsize
gcc -march=native -mtune=native -O3 -fomit-frame-pointer -fwrapv -fPIC -fPIE armv6m_lowsize
gcc -march=native -mtune=native -O -fomit-frame-pointer -fwrapv -fPIC -fPIE armv6m_lowsize
gcc -march=native -mtune=native -Os -fomit-frame-pointer -fwrapv -fPIC -fPIE armv6m_lowsize

Compiler output

Implementation: armv7m
Security model: constbranchindex
Compiler: clang -mcpu=native -O3 -fomit-frame-pointer -fwrapv -Qunused-arguments -fPIC -fPIE
aead.c: In file included from aead.c:4:
aead.c: In file included from ./permutations.h:11:
aead.c: ./round.h:92:44: warning: value size does not match register size specified by the constraint and modifier [-Wasm-operand-widths]
aead.c: [x1_h] "+r"(s->w[1][1]), [x2_l] "+r"(s->w[2][0]), [x2_h] "+r"(s->w[2][1]),
aead.c: ^
aead.c: ./round.h:14:12: note: use constraint modifier "w"
aead.c: "eor %[x2_l], %[x2_l], %[C]\n\t"
aead.c: ^~~~~~~
aead.c: %w[x2_l]
aead.c: ./round.h:92:44: warning: value size does not match register size specified by the constraint and modifier [-Wasm-operand-widths]
aead.c: [x1_h] "+r"(s->w[1][1]), [x2_l] "+r"(s->w[2][0]), [x2_h] "+r"(s->w[2][1]),
aead.c: ^
aead.c: ./round.h:14:21: note: use constraint modifier "w"
aead.c: "eor %[x2_l], %[x2_l], %[C]\n\t"
aead.c: ^~~~~~~
aead.c: %w[x2_l]
aead.c: ./round.h:94:41: warning: value size does not match register size specified by the constraint and modifier [-Wasm-operand-widths]
aead.c: [x4_h] "+r"(s->w[4][1]), [C] "+r"(C), [tmp0] "=r"(tmp0), [tmp1] "=r"(tmp1)
aead.c: ^
aead.c: ./round.h:14:30: note: use constraint modifier "w"
aead.c: "eor %[x2_l], %[x2_l], %[C]\n\t"
aead.c: ^~~~
aead.c: %w[C]
aead.c: ./round.h:91:19: warning: value size does not match register size specified by the constraint and modifier [-Wasm-operand-widths]
aead.c: [x0_l] "+r"(s->w[0][0]), [x0_h] "+r"(s->w[0][1]), [x1_l] "+r"(s->w[1][0]),
aead.c: ...

Number of similar (compiler,implementation) pairs: 2, namely:
CompilerImplementations
clang -mcpu=native -O3 -fomit-frame-pointer -fwrapv -Qunused-arguments -fPIC -fPIE armv7m armv7m_small

Compiler output

Implementation: armv7m
Security model: constbranchindex
Compiler: gcc -march=native -mtune=native -O2 -fomit-frame-pointer -fwrapv -fPIC -fPIE
permutations.c: /tmp/ccaLs1SE.s: Assembler messages:
permutations.c: /tmp/ccaLs1SE.s:122: Error: immediate out of range at operand 3 -- `eor x13,x13,225'
permutations.c: /tmp/ccaLs1SE.s:218: Error: immediate out of range at operand 3 -- `eor x13,x13,210'
permutations.c: /tmp/ccaLs1SE.s:314: Error: immediate out of range at operand 3 -- `eor x13,x13,195'
permutations.c: /tmp/ccaLs1SE.s:410: Error: immediate out of range at operand 3 -- `eor x13,x13,180'
permutations.c: /tmp/ccaLs1SE.s:506: Error: immediate out of range at operand 3 -- `eor x13,x13,165'
permutations.c: /tmp/ccaLs1SE.s:602: Error: immediate out of range at operand 3 -- `eor x13,x13,150'
permutations.c: /tmp/ccaLs1SE.s:698: Error: immediate out of range at operand 3 -- `eor x13,x13,135'
permutations.c: /tmp/ccaLs1SE.s:890: Error: immediate out of range at operand 3 -- `eor x13,x13,105'
permutations.c: /tmp/ccaLs1SE.s:986: Error: immediate out of range at operand 3 -- `eor x13,x13,90'
permutations.c: /tmp/ccaLs1SE.s:1082: Error: immediate out of range at operand 3 -- `eor x13,x13,75'
permutations.c: /tmp/ccaLs1SE.s:1195: Error: immediate out of range at operand 3 -- `eor x13,x13,180'
permutations.c: /tmp/ccaLs1SE.s:1291: Error: immediate out of range at operand 3 -- `eor x13,x13,165'
permutations.c: /tmp/ccaLs1SE.s:1387: Error: immediate out of range at operand 3 -- `eor x13,x13,150'
permutations.c: /tmp/ccaLs1SE.s:1483: Error: immediate out of range at operand 3 -- `eor x13,x13,135'
permutations.c: /tmp/ccaLs1SE.s:1675: Error: immediate out of range at operand 3 -- `eor x13,x13,105'
permutations.c: /tmp/ccaLs1SE.s:1771: Error: immediate out of range at operand 3 -- `eor x13,x13,90'
permutations.c: /tmp/ccaLs1SE.s:1867: Error: immediate out of range at operand 3 -- `eor x13,x13,75'

Number of similar (compiler,implementation) pairs: 1, namely:
CompilerImplementations
gcc -march=native -mtune=native -O2 -fomit-frame-pointer -fwrapv -fPIC -fPIE armv7m

Compiler output

Implementation: armv7m
Security model: constbranchindex
Compiler: gcc -march=native -mtune=native -O3 -fomit-frame-pointer -fwrapv -fPIC -fPIE
permutations.c: /tmp/ccSs1rwg.s: Assembler messages:
permutations.c: /tmp/ccSs1rwg.s:122: Error: immediate out of range at operand 3 -- `eor x13,x13,225'
permutations.c: /tmp/ccSs1rwg.s:218: Error: immediate out of range at operand 3 -- `eor x13,x13,210'
permutations.c: /tmp/ccSs1rwg.s:314: Error: immediate out of range at operand 3 -- `eor x13,x13,195'
permutations.c: /tmp/ccSs1rwg.s:410: Error: immediate out of range at operand 3 -- `eor x13,x13,180'
permutations.c: /tmp/ccSs1rwg.s:506: Error: immediate out of range at operand 3 -- `eor x13,x13,165'
permutations.c: /tmp/ccSs1rwg.s:602: Error: immediate out of range at operand 3 -- `eor x13,x13,150'
permutations.c: /tmp/ccSs1rwg.s:698: Error: immediate out of range at operand 3 -- `eor x13,x13,135'
permutations.c: /tmp/ccSs1rwg.s:890: Error: immediate out of range at operand 3 -- `eor x13,x13,105'
permutations.c: /tmp/ccSs1rwg.s:986: Error: immediate out of range at operand 3 -- `eor x13,x13,90'
permutations.c: /tmp/ccSs1rwg.s:1082: Error: immediate out of range at operand 3 -- `eor x13,x13,75'
permutations.c: /tmp/ccSs1rwg.s:1195: Error: immediate out of range at operand 3 -- `eor x13,x13,180'
permutations.c: /tmp/ccSs1rwg.s:1291: Error: immediate out of range at operand 3 -- `eor x13,x13,165'
permutations.c: /tmp/ccSs1rwg.s:1387: Error: immediate out of range at operand 3 -- `eor x13,x13,150'
permutations.c: /tmp/ccSs1rwg.s:1483: Error: immediate out of range at operand 3 -- `eor x13,x13,135'
permutations.c: /tmp/ccSs1rwg.s:1675: Error: immediate out of range at operand 3 -- `eor x13,x13,105'
permutations.c: /tmp/ccSs1rwg.s:1771: Error: immediate out of range at operand 3 -- `eor x13,x13,90'
permutations.c: /tmp/ccSs1rwg.s:1867: Error: immediate out of range at operand 3 -- `eor x13,x13,75'

Number of similar (compiler,implementation) pairs: 1, namely:
CompilerImplementations
gcc -march=native -mtune=native -O3 -fomit-frame-pointer -fwrapv -fPIC -fPIE armv7m

Compiler output

Implementation: armv7m
Security model: constbranchindex
Compiler: gcc -march=native -mtune=native -O -fomit-frame-pointer -fwrapv -fPIC -fPIE
permutations.c: /tmp/ccIQ9GBr.s: Assembler messages:
permutations.c: /tmp/ccIQ9GBr.s:123: Error: immediate out of range at operand 3 -- `eor x13,x13,225'
permutations.c: /tmp/ccIQ9GBr.s:219: Error: immediate out of range at operand 3 -- `eor x13,x13,210'
permutations.c: /tmp/ccIQ9GBr.s:315: Error: immediate out of range at operand 3 -- `eor x13,x13,195'
permutations.c: /tmp/ccIQ9GBr.s:411: Error: immediate out of range at operand 3 -- `eor x13,x13,180'
permutations.c: /tmp/ccIQ9GBr.s:507: Error: immediate out of range at operand 3 -- `eor x13,x13,165'
permutations.c: /tmp/ccIQ9GBr.s:603: Error: immediate out of range at operand 3 -- `eor x13,x13,150'
permutations.c: /tmp/ccIQ9GBr.s:699: Error: immediate out of range at operand 3 -- `eor x13,x13,135'
permutations.c: /tmp/ccIQ9GBr.s:891: Error: immediate out of range at operand 3 -- `eor x13,x13,105'
permutations.c: /tmp/ccIQ9GBr.s:987: Error: immediate out of range at operand 3 -- `eor x13,x13,90'
permutations.c: /tmp/ccIQ9GBr.s:1083: Error: immediate out of range at operand 3 -- `eor x13,x13,75'
permutations.c: /tmp/ccIQ9GBr.s:1199: Error: immediate out of range at operand 3 -- `eor x8,x8,180'
permutations.c: /tmp/ccIQ9GBr.s:1295: Error: immediate out of range at operand 3 -- `eor x13,x13,165'
permutations.c: /tmp/ccIQ9GBr.s:1391: Error: immediate out of range at operand 3 -- `eor x13,x13,150'
permutations.c: /tmp/ccIQ9GBr.s:1487: Error: immediate out of range at operand 3 -- `eor x13,x13,135'
permutations.c: /tmp/ccIQ9GBr.s:1679: Error: immediate out of range at operand 3 -- `eor x13,x13,105'
permutations.c: /tmp/ccIQ9GBr.s:1775: Error: immediate out of range at operand 3 -- `eor x13,x13,90'
permutations.c: /tmp/ccIQ9GBr.s:1871: Error: immediate out of range at operand 3 -- `eor x13,x13,75'

Number of similar (compiler,implementation) pairs: 1, namely:
CompilerImplementations
gcc -march=native -mtune=native -O -fomit-frame-pointer -fwrapv -fPIC -fPIE armv7m

Compiler output

Implementation: armv7m
Security model: constbranchindex
Compiler: gcc -march=native -mtune=native -Os -fomit-frame-pointer -fwrapv -fPIC -fPIE
permutations.c: /tmp/ccgnLOBh.s: Assembler messages:
permutations.c: /tmp/ccgnLOBh.s:121: Error: immediate out of range at operand 3 -- `eor x13,x13,225'
permutations.c: /tmp/ccgnLOBh.s:217: Error: immediate out of range at operand 3 -- `eor x13,x13,210'
permutations.c: /tmp/ccgnLOBh.s:313: Error: immediate out of range at operand 3 -- `eor x13,x13,195'
permutations.c: /tmp/ccgnLOBh.s:409: Error: immediate out of range at operand 3 -- `eor x13,x13,180'
permutations.c: /tmp/ccgnLOBh.s:505: Error: immediate out of range at operand 3 -- `eor x13,x13,165'
permutations.c: /tmp/ccgnLOBh.s:601: Error: immediate out of range at operand 3 -- `eor x13,x13,150'
permutations.c: /tmp/ccgnLOBh.s:697: Error: immediate out of range at operand 3 -- `eor x13,x13,135'
permutations.c: /tmp/ccgnLOBh.s:889: Error: immediate out of range at operand 3 -- `eor x13,x13,105'
permutations.c: /tmp/ccgnLOBh.s:985: Error: immediate out of range at operand 3 -- `eor x13,x13,90'
permutations.c: /tmp/ccgnLOBh.s:1081: Error: immediate out of range at operand 3 -- `eor x13,x13,75'
permutations.c: /tmp/ccgnLOBh.s:1193: Error: immediate out of range at operand 3 -- `eor x13,x13,180'
permutations.c: /tmp/ccgnLOBh.s:1289: Error: immediate out of range at operand 3 -- `eor x13,x13,165'
permutations.c: /tmp/ccgnLOBh.s:1385: Error: immediate out of range at operand 3 -- `eor x13,x13,150'
permutations.c: /tmp/ccgnLOBh.s:1481: Error: immediate out of range at operand 3 -- `eor x13,x13,135'
permutations.c: /tmp/ccgnLOBh.s:1673: Error: immediate out of range at operand 3 -- `eor x13,x13,105'
permutations.c: /tmp/ccgnLOBh.s:1769: Error: immediate out of range at operand 3 -- `eor x13,x13,90'
permutations.c: /tmp/ccgnLOBh.s:1865: Error: immediate out of range at operand 3 -- `eor x13,x13,75'

Number of similar (compiler,implementation) pairs: 1, namely:
CompilerImplementations
gcc -march=native -mtune=native -Os -fomit-frame-pointer -fwrapv -fPIC -fPIE armv7m

Compiler output

Implementation: armv7m_lowsize
Security model: constbranchindex
Compiler: clang -mcpu=native -O3 -fomit-frame-pointer -fwrapv -Qunused-arguments -fPIC -fPIE
aead.c: In file included from aead.c:3:
aead.c: In file included from ./permutations.h:11:
aead.c: ./round.h:92:44: warning: value size does not match register size specified by the constraint and modifier [-Wasm-operand-widths]
aead.c: [x1_h] "+r"(s->w[1][1]), [x2_l] "+r"(s->w[2][0]), [x2_h] "+r"(s->w[2][1]),
aead.c: ^
aead.c: ./round.h:14:12: note: use constraint modifier "w"
aead.c: "eor %[x2_l], %[x2_l], %[C]\n\t"
aead.c: ^~~~~~~
aead.c: %w[x2_l]
aead.c: ./round.h:92:44: warning: value size does not match register size specified by the constraint and modifier [-Wasm-operand-widths]
aead.c: [x1_h] "+r"(s->w[1][1]), [x2_l] "+r"(s->w[2][0]), [x2_h] "+r"(s->w[2][1]),
aead.c: ^
aead.c: ./round.h:14:21: note: use constraint modifier "w"
aead.c: "eor %[x2_l], %[x2_l], %[C]\n\t"
aead.c: ^~~~~~~
aead.c: %w[x2_l]
aead.c: ./round.h:94:41: warning: value size does not match register size specified by the constraint and modifier [-Wasm-operand-widths]
aead.c: [x4_h] "+r"(s->w[4][1]), [C] "+r"(C), [tmp0] "=r"(tmp0), [tmp1] "=r"(tmp1)
aead.c: ^
aead.c: ./round.h:14:30: note: use constraint modifier "w"
aead.c: "eor %[x2_l], %[x2_l], %[C]\n\t"
aead.c: ^~~~
aead.c: %w[C]
aead.c: ./round.h:91:19: warning: value size does not match register size specified by the constraint and modifier [-Wasm-operand-widths]
aead.c: [x0_l] "+r"(s->w[0][0]), [x0_h] "+r"(s->w[0][1]), [x1_l] "+r"(s->w[1][0]),
aead.c: ...

Number of similar (compiler,implementation) pairs: 1, namely:
CompilerImplementations
clang -mcpu=native -O3 -fomit-frame-pointer -fwrapv -Qunused-arguments -fPIC -fPIE armv7m_lowsize

Compiler output

Implementation: armv7m_lowsize
Security model: constbranchindex
Compiler: gcc -march=native -mtune=native -O2 -fomit-frame-pointer -fwrapv -fPIC -fPIE
permutations.c: /tmp/ccxXw1aT.s: Assembler messages:
permutations.c: /tmp/ccxXw1aT.s:96: Error: operand 2 must be an integer or stack pointer register -- `sub x1,#15'

Number of similar (compiler,implementation) pairs: 1, namely:
CompilerImplementations
gcc -march=native -mtune=native -O2 -fomit-frame-pointer -fwrapv -fPIC -fPIE armv7m_lowsize

Compiler output

Implementation: armv7m_lowsize
Security model: constbranchindex
Compiler: gcc -march=native -mtune=native -O3 -fomit-frame-pointer -fwrapv -fPIC -fPIE
permutations.c: /tmp/ccpeRVnq.s: Assembler messages:
permutations.c: /tmp/ccpeRVnq.s:96: Error: operand 2 must be an integer or stack pointer register -- `sub x1,#15'

Number of similar (compiler,implementation) pairs: 1, namely:
CompilerImplementations
gcc -march=native -mtune=native -O3 -fomit-frame-pointer -fwrapv -fPIC -fPIE armv7m_lowsize

Compiler output

Implementation: armv7m_lowsize
Security model: constbranchindex
Compiler: gcc -march=native -mtune=native -O -fomit-frame-pointer -fwrapv -fPIC -fPIE
permutations.c: /tmp/cc1xNtKo.s: Assembler messages:
permutations.c: /tmp/cc1xNtKo.s:100: Error: operand 2 must be an integer or stack pointer register -- `sub x1,#15'

Number of similar (compiler,implementation) pairs: 1, namely:
CompilerImplementations
gcc -march=native -mtune=native -O -fomit-frame-pointer -fwrapv -fPIC -fPIE armv7m_lowsize

Compiler output

Implementation: armv7m_lowsize
Security model: constbranchindex
Compiler: gcc -march=native -mtune=native -Os -fomit-frame-pointer -fwrapv -fPIC -fPIE
permutations.c: /tmp/ccSGNQ3Y.s: Assembler messages:
permutations.c: /tmp/ccSGNQ3Y.s:96: Error: operand 2 must be an integer or stack pointer register -- `sub x1,#15'

Number of similar (compiler,implementation) pairs: 1, namely:
CompilerImplementations
gcc -march=native -mtune=native -Os -fomit-frame-pointer -fwrapv -fPIC -fPIE armv7m_lowsize

Compiler output

Implementation: armv7m_small
Security model: constbranchindex
Compiler: gcc -march=native -mtune=native -O2 -fomit-frame-pointer -fwrapv -fPIC -fPIE
permutations.c: /tmp/ccQ6Uzy9.s: Assembler messages:
permutations.c: /tmp/ccQ6Uzy9.s:96: Error: operand 2 must be an integer or stack pointer register -- `sub x1,#15'

Number of similar (compiler,implementation) pairs: 1, namely:
CompilerImplementations
gcc -march=native -mtune=native -O2 -fomit-frame-pointer -fwrapv -fPIC -fPIE armv7m_small

Compiler output

Implementation: armv7m_small
Security model: constbranchindex
Compiler: gcc -march=native -mtune=native -O3 -fomit-frame-pointer -fwrapv -fPIC -fPIE
permutations.c: /tmp/ccTd9MUs.s: Assembler messages:
permutations.c: /tmp/ccTd9MUs.s:96: Error: operand 2 must be an integer or stack pointer register -- `sub x1,#15'

Number of similar (compiler,implementation) pairs: 1, namely:
CompilerImplementations
gcc -march=native -mtune=native -O3 -fomit-frame-pointer -fwrapv -fPIC -fPIE armv7m_small

Compiler output

Implementation: armv7m_small
Security model: constbranchindex
Compiler: gcc -march=native -mtune=native -O -fomit-frame-pointer -fwrapv -fPIC -fPIE
permutations.c: /tmp/ccBT8uDk.s: Assembler messages:
permutations.c: /tmp/ccBT8uDk.s:100: Error: operand 2 must be an integer or stack pointer register -- `sub x1,#15'

Number of similar (compiler,implementation) pairs: 1, namely:
CompilerImplementations
gcc -march=native -mtune=native -O -fomit-frame-pointer -fwrapv -fPIC -fPIE armv7m_small

Compiler output

Implementation: armv7m_small
Security model: constbranchindex
Compiler: gcc -march=native -mtune=native -Os -fomit-frame-pointer -fwrapv -fPIC -fPIE
permutations.c: /tmp/cctaWEag.s: Assembler messages:
permutations.c: /tmp/cctaWEag.s:96: Error: operand 2 must be an integer or stack pointer register -- `sub x1,#15'

Number of similar (compiler,implementation) pairs: 1, namely:
CompilerImplementations
gcc -march=native -mtune=native -Os -fomit-frame-pointer -fwrapv -fPIC -fPIE armv7m_small

Compiler output

Implementation: T:asm_bi32_rv32b
Security model: timingleaks
Compiler: clang -mcpu=native -O3 -fomit-frame-pointer -fwrapv -Qunused-arguments -fPIC -fPIE
ascon.S: ascon.S:159:5: error: unrecognized instruction mnemonic, did you mean: b?
ascon.S: j .LPloopcond
ascon.S: ^
ascon.S: ascon.S:162:5: error: unrecognized instruction mnemonic, did you mean: eor, orn, orr, ror?
ascon.S: xor s5, s5, t2
ascon.S: ^
ascon.S: ascon.S:163:14: error: unexpected token in argument list
ascon.S: lbu t2, 1(t1)
ascon.S: ^
ascon.S: ascon.S:164:5: error: unrecognized instruction mnemonic, did you mean: eor, orn, orr, ror?
ascon.S: xor s4, s4, t2
ascon.S: ^
ascon.S: <instantiation>:1:1: error: unrecognized instruction mnemonic, did you mean: eor, orn, orr, ror?
ascon.S: xor t3, s1, s9
ascon.S: ^
ascon.S: ascon.S:167:5: note: while in macro instantiation
ascon.S: sbox s1, s3, s5, s7, s9, t4, t3, t5
ascon.S: ^
ascon.S: <instantiation>:2:5: error: unrecognized instruction mnemonic, did you mean: eor, orn, orr, ror?
ascon.S: xor t5, s7, s9
ascon.S: ^
ascon.S: ascon.S:167:5: note: while in macro instantiation
ascon.S: sbox s1, s3, s5, s7, s9, t4, t3, t5
ascon.S: ^
ascon.S: <instantiation>:3:5: error: unrecognized instruction mnemonic, did you mean: eor, orn, orr, ror?
ascon.S: ...

Number of similar (compiler,implementation) pairs: 1, namely:
CompilerImplementations
clang -mcpu=native -O3 -fomit-frame-pointer -fwrapv -Qunused-arguments -fPIC -fPIE T:asm_bi32_rv32b

Compiler output

Implementation: T:asm_bi32_rv32b
Security model: timingleaks
Compiler: gcc -march=native -mtune=native -O2 -fomit-frame-pointer -fwrapv -fPIC -fPIE
ascon.S: ascon.S: Assembler messages:
ascon.S: ascon.S:159: Error: unknown mnemonic `j' -- `j .LPloopcond'
ascon.S: ascon.S:162: Error: unknown mnemonic `xor' -- `xor s5,s5,t2'
ascon.S: ascon.S:163: Error: unknown mnemonic `lbu' -- `lbu t2,1(t1)'
ascon.S: ascon.S:164: Error: unknown mnemonic `xor' -- `xor s4,s4,t2'
ascon.S: ascon.S:167: Error: unknown mnemonic `xor' -- `xor t3,s1,s9'
ascon.S: ascon.S:167: Error: unknown mnemonic `xor' -- `xor t5,s7,s9'
ascon.S: ascon.S:167: Error: unknown mnemonic `xor' -- `xor t4,s3,s5'
ascon.S: ascon.S:167: Error: operand 1 must be an integer register -- `orn s9,s7,s9'
ascon.S: ascon.S:167: Error: unknown mnemonic `xor' -- `xor s9,s9,t4'
ascon.S: ascon.S:167: Error: unknown mnemonic `xor' -- `xor s7,s7,s3'
ascon.S: ascon.S:167: Error: unknown mnemonic `or' -- `or s7,s7,t4'
ascon.S: ascon.S:167: Error: unknown mnemonic `xor' -- `xor s7,s7,t3'
ascon.S: ascon.S:167: Error: unknown mnemonic `xor' -- `xor s5,s5,t3'
ascon.S: ascon.S:167: Error: unknown mnemonic `or' -- `or s5,s5,s3'
ascon.S: ascon.S:167: Error: unknown mnemonic `xor' -- `xor s5,s5,t5'
ascon.S: ascon.S:167: Error: unknown mnemonic `or' -- `or s1,s1,t5'
ascon.S: ascon.S:167: Error: unknown mnemonic `xor' -- `xor t4,t4,s1'
ascon.S: ascon.S:167: Error: unknown mnemonic `andn' -- `andn s3,s3,t3'
ascon.S: ascon.S:167: Error: unknown mnemonic `xor' -- `xor s3,s3,t5'
ascon.S: ascon.S:168: Error: unknown mnemonic `xor' -- `xor s1,s0,s8'
ascon.S: ascon.S:168: Error: unknown mnemonic `xor' -- `xor t5,s6,s8'
ascon.S: ascon.S:168: Error: unknown mnemonic `xor' -- `xor t3,s2,s4'
ascon.S: ascon.S:168: Error: operand 1 must be an integer register -- `orn s8,s6,s8'
ascon.S: ascon.S:168: Error: unknown mnemonic `xor' -- `xor s8,s8,t3'
ascon.S: ...

Number of similar (compiler,implementation) pairs: 4, namely:
CompilerImplementations
gcc -march=native -mtune=native -O2 -fomit-frame-pointer -fwrapv -fPIC -fPIE T:asm_bi32_rv32b
gcc -march=native -mtune=native -O3 -fomit-frame-pointer -fwrapv -fPIC -fPIE T:asm_bi32_rv32b
gcc -march=native -mtune=native -O -fomit-frame-pointer -fwrapv -fPIC -fPIE T:asm_bi32_rv32b
gcc -march=native -mtune=native -Os -fomit-frame-pointer -fwrapv -fPIC -fPIE T:asm_bi32_rv32b

Compiler output

Implementation: T:asm_esp32
Security model: timingleaks
Compiler: clang -mcpu=native -O3 -fomit-frame-pointer -fwrapv -Qunused-arguments -fPIC -fPIE
ascon.S: ascon.S:1:10: fatal error: 'xtensa/coreasm.h' file not found
ascon.S: #include <xtensa/coreasm.h>
ascon.S: ^~~~~~~~~~~~~~~~~~
ascon.S: 1 error generated.

Number of similar (compiler,implementation) pairs: 1, namely:
CompilerImplementations
clang -mcpu=native -O3 -fomit-frame-pointer -fwrapv -Qunused-arguments -fPIC -fPIE T:asm_esp32

Compiler output

Implementation: T:asm_esp32
Security model: timingleaks
Compiler: gcc -march=native -mtune=native -O2 -fomit-frame-pointer -fwrapv -fPIC -fPIE
ascon.S: ascon.S:1:10: fatal error: xtensa/coreasm.h: No such file or directory
ascon.S: 1 | #include <xtensa/coreasm.h>
ascon.S: | ^~~~~~~~~~~~~~~~~~
ascon.S: compilation terminated.

Number of similar (compiler,implementation) pairs: 4, namely:
CompilerImplementations
gcc -march=native -mtune=native -O2 -fomit-frame-pointer -fwrapv -fPIC -fPIE T:asm_esp32
gcc -march=native -mtune=native -O3 -fomit-frame-pointer -fwrapv -fPIC -fPIE T:asm_esp32
gcc -march=native -mtune=native -O -fomit-frame-pointer -fwrapv -fPIC -fPIE T:asm_esp32
gcc -march=native -mtune=native -Os -fomit-frame-pointer -fwrapv -fPIC -fPIE T:asm_esp32

Compiler output

Implementation: T:asm_fsr_rv32b
Security model: timingleaks
Compiler: clang -mcpu=native -O3 -fomit-frame-pointer -fwrapv -Qunused-arguments -fPIC -fPIE
ascon.S: ascon.S:110:5: error: unrecognized instruction mnemonic, did you mean: bl, sli?
ascon.S: li t6, 0x4b
ascon.S: ^
ascon.S: ascon.S:113:5: error: unrecognized instruction mnemonic, did you mean: eor, orn, orr, ror?
ascon.S: xor s5, s5, t1
ascon.S: ^
ascon.S: <instantiation>:1:1: error: unrecognized instruction mnemonic, did you mean: eor, orn, orr, ror?
ascon.S: xor t3, s1, s9
ascon.S: ^
ascon.S: ascon.S:116:5: note: while in macro instantiation
ascon.S: sbox s1, s3, s5, s7, s9, t4, t3, t5
ascon.S: ^
ascon.S: <instantiation>:2:5: error: unrecognized instruction mnemonic, did you mean: eor, orn, orr, ror?
ascon.S: xor t5, s7, s9
ascon.S: ^
ascon.S: ascon.S:116:5: note: while in macro instantiation
ascon.S: sbox s1, s3, s5, s7, s9, t4, t3, t5
ascon.S: ^
ascon.S: <instantiation>:3:5: error: unrecognized instruction mnemonic, did you mean: eor, orn, orr, ror?
ascon.S: xor t4, s3, s5
ascon.S: ^
ascon.S: ascon.S:116:5: note: while in macro instantiation
ascon.S: sbox s1, s3, s5, s7, s9, t4, t3, t5
ascon.S: ^
ascon.S: <instantiation>:4:9: error: invalid operand for instruction
ascon.S: ...

Number of similar (compiler,implementation) pairs: 1, namely:
CompilerImplementations
clang -mcpu=native -O3 -fomit-frame-pointer -fwrapv -Qunused-arguments -fPIC -fPIE T:asm_fsr_rv32b

Compiler output

Implementation: T:asm_fsr_rv32b
Security model: timingleaks
Compiler: gcc -march=native -mtune=native -O2 -fomit-frame-pointer -fwrapv -fPIC -fPIE
ascon.S: ascon.S: Assembler messages:
ascon.S: ascon.S:110: Error: unknown mnemonic `li' -- `li t6,0x4b'
ascon.S: ascon.S:113: Error: unknown mnemonic `xor' -- `xor s5,s5,t1'
ascon.S: ascon.S:116: Error: unknown mnemonic `xor' -- `xor t3,s1,s9'
ascon.S: ascon.S:116: Error: unknown mnemonic `xor' -- `xor t5,s7,s9'
ascon.S: ascon.S:116: Error: unknown mnemonic `xor' -- `xor t4,s3,s5'
ascon.S: ascon.S:116: Error: operand 1 must be an integer register -- `orn s9,s7,s9'
ascon.S: ascon.S:116: Error: unknown mnemonic `xor' -- `xor s9,s9,t4'
ascon.S: ascon.S:116: Error: unknown mnemonic `xor' -- `xor s7,s7,s3'
ascon.S: ascon.S:116: Error: unknown mnemonic `or' -- `or s7,s7,t4'
ascon.S: ascon.S:116: Error: unknown mnemonic `xor' -- `xor s7,s7,t3'
ascon.S: ascon.S:116: Error: unknown mnemonic `xor' -- `xor s5,s5,t3'
ascon.S: ascon.S:116: Error: unknown mnemonic `or' -- `or s5,s5,s3'
ascon.S: ascon.S:116: Error: unknown mnemonic `xor' -- `xor s5,s5,t5'
ascon.S: ascon.S:116: Error: unknown mnemonic `or' -- `or s1,s1,t5'
ascon.S: ascon.S:116: Error: unknown mnemonic `xor' -- `xor t4,t4,s1'
ascon.S: ascon.S:116: Error: unknown mnemonic `andn' -- `andn s3,s3,t3'
ascon.S: ascon.S:116: Error: unknown mnemonic `xor' -- `xor s3,s3,t5'
ascon.S: ascon.S:117: Error: unknown mnemonic `xor' -- `xor s1,s0,s8'
ascon.S: ascon.S:117: Error: unknown mnemonic `xor' -- `xor t5,s6,s8'
ascon.S: ascon.S:117: Error: unknown mnemonic `xor' -- `xor t3,s2,s4'
ascon.S: ascon.S:117: Error: operand 1 must be an integer register -- `orn s8,s6,s8'
ascon.S: ascon.S:117: Error: unknown mnemonic `xor' -- `xor s8,s8,t3'
ascon.S: ascon.S:117: Error: unknown mnemonic `xor' -- `xor s6,s6,s2'
ascon.S: ascon.S:117: Error: unknown mnemonic `or' -- `or s6,s6,t3'
ascon.S: ...

Number of similar (compiler,implementation) pairs: 4, namely:
CompilerImplementations
gcc -march=native -mtune=native -O2 -fomit-frame-pointer -fwrapv -fPIC -fPIE T:asm_fsr_rv32b
gcc -march=native -mtune=native -O3 -fomit-frame-pointer -fwrapv -fPIC -fPIE T:asm_fsr_rv32b
gcc -march=native -mtune=native -O -fomit-frame-pointer -fwrapv -fPIC -fPIE T:asm_fsr_rv32b
gcc -march=native -mtune=native -Os -fomit-frame-pointer -fwrapv -fPIC -fPIE T:asm_fsr_rv32b

Compiler output

Implementation: T:asm_rv32b
Security model: timingleaks
Compiler: clang -mcpu=native -O3 -fomit-frame-pointer -fwrapv -Qunused-arguments -fPIC -fPIE
ascon.S: ascon.S:118:5: error: unrecognized instruction mnemonic, did you mean: bl, sli?
ascon.S: li t6, 0x4b
ascon.S: ^
ascon.S: ascon.S:121:5: error: unrecognized instruction mnemonic, did you mean: eor, orn, orr, ror?
ascon.S: xor s5, s5, t1
ascon.S: ^
ascon.S: <instantiation>:1:1: error: unrecognized instruction mnemonic, did you mean: eor, orn, orr, ror?
ascon.S: xor t3, s1, s9
ascon.S: ^
ascon.S: ascon.S:124:5: note: while in macro instantiation
ascon.S: sbox s1, s3, s5, s7, s9, t4, t3, t5
ascon.S: ^
ascon.S: <instantiation>:2:5: error: unrecognized instruction mnemonic, did you mean: eor, orn, orr, ror?
ascon.S: xor t5, s7, s9
ascon.S: ^
ascon.S: ascon.S:124:5: note: while in macro instantiation
ascon.S: sbox s1, s3, s5, s7, s9, t4, t3, t5
ascon.S: ^
ascon.S: <instantiation>:3:5: error: unrecognized instruction mnemonic, did you mean: eor, orn, orr, ror?
ascon.S: xor t4, s3, s5
ascon.S: ^
ascon.S: ascon.S:124:5: note: while in macro instantiation
ascon.S: sbox s1, s3, s5, s7, s9, t4, t3, t5
ascon.S: ^
ascon.S: <instantiation>:4:9: error: invalid operand for instruction
ascon.S: ...

Number of similar (compiler,implementation) pairs: 1, namely:
CompilerImplementations
clang -mcpu=native -O3 -fomit-frame-pointer -fwrapv -Qunused-arguments -fPIC -fPIE T:asm_rv32b

Compiler output

Implementation: T:asm_rv32b
Security model: timingleaks
Compiler: gcc -march=native -mtune=native -O2 -fomit-frame-pointer -fwrapv -fPIC -fPIE
ascon.S: ascon.S: Assembler messages:
ascon.S: ascon.S:118: Error: unknown mnemonic `li' -- `li t6,0x4b'
ascon.S: ascon.S:121: Error: unknown mnemonic `xor' -- `xor s5,s5,t1'
ascon.S: ascon.S:124: Error: unknown mnemonic `xor' -- `xor t3,s1,s9'
ascon.S: ascon.S:124: Error: unknown mnemonic `xor' -- `xor t5,s7,s9'
ascon.S: ascon.S:124: Error: unknown mnemonic `xor' -- `xor t4,s3,s5'
ascon.S: ascon.S:124: Error: operand 1 must be an integer register -- `orn s9,s7,s9'
ascon.S: ascon.S:124: Error: unknown mnemonic `xor' -- `xor s9,s9,t4'
ascon.S: ascon.S:124: Error: unknown mnemonic `xor' -- `xor s7,s7,s3'
ascon.S: ascon.S:124: Error: unknown mnemonic `or' -- `or s7,s7,t4'
ascon.S: ascon.S:124: Error: unknown mnemonic `xor' -- `xor s7,s7,t3'
ascon.S: ascon.S:124: Error: unknown mnemonic `xor' -- `xor s5,s5,t3'
ascon.S: ascon.S:124: Error: unknown mnemonic `or' -- `or s5,s5,s3'
ascon.S: ascon.S:124: Error: unknown mnemonic `xor' -- `xor s5,s5,t5'
ascon.S: ascon.S:124: Error: unknown mnemonic `or' -- `or s1,s1,t5'
ascon.S: ascon.S:124: Error: unknown mnemonic `xor' -- `xor t4,t4,s1'
ascon.S: ascon.S:124: Error: unknown mnemonic `andn' -- `andn s3,s3,t3'
ascon.S: ascon.S:124: Error: unknown mnemonic `xor' -- `xor s3,s3,t5'
ascon.S: ascon.S:125: Error: unknown mnemonic `xor' -- `xor s1,s0,s8'
ascon.S: ascon.S:125: Error: unknown mnemonic `xor' -- `xor t5,s6,s8'
ascon.S: ascon.S:125: Error: unknown mnemonic `xor' -- `xor t3,s2,s4'
ascon.S: ascon.S:125: Error: operand 1 must be an integer register -- `orn s8,s6,s8'
ascon.S: ascon.S:125: Error: unknown mnemonic `xor' -- `xor s8,s8,t3'
ascon.S: ascon.S:125: Error: unknown mnemonic `xor' -- `xor s6,s6,s2'
ascon.S: ascon.S:125: Error: unknown mnemonic `or' -- `or s6,s6,t3'
ascon.S: ...

Number of similar (compiler,implementation) pairs: 4, namely:
CompilerImplementations
gcc -march=native -mtune=native -O2 -fomit-frame-pointer -fwrapv -fPIC -fPIE T:asm_rv32b
gcc -march=native -mtune=native -O3 -fomit-frame-pointer -fwrapv -fPIC -fPIE T:asm_rv32b
gcc -march=native -mtune=native -O -fomit-frame-pointer -fwrapv -fPIC -fPIE T:asm_rv32b
gcc -march=native -mtune=native -Os -fomit-frame-pointer -fwrapv -fPIC -fPIE T:asm_rv32b

Compiler output

Implementation: T:asm_rv32i
Security model: timingleaks
Compiler: clang -mcpu=native -O3 -fomit-frame-pointer -fwrapv -Qunused-arguments -fPIC -fPIE
ascon.S: ascon.S:120:5: error: unrecognized instruction mnemonic, did you mean: bl, sli?
ascon.S: li t6, 0x4b
ascon.S: ^
ascon.S: ascon.S:123:5: error: unrecognized instruction mnemonic, did you mean: eor, orn, orr, ror?
ascon.S: xor s5, s5, t1
ascon.S: ^
ascon.S: <instantiation>:1:1: error: unrecognized instruction mnemonic, did you mean: eor, orn, orr, ror?
ascon.S: xor t3, s1, s9
ascon.S: ^
ascon.S: ascon.S:126:5: note: while in macro instantiation
ascon.S: sbox s1, s3, s5, s7, s9, t4, t3, t5
ascon.S: ^
ascon.S: <instantiation>:2:5: error: unrecognized instruction mnemonic, did you mean: eor, orn, orr, ror?
ascon.S: xor t5, s7, s9
ascon.S: ^
ascon.S: ascon.S:126:5: note: while in macro instantiation
ascon.S: sbox s1, s3, s5, s7, s9, t4, t3, t5
ascon.S: ^
ascon.S: <instantiation>:3:5: error: unrecognized instruction mnemonic
ascon.S: xori s9, s9, -1
ascon.S: ^
ascon.S: ascon.S:126:5: note: while in macro instantiation
ascon.S: sbox s1, s3, s5, s7, s9, t4, t3, t5
ascon.S: ^
ascon.S: <instantiation>:4:5: error: unrecognized instruction mnemonic, did you mean: eor, orn, orr, ror?
ascon.S: ...

Number of similar (compiler,implementation) pairs: 1, namely:
CompilerImplementations
clang -mcpu=native -O3 -fomit-frame-pointer -fwrapv -Qunused-arguments -fPIC -fPIE T:asm_rv32i

Compiler output

Implementation: T:asm_rv32i
Security model: timingleaks
Compiler: gcc -march=native -mtune=native -O2 -fomit-frame-pointer -fwrapv -fPIC -fPIE
ascon.S: ascon.S: Assembler messages:
ascon.S: ascon.S:120: Error: unknown mnemonic `li' -- `li t6,0x4b'
ascon.S: ascon.S:123: Error: unknown mnemonic `xor' -- `xor s5,s5,t1'
ascon.S: ascon.S:126: Error: unknown mnemonic `xor' -- `xor t3,s1,s9'
ascon.S: ascon.S:126: Error: unknown mnemonic `xor' -- `xor t5,s7,s9'
ascon.S: ascon.S:126: Error: unknown mnemonic `xori' -- `xori s9,s9,-1'
ascon.S: ascon.S:126: Error: unknown mnemonic `xor' -- `xor t4,s3,s5'
ascon.S: ascon.S:126: Error: unknown mnemonic `or' -- `or s9,s9,s7'
ascon.S: ascon.S:126: Error: unknown mnemonic `xor' -- `xor s9,s9,t4'
ascon.S: ascon.S:126: Error: unknown mnemonic `xor' -- `xor s7,s7,s3'
ascon.S: ascon.S:126: Error: unknown mnemonic `or' -- `or s7,s7,t4'
ascon.S: ascon.S:126: Error: unknown mnemonic `xor' -- `xor s7,s7,t3'
ascon.S: ascon.S:126: Error: unknown mnemonic `xor' -- `xor s5,s5,t3'
ascon.S: ascon.S:126: Error: unknown mnemonic `or' -- `or s5,s5,s3'
ascon.S: ascon.S:126: Error: unknown mnemonic `xor' -- `xor s5,s5,t5'
ascon.S: ascon.S:126: Error: unknown mnemonic `or' -- `or s1,s1,t5'
ascon.S: ascon.S:126: Error: unknown mnemonic `xor' -- `xor t4,t4,s1'
ascon.S: ascon.S:126: Error: unknown mnemonic `xori' -- `xori t3,t3,-1'
ascon.S: ascon.S:126: Error: operand 1 must be an integer or stack pointer register -- `and s3,s3,t3'
ascon.S: ascon.S:126: Error: unknown mnemonic `xor' -- `xor s3,s3,t5'
ascon.S: ascon.S:127: Error: unknown mnemonic `xor' -- `xor s1,s0,s8'
ascon.S: ascon.S:127: Error: unknown mnemonic `xor' -- `xor t5,s6,s8'
ascon.S: ascon.S:127: Error: unknown mnemonic `xori' -- `xori s8,s8,-1'
ascon.S: ascon.S:127: Error: unknown mnemonic `xor' -- `xor t3,s2,s4'
ascon.S: ascon.S:127: Error: unknown mnemonic `or' -- `or s8,s8,s6'
ascon.S: ...

Number of similar (compiler,implementation) pairs: 4, namely:
CompilerImplementations
gcc -march=native -mtune=native -O2 -fomit-frame-pointer -fwrapv -fPIC -fPIE T:asm_rv32i
gcc -march=native -mtune=native -O3 -fomit-frame-pointer -fwrapv -fPIC -fPIE T:asm_rv32i
gcc -march=native -mtune=native -O -fomit-frame-pointer -fwrapv -fPIC -fPIE T:asm_rv32i
gcc -march=native -mtune=native -Os -fomit-frame-pointer -fwrapv -fPIC -fPIE T:asm_rv32i

Compiler output

Implementation: avr
Security model: constbranchindex
Compiler: clang -mcpu=native -O3 -fomit-frame-pointer -fwrapv -Qunused-arguments -fPIC -fPIE
permutations.S: permutations.S:29:10: fatal error: 'avr/io.h' file not found
permutations.S: #include "avr/io.h"
permutations.S: ^~~~~~~~~~
permutations.S: 1 error generated.

Number of similar (compiler,implementation) pairs: 2, namely:
CompilerImplementations
clang -mcpu=native -O3 -fomit-frame-pointer -fwrapv -Qunused-arguments -fPIC -fPIE avr avr_lowsize

Compiler output

Implementation: avr
Security model: constbranchindex
Compiler: gcc -march=native -mtune=native -O2 -fomit-frame-pointer -fwrapv -fPIC -fPIE
permutations.S: permutations.S:29:10: fatal error: avr/io.h: No such file or directory
permutations.S: 29 | #include "avr/io.h"
permutations.S: | ^~~~~~~~~~
permutations.S: compilation terminated.

Number of similar (compiler,implementation) pairs: 8, namely:
CompilerImplementations
gcc -march=native -mtune=native -O2 -fomit-frame-pointer -fwrapv -fPIC -fPIE avr
gcc -march=native -mtune=native -O3 -fomit-frame-pointer -fwrapv -fPIC -fPIE avr
gcc -march=native -mtune=native -O -fomit-frame-pointer -fwrapv -fPIC -fPIE avr
gcc -march=native -mtune=native -Os -fomit-frame-pointer -fwrapv -fPIC -fPIE avr
gcc -march=native -mtune=native -O2 -fomit-frame-pointer -fwrapv -fPIC -fPIE avr_lowsize
gcc -march=native -mtune=native -O3 -fomit-frame-pointer -fwrapv -fPIC -fPIE avr_lowsize
gcc -march=native -mtune=native -O -fomit-frame-pointer -fwrapv -fPIC -fPIE avr_lowsize
gcc -march=native -mtune=native -Os -fomit-frame-pointer -fwrapv -fPIC -fPIE avr_lowsize

Compiler output

Implementation: bi32_armv6
Security model: constbranchindex
Compiler: clang -mcpu=native -O3 -fomit-frame-pointer -fwrapv -Qunused-arguments -fPIC -fPIE
aead.c: In file included from aead.c:4:
aead.c: In file included from ./permutations.h:11:
aead.c: ./round.h:82:19: warning: value size does not match register size specified by the constraint and modifier [-Wasm-operand-widths]
aead.c: [tmp1] "=r"(tmp1)
aead.c: ^
aead.c: ./round.h:15:13: note: use constraint modifier "w"
aead.c: "ldrb %[tmp1], [%[C]], #1\n\t"
aead.c: ^~~~~~~
aead.c: %w[tmp1]
aead.c: ./round.h:78:19: warning: value size does not match register size specified by the constraint and modifier [-Wasm-operand-widths]
aead.c: [x0_l] "+r"(s->w[0][0]), [x0_h] "+r"(s->w[0][1]), [x1_l] "+r"(s->w[1][0]),
aead.c: ^
aead.c: ./round.h:16:12: note: use constraint modifier "w"
aead.c: "eor %[x0_l], %[x0_l], %[x4_l]\n\t"
aead.c: ^~~~~~~
aead.c: %w[x0_l]
aead.c: ./round.h:78:19: warning: value size does not match register size specified by the constraint and modifier [-Wasm-operand-widths]
aead.c: [x0_l] "+r"(s->w[0][0]), [x0_h] "+r"(s->w[0][1]), [x1_l] "+r"(s->w[1][0]),
aead.c: ^
aead.c: ./round.h:16:21: note: use constraint modifier "w"
aead.c: "eor %[x0_l], %[x0_l], %[x4_l]\n\t"
aead.c: ^~~~~~~
aead.c: %w[x0_l]
aead.c: ./round.h:80:69: warning: value size does not match register size specified by the constraint and modifier [-Wasm-operand-widths]
aead.c: [x3_l] "+r"(s->w[3][0]), [x3_h] "+r"(s->w[3][1]), [x4_l] "+r"(s->w[4][0]),
aead.c: ...

Number of similar (compiler,implementation) pairs: 1, namely:
CompilerImplementations
clang -mcpu=native -O3 -fomit-frame-pointer -fwrapv -Qunused-arguments -fPIC -fPIE bi32_armv6

Compiler output

Implementation: bi32_armv6
Security model: constbranchindex
Compiler: gcc -march=native -mtune=native -O2 -fomit-frame-pointer -fwrapv -fPIC -fPIE
permutations.c: /tmp/ccqkvUas.s: Assembler messages:
permutations.c: /tmp/ccqkvUas.s:105: Error: immediate out of range at operand 3 -- `eor x13,x13,9'
permutations.c: /tmp/ccqkvUas.s:201: Error: immediate out of range at operand 3 -- `eor x8,x8,9'
permutations.c: /tmp/ccqkvUas.s:263: Error: immediate out of range at operand 3 -- `eor x13,x13,9'
permutations.c: /tmp/ccqkvUas.s:280: Error: immediate out of range at operand 3 -- `eor x6,x6,9'
permutations.c: /tmp/ccqkvUas.s:517: Error: immediate out of range at operand 3 -- `eor x6,x6,9'
permutations.c: /tmp/ccqkvUas.s:596: Error: immediate out of range at operand 3 -- `eor x7,x7,9'
permutations.c: /tmp/ccqkvUas.s:737: Error: immediate out of range at operand 3 -- `eor x13,x13,9'
permutations.c: /tmp/ccqkvUas.s:895: Error: immediate out of range at operand 3 -- `eor x13,x13,9'
permutations.c: /tmp/ccqkvUas.s:1166: Error: immediate out of range at operand 3 -- `eor x6,x6,9'
permutations.c: /tmp/ccqkvUas.s:1245: Error: immediate out of range at operand 3 -- `eor x7,x7,9'
permutations.c: /tmp/ccqkvUas.s:1386: Error: immediate out of range at operand 3 -- `eor x13,x13,9'
permutations.c: /tmp/ccqkvUas.s:1544: Error: immediate out of range at operand 3 -- `eor x13,x13,9'

Number of similar (compiler,implementation) pairs: 1, namely:
CompilerImplementations
gcc -march=native -mtune=native -O2 -fomit-frame-pointer -fwrapv -fPIC -fPIE bi32_armv6

Compiler output

Implementation: bi32_armv6
Security model: constbranchindex
Compiler: gcc -march=native -mtune=native -O3 -fomit-frame-pointer -fwrapv -fPIC -fPIE
permutations.c: /tmp/ccSKJNzO.s: Assembler messages:
permutations.c: /tmp/ccSKJNzO.s:105: Error: immediate out of range at operand 3 -- `eor x13,x13,9'
permutations.c: /tmp/ccSKJNzO.s:201: Error: immediate out of range at operand 3 -- `eor x8,x8,9'
permutations.c: /tmp/ccSKJNzO.s:263: Error: immediate out of range at operand 3 -- `eor x13,x13,9'
permutations.c: /tmp/ccSKJNzO.s:280: Error: immediate out of range at operand 3 -- `eor x6,x6,9'
permutations.c: /tmp/ccSKJNzO.s:517: Error: immediate out of range at operand 3 -- `eor x6,x6,9'
permutations.c: /tmp/ccSKJNzO.s:596: Error: immediate out of range at operand 3 -- `eor x7,x7,9'
permutations.c: /tmp/ccSKJNzO.s:737: Error: immediate out of range at operand 3 -- `eor x13,x13,9'
permutations.c: /tmp/ccSKJNzO.s:895: Error: immediate out of range at operand 3 -- `eor x13,x13,9'
permutations.c: /tmp/ccSKJNzO.s:1166: Error: immediate out of range at operand 3 -- `eor x6,x6,9'
permutations.c: /tmp/ccSKJNzO.s:1245: Error: immediate out of range at operand 3 -- `eor x7,x7,9'
permutations.c: /tmp/ccSKJNzO.s:1386: Error: immediate out of range at operand 3 -- `eor x13,x13,9'
permutations.c: /tmp/ccSKJNzO.s:1544: Error: immediate out of range at operand 3 -- `eor x13,x13,9'

Number of similar (compiler,implementation) pairs: 1, namely:
CompilerImplementations
gcc -march=native -mtune=native -O3 -fomit-frame-pointer -fwrapv -fPIC -fPIE bi32_armv6

Compiler output

Implementation: bi32_armv6
Security model: constbranchindex
Compiler: gcc -march=native -mtune=native -O -fomit-frame-pointer -fwrapv -fPIC -fPIE
permutations.c: /tmp/ccDwwGmz.s: Assembler messages:
permutations.c: /tmp/ccDwwGmz.s:106: Error: immediate out of range at operand 3 -- `eor x13,x13,9'
permutations.c: /tmp/ccDwwGmz.s:202: Error: immediate out of range at operand 3 -- `eor x8,x8,9'
permutations.c: /tmp/ccDwwGmz.s:264: Error: immediate out of range at operand 3 -- `eor x13,x13,9'
permutations.c: /tmp/ccDwwGmz.s:281: Error: immediate out of range at operand 3 -- `eor x8,x8,9'
permutations.c: /tmp/ccDwwGmz.s:518: Error: immediate out of range at operand 3 -- `eor x8,x8,9'
permutations.c: /tmp/ccDwwGmz.s:597: Error: immediate out of range at operand 3 -- `eor x8,x8,9'
permutations.c: /tmp/ccDwwGmz.s:738: Error: immediate out of range at operand 3 -- `eor x13,x13,9'
permutations.c: /tmp/ccDwwGmz.s:896: Error: immediate out of range at operand 3 -- `eor x13,x13,9'
permutations.c: /tmp/ccDwwGmz.s:1170: Error: immediate out of range at operand 3 -- `eor x8,x8,9'
permutations.c: /tmp/ccDwwGmz.s:1249: Error: immediate out of range at operand 3 -- `eor x8,x8,9'
permutations.c: /tmp/ccDwwGmz.s:1390: Error: immediate out of range at operand 3 -- `eor x13,x13,9'
permutations.c: /tmp/ccDwwGmz.s:1548: Error: immediate out of range at operand 3 -- `eor x13,x13,9'

Number of similar (compiler,implementation) pairs: 1, namely:
CompilerImplementations
gcc -march=native -mtune=native -O -fomit-frame-pointer -fwrapv -fPIC -fPIE bi32_armv6

Compiler output

Implementation: bi32_armv6
Security model: constbranchindex
Compiler: gcc -march=native -mtune=native -Os -fomit-frame-pointer -fwrapv -fPIC -fPIE
permutations.c: /tmp/cc08SQ7P.s: Assembler messages:
permutations.c: /tmp/cc08SQ7P.s:104: Error: immediate out of range at operand 3 -- `eor x13,x13,9'
permutations.c: /tmp/cc08SQ7P.s:200: Error: immediate out of range at operand 3 -- `eor x8,x8,9'
permutations.c: /tmp/cc08SQ7P.s:262: Error: immediate out of range at operand 3 -- `eor x13,x13,9'
permutations.c: /tmp/cc08SQ7P.s:279: Error: immediate out of range at operand 3 -- `eor x8,x8,9'
permutations.c: /tmp/cc08SQ7P.s:516: Error: immediate out of range at operand 3 -- `eor x8,x8,9'
permutations.c: /tmp/cc08SQ7P.s:595: Error: immediate out of range at operand 3 -- `eor x8,x8,9'
permutations.c: /tmp/cc08SQ7P.s:736: Error: immediate out of range at operand 3 -- `eor x13,x13,9'
permutations.c: /tmp/cc08SQ7P.s:894: Error: immediate out of range at operand 3 -- `eor x13,x13,9'
permutations.c: /tmp/cc08SQ7P.s:1164: Error: immediate out of range at operand 3 -- `eor x8,x8,9'
permutations.c: /tmp/cc08SQ7P.s:1243: Error: immediate out of range at operand 3 -- `eor x8,x8,9'
permutations.c: /tmp/cc08SQ7P.s:1384: Error: immediate out of range at operand 3 -- `eor x13,x13,9'
permutations.c: /tmp/cc08SQ7P.s:1542: Error: immediate out of range at operand 3 -- `eor x13,x13,9'

Number of similar (compiler,implementation) pairs: 1, namely:
CompilerImplementations
gcc -march=native -mtune=native -Os -fomit-frame-pointer -fwrapv -fPIC -fPIE bi32_armv6

Compiler output

Implementation: bi32_armv6m
Security model: constbranchindex
Compiler: clang -mcpu=native -O3 -fomit-frame-pointer -fwrapv -Qunused-arguments -fPIC -fPIE
aead.c: In file included from aead.c:4:
aead.c: In file included from ./permutations.h:11:
aead.c: ./round.h:164:14: error: invalid output constraint '+l' in asm
aead.c: [x0_l] "+l"(s->w[0][0]), [x0_h] "+h"(s->w[0][1]), [x1_l] "+l"(s->w[1][0]),
aead.c: ^
aead.c: ./round.h:314:14: error: invalid output constraint '+l' in asm
aead.c: [x0_l] "+l"(s->w[0][0]), [x0_h] "+h"(s->w[0][1]), [x1_l] "+l"(s->w[1][0]),
aead.c: ^
aead.c: 2 errors generated.

Number of similar (compiler,implementation) pairs: 1, namely:
CompilerImplementations
clang -mcpu=native -O3 -fomit-frame-pointer -fwrapv -Qunused-arguments -fPIC -fPIE bi32_armv6m

Compiler output

Implementation: bi32_armv6m
Security model: constbranchindex
Compiler: gcc -march=native -mtune=native -O2 -fomit-frame-pointer -fwrapv -fPIC -fPIE
aead.c: In file included from permutations.h:11,
aead.c: from aead.c:4:
aead.c: aead.c: In function 'crypto_aead_ascon128av12_bi32_armv6m_constbranchindex_encrypt':
aead.c: round.h:13:3: error: impossible constraint in 'asm'
aead.c: 13 | __asm__ __volatile__(
aead.c: | ^~~~~~~
aead.c: round.h:13:3: error: impossible constraint in 'asm'
aead.c: 13 | __asm__ __volatile__(
aead.c: | ^~~~~~~
aead.c: round.h:13:3: error: impossible constraint in 'asm'
aead.c: 13 | __asm__ __volatile__(
aead.c: | ^~~~~~~
aead.c: round.h:13:3: error: impossible constraint in 'asm'
aead.c: 13 | __asm__ __volatile__(
aead.c: | ^~~~~~~
aead.c: round.h:13:3: error: impossible constraint in 'asm'
aead.c: 13 | __asm__ __volatile__(
aead.c: | ^~~~~~~

Number of similar (compiler,implementation) pairs: 4, namely:
CompilerImplementations
gcc -march=native -mtune=native -O2 -fomit-frame-pointer -fwrapv -fPIC -fPIE bi32_armv6m
gcc -march=native -mtune=native -O3 -fomit-frame-pointer -fwrapv -fPIC -fPIE bi32_armv6m
gcc -march=native -mtune=native -O -fomit-frame-pointer -fwrapv -fPIC -fPIE bi32_armv6m
gcc -march=native -mtune=native -Os -fomit-frame-pointer -fwrapv -fPIC -fPIE bi32_armv6m

Compiler output

Implementation: bi32_armv7m
Security model: constbranchindex
Compiler: clang -mcpu=native -O3 -fomit-frame-pointer -fwrapv -Qunused-arguments -fPIC -fPIE
aead.c: In file included from aead.c:4:
aead.c: In file included from ./permutations.h:11:
aead.c: ./round.h:78:19: warning: value size does not match register size specified by the constraint and modifier [-Wasm-operand-widths]
aead.c: [tmp1] "=r"(tmp1)
aead.c: ^
aead.c: ./round.h:15:13: note: use constraint modifier "w"
aead.c: "ldrb %[tmp1], [%[C]], #1\n\t"
aead.c: ^~~~~~~
aead.c: %w[tmp1]
aead.c: ./round.h:74:19: warning: value size does not match register size specified by the constraint and modifier [-Wasm-operand-widths]
aead.c: [x0_l] "+r"(s->w[0][0]), [x0_h] "+r"(s->w[0][1]), [x1_l] "+r"(s->w[1][0]),
aead.c: ^
aead.c: ./round.h:16:12: note: use constraint modifier "w"
aead.c: "eor %[x0_l], %[x0_l], %[x4_l]\n\t"
aead.c: ^~~~~~~
aead.c: %w[x0_l]
aead.c: ./round.h:74:19: warning: value size does not match register size specified by the constraint and modifier [-Wasm-operand-widths]
aead.c: [x0_l] "+r"(s->w[0][0]), [x0_h] "+r"(s->w[0][1]), [x1_l] "+r"(s->w[1][0]),
aead.c: ^
aead.c: ./round.h:16:21: note: use constraint modifier "w"
aead.c: "eor %[x0_l], %[x0_l], %[x4_l]\n\t"
aead.c: ^~~~~~~
aead.c: %w[x0_l]
aead.c: ./round.h:76:69: warning: value size does not match register size specified by the constraint and modifier [-Wasm-operand-widths]
aead.c: [x3_l] "+r"(s->w[3][0]), [x3_h] "+r"(s->w[3][1]), [x4_l] "+r"(s->w[4][0]),
aead.c: ...

Number of similar (compiler,implementation) pairs: 2, namely:
CompilerImplementations
clang -mcpu=native -O3 -fomit-frame-pointer -fwrapv -Qunused-arguments -fPIC -fPIE bi32_armv7m bi32_armv7m_small

Compiler output

Implementation: bi32_armv7m
Security model: constbranchindex
Compiler: gcc -march=native -mtune=native -O2 -fomit-frame-pointer -fwrapv -fPIC -fPIE
aead.c: /tmp/ccjYb6p5.s: Assembler messages:
aead.c: /tmp/ccjYb6p5.s:303: Error: immediate out of range at operand 3 -- `eor x13,x13,9'
aead.c: /tmp/ccjYb6p5.s:396: Error: immediate out of range at operand 3 -- `eor x9,x9,9'
aead.c: /tmp/ccjYb6p5.s:457: Error: immediate out of range at operand 3 -- `eor x13,x13,9'
aead.c: /tmp/ccjYb6p5.s:473: Error: immediate out of range at operand 3 -- `eor x9,x9,9'
aead.c: /tmp/ccjYb6p5.s:704: Error: immediate out of range at operand 3 -- `eor x9,x9,9'
aead.c: /tmp/ccjYb6p5.s:781: Error: immediate out of range at operand 3 -- `eor x9,x9,9'
aead.c: /tmp/ccjYb6p5.s:919: Error: immediate out of range at operand 3 -- `eor x13,x13,9'
aead.c: /tmp/ccjYb6p5.s:1052: Error: immediate out of range at operand 3 -- `eor x1,x1,9'
aead.c: /tmp/ccjYb6p5.s:1399: Error: immediate out of range at operand 3 -- `eor x7,x7,9'
aead.c: /tmp/ccjYb6p5.s:1476: Error: immediate out of range at operand 3 -- `eor x7,x7,9'
aead.c: /tmp/ccjYb6p5.s:1617: Error: immediate out of range at operand 3 -- `eor x6,x6,9'
aead.c: /tmp/ccjYb6p5.s:1740: Error: immediate out of range at operand 3 -- `eor x6,x6,9'
aead.c: /tmp/ccjYb6p5.s:2054: Error: immediate out of range at operand 3 -- `eor x7,x7,9'
aead.c: /tmp/ccjYb6p5.s:2131: Error: immediate out of range at operand 3 -- `eor x6,x6,9'
aead.c: /tmp/ccjYb6p5.s:2268: Error: immediate out of range at operand 3 -- `eor x1,x1,9'
aead.c: /tmp/ccjYb6p5.s:2382: Error: immediate out of range at operand 3 -- `eor x1,x1,9'
aead.c: /tmp/ccjYb6p5.s:2811: Error: immediate out of range at operand 3 -- `eor x0,x0,9'
aead.c: /tmp/ccjYb6p5.s:2888: Error: immediate out of range at operand 3 -- `eor x0,x0,9'
aead.c: /tmp/ccjYb6p5.s:3025: Error: immediate out of range at operand 3 -- `eor x5,x5,9'
aead.c: /tmp/ccjYb6p5.s:3139: Error: immediate out of range at operand 3 -- `eor x5,x5,9'
aead.c: /tmp/ccjYb6p5.s:3539: Error: immediate out of range at operand 3 -- `eor x13,x13,9'
aead.c: /tmp/ccjYb6p5.s:3632: Error: immediate out of range at operand 3 -- `eor x6,x6,9'
aead.c: /tmp/ccjYb6p5.s:3693: Error: immediate out of range at operand 3 -- `eor x13,x13,9'
aead.c: /tmp/ccjYb6p5.s:3709: Error: immediate out of range at operand 3 -- `eor x7,x7,9'
aead.c: ...

Number of similar (compiler,implementation) pairs: 1, namely:
CompilerImplementations
gcc -march=native -mtune=native -O2 -fomit-frame-pointer -fwrapv -fPIC -fPIE bi32_armv7m

Compiler output

Implementation: bi32_armv7m
Security model: constbranchindex
Compiler: gcc -march=native -mtune=native -O3 -fomit-frame-pointer -fwrapv -fPIC -fPIE
aead.c: /tmp/ccudHJPy.s: Assembler messages:
aead.c: /tmp/ccudHJPy.s:303: Error: immediate out of range at operand 3 -- `eor x13,x13,9'
aead.c: /tmp/ccudHJPy.s:396: Error: immediate out of range at operand 3 -- `eor x9,x9,9'
aead.c: /tmp/ccudHJPy.s:457: Error: immediate out of range at operand 3 -- `eor x13,x13,9'
aead.c: /tmp/ccudHJPy.s:473: Error: immediate out of range at operand 3 -- `eor x9,x9,9'
aead.c: /tmp/ccudHJPy.s:704: Error: immediate out of range at operand 3 -- `eor x9,x9,9'
aead.c: /tmp/ccudHJPy.s:781: Error: immediate out of range at operand 3 -- `eor x9,x9,9'
aead.c: /tmp/ccudHJPy.s:919: Error: immediate out of range at operand 3 -- `eor x13,x13,9'
aead.c: /tmp/ccudHJPy.s:1052: Error: immediate out of range at operand 3 -- `eor x1,x1,9'
aead.c: /tmp/ccudHJPy.s:1399: Error: immediate out of range at operand 3 -- `eor x7,x7,9'
aead.c: /tmp/ccudHJPy.s:1476: Error: immediate out of range at operand 3 -- `eor x7,x7,9'
aead.c: /tmp/ccudHJPy.s:1617: Error: immediate out of range at operand 3 -- `eor x6,x6,9'
aead.c: /tmp/ccudHJPy.s:1740: Error: immediate out of range at operand 3 -- `eor x6,x6,9'
aead.c: /tmp/ccudHJPy.s:2054: Error: immediate out of range at operand 3 -- `eor x7,x7,9'
aead.c: /tmp/ccudHJPy.s:2131: Error: immediate out of range at operand 3 -- `eor x6,x6,9'
aead.c: /tmp/ccudHJPy.s:2268: Error: immediate out of range at operand 3 -- `eor x1,x1,9'
aead.c: /tmp/ccudHJPy.s:2382: Error: immediate out of range at operand 3 -- `eor x1,x1,9'
aead.c: /tmp/ccudHJPy.s:2811: Error: immediate out of range at operand 3 -- `eor x0,x0,9'
aead.c: /tmp/ccudHJPy.s:2888: Error: immediate out of range at operand 3 -- `eor x0,x0,9'
aead.c: /tmp/ccudHJPy.s:3025: Error: immediate out of range at operand 3 -- `eor x5,x5,9'
aead.c: /tmp/ccudHJPy.s:3139: Error: immediate out of range at operand 3 -- `eor x5,x5,9'
aead.c: /tmp/ccudHJPy.s:3539: Error: immediate out of range at operand 3 -- `eor x13,x13,9'
aead.c: /tmp/ccudHJPy.s:3632: Error: immediate out of range at operand 3 -- `eor x6,x6,9'
aead.c: /tmp/ccudHJPy.s:3693: Error: immediate out of range at operand 3 -- `eor x13,x13,9'
aead.c: /tmp/ccudHJPy.s:3709: Error: immediate out of range at operand 3 -- `eor x7,x7,9'
aead.c: ...

Number of similar (compiler,implementation) pairs: 1, namely:
CompilerImplementations
gcc -march=native -mtune=native -O3 -fomit-frame-pointer -fwrapv -fPIC -fPIE bi32_armv7m

Compiler output

Implementation: bi32_armv7m
Security model: constbranchindex
Compiler: gcc -march=native -mtune=native -O -fomit-frame-pointer -fwrapv -fPIC -fPIE
aead.c: /tmp/ccJQIrdM.s: Assembler messages:
aead.c: /tmp/ccJQIrdM.s:376: Error: immediate out of range at operand 3 -- `eor x19,x19,9'
aead.c: /tmp/ccJQIrdM.s:469: Error: immediate out of range at operand 3 -- `eor x12,x12,9'
aead.c: /tmp/ccJQIrdM.s:530: Error: immediate out of range at operand 3 -- `eor x19,x19,9'
aead.c: /tmp/ccJQIrdM.s:546: Error: immediate out of range at operand 3 -- `eor x12,x12,9'
aead.c: /tmp/ccJQIrdM.s:777: Error: immediate out of range at operand 3 -- `eor x12,x12,9'
aead.c: /tmp/ccJQIrdM.s:854: Error: immediate out of range at operand 3 -- `eor x12,x12,9'
aead.c: /tmp/ccJQIrdM.s:992: Error: immediate out of range at operand 3 -- `eor x19,x19,9'
aead.c: /tmp/ccJQIrdM.s:1125: Error: immediate out of range at operand 3 -- `eor x7,x7,9'
aead.c: /tmp/ccJQIrdM.s:1514: Error: immediate out of range at operand 3 -- `eor x10,x10,9'
aead.c: /tmp/ccJQIrdM.s:1591: Error: immediate out of range at operand 3 -- `eor x10,x10,9'
aead.c: /tmp/ccJQIrdM.s:1728: Error: immediate out of range at operand 3 -- `eor x9,x9,9'
aead.c: /tmp/ccJQIrdM.s:1842: Error: immediate out of range at operand 3 -- `eor x9,x9,9'
aead.c: /tmp/ccJQIrdM.s:2259: Error: immediate out of range at operand 3 -- `eor x10,x10,9'
aead.c: /tmp/ccJQIrdM.s:2336: Error: immediate out of range at operand 3 -- `eor x10,x10,9'
aead.c: /tmp/ccJQIrdM.s:2473: Error: immediate out of range at operand 3 -- `eor x5,x5,9'
aead.c: /tmp/ccJQIrdM.s:2587: Error: immediate out of range at operand 3 -- `eor x5,x5,9'
aead.c: /tmp/ccJQIrdM.s:3090: Error: immediate out of range at operand 3 -- `eor x10,x10,9'
aead.c: /tmp/ccJQIrdM.s:3167: Error: immediate out of range at operand 3 -- `eor x10,x10,9'
aead.c: /tmp/ccJQIrdM.s:3304: Error: immediate out of range at operand 3 -- `eor x7,x7,9'
aead.c: /tmp/ccJQIrdM.s:3418: Error: immediate out of range at operand 3 -- `eor x7,x7,9'
aead.c: /tmp/ccJQIrdM.s:3867: Error: immediate out of range at operand 3 -- `eor x14,x14,9'
aead.c: /tmp/ccJQIrdM.s:3960: Error: immediate out of range at operand 3 -- `eor x9,x9,9'
aead.c: /tmp/ccJQIrdM.s:4021: Error: immediate out of range at operand 3 -- `eor x14,x14,9'
aead.c: /tmp/ccJQIrdM.s:4037: Error: immediate out of range at operand 3 -- `eor x9,x9,9'
aead.c: ...

Number of similar (compiler,implementation) pairs: 1, namely:
CompilerImplementations
gcc -march=native -mtune=native -O -fomit-frame-pointer -fwrapv -fPIC -fPIE bi32_armv7m

Compiler output

Implementation: bi32_armv7m
Security model: constbranchindex
Compiler: gcc -march=native -mtune=native -Os -fomit-frame-pointer -fwrapv -fPIC -fPIE
aead.c: /tmp/ccxCmRAX.s: Assembler messages:
aead.c: /tmp/ccxCmRAX.s:295: Error: immediate out of range at operand 3 -- `eor x30,x30,9'
aead.c: /tmp/ccxCmRAX.s:388: Error: immediate out of range at operand 3 -- `eor x16,x16,9'
aead.c: /tmp/ccxCmRAX.s:449: Error: immediate out of range at operand 3 -- `eor x30,x30,9'
aead.c: /tmp/ccxCmRAX.s:465: Error: immediate out of range at operand 3 -- `eor x16,x16,9'
aead.c: /tmp/ccxCmRAX.s:696: Error: immediate out of range at operand 3 -- `eor x16,x16,9'
aead.c: /tmp/ccxCmRAX.s:773: Error: immediate out of range at operand 3 -- `eor x16,x16,9'
aead.c: /tmp/ccxCmRAX.s:911: Error: immediate out of range at operand 3 -- `eor x30,x30,9'
aead.c: /tmp/ccxCmRAX.s:1044: Error: immediate out of range at operand 3 -- `eor x7,x7,9'
aead.c: /tmp/ccxCmRAX.s:1431: Error: immediate out of range at operand 3 -- `eor x13,x13,9'
aead.c: /tmp/ccxCmRAX.s:1508: Error: immediate out of range at operand 3 -- `eor x13,x13,9'
aead.c: /tmp/ccxCmRAX.s:1645: Error: immediate out of range at operand 3 -- `eor x5,x5,9'
aead.c: /tmp/ccxCmRAX.s:1759: Error: immediate out of range at operand 3 -- `eor x5,x5,9'
aead.c: /tmp/ccxCmRAX.s:2161: Error: immediate out of range at operand 3 -- `eor x17,x17,9'
aead.c: /tmp/ccxCmRAX.s:2254: Error: immediate out of range at operand 3 -- `eor x12,x12,9'
aead.c: /tmp/ccxCmRAX.s:2315: Error: immediate out of range at operand 3 -- `eor x17,x17,9'
aead.c: /tmp/ccxCmRAX.s:2331: Error: immediate out of range at operand 3 -- `eor x12,x12,9'
aead.c: /tmp/ccxCmRAX.s:2562: Error: immediate out of range at operand 3 -- `eor x12,x12,9'
aead.c: /tmp/ccxCmRAX.s:2639: Error: immediate out of range at operand 3 -- `eor x12,x12,9'
aead.c: /tmp/ccxCmRAX.s:2777: Error: immediate out of range at operand 3 -- `eor x17,x17,9'
aead.c: /tmp/ccxCmRAX.s:2910: Error: immediate out of range at operand 3 -- `eor x4,x4,9'
aead.c: /tmp/ccxCmRAX.s:3336: Error: immediate out of range at operand 3 -- `eor x15,x15,9'
aead.c: /tmp/ccxCmRAX.s:3413: Error: immediate out of range at operand 3 -- `eor x15,x15,9'
aead.c: /tmp/ccxCmRAX.s:3550: Error: immediate out of range at operand 3 -- `eor x13,x13,9'
aead.c: /tmp/ccxCmRAX.s:3664: Error: immediate out of range at operand 3 -- `eor x13,x13,9'
aead.c: ...

Number of similar (compiler,implementation) pairs: 1, namely:
CompilerImplementations
gcc -march=native -mtune=native -Os -fomit-frame-pointer -fwrapv -fPIC -fPIE bi32_armv7m

Compiler output

Implementation: bi32_armv7m_small
Security model: constbranchindex
Compiler: gcc -march=native -mtune=native -O2 -fomit-frame-pointer -fwrapv -fPIC -fPIE
permutations.c: /tmp/ccj187hC.s: Assembler messages:
permutations.c: /tmp/ccj187hC.s:26: Error: operand mismatch -- `ldrb x14,[x1],#1'
permutations.c: /tmp/ccj187hC.s:26: Info: did you mean this?
permutations.c: /tmp/ccj187hC.s:26: Info: ldrb w14, [x1], #1
permutations.c: /tmp/ccj187hC.s:41: Error: operand mismatch -- `ldrb x14,[x1],#1'
permutations.c: /tmp/ccj187hC.s:41: Info: did you mean this?
permutations.c: /tmp/ccj187hC.s:41: Info: ldrb w14, [x1], #1

Number of similar (compiler,implementation) pairs: 1, namely:
CompilerImplementations
gcc -march=native -mtune=native -O2 -fomit-frame-pointer -fwrapv -fPIC -fPIE bi32_armv7m_small

Compiler output

Implementation: bi32_armv7m_small
Security model: constbranchindex
Compiler: gcc -march=native -mtune=native -O3 -fomit-frame-pointer -fwrapv -fPIC -fPIE
permutations.c: /tmp/cc8Wxang.s: Assembler messages:
permutations.c: /tmp/cc8Wxang.s:26: Error: operand mismatch -- `ldrb x14,[x1],#1'
permutations.c: /tmp/cc8Wxang.s:26: Info: did you mean this?
permutations.c: /tmp/cc8Wxang.s:26: Info: ldrb w14, [x1], #1
permutations.c: /tmp/cc8Wxang.s:41: Error: operand mismatch -- `ldrb x14,[x1],#1'
permutations.c: /tmp/cc8Wxang.s:41: Info: did you mean this?
permutations.c: /tmp/cc8Wxang.s:41: Info: ldrb w14, [x1], #1

Number of similar (compiler,implementation) pairs: 1, namely:
CompilerImplementations
gcc -march=native -mtune=native -O3 -fomit-frame-pointer -fwrapv -fPIC -fPIE bi32_armv7m_small

Compiler output

Implementation: bi32_armv7m_small
Security model: constbranchindex
Compiler: gcc -march=native -mtune=native -O -fomit-frame-pointer -fwrapv -fPIC -fPIE
permutations.c: /tmp/ccGu9NzT.s: Assembler messages:
permutations.c: /tmp/ccGu9NzT.s:30: Error: operand mismatch -- `ldrb x14,[x1],#1'
permutations.c: /tmp/ccGu9NzT.s:30: Info: did you mean this?
permutations.c: /tmp/ccGu9NzT.s:30: Info: ldrb w14, [x1], #1
permutations.c: /tmp/ccGu9NzT.s:45: Error: operand mismatch -- `ldrb x14,[x1],#1'
permutations.c: /tmp/ccGu9NzT.s:45: Info: did you mean this?
permutations.c: /tmp/ccGu9NzT.s:45: Info: ldrb w14, [x1], #1

Number of similar (compiler,implementation) pairs: 1, namely:
CompilerImplementations
gcc -march=native -mtune=native -O -fomit-frame-pointer -fwrapv -fPIC -fPIE bi32_armv7m_small

Compiler output

Implementation: bi32_armv7m_small
Security model: constbranchindex
Compiler: gcc -march=native -mtune=native -Os -fomit-frame-pointer -fwrapv -fPIC -fPIE
permutations.c: /tmp/ccoy8dC2.s: Assembler messages:
permutations.c: /tmp/ccoy8dC2.s:25: Error: operand mismatch -- `ldrb x14,[x1],#1'
permutations.c: /tmp/ccoy8dC2.s:25: Info: did you mean this?
permutations.c: /tmp/ccoy8dC2.s:25: Info: ldrb w14, [x1], #1
permutations.c: /tmp/ccoy8dC2.s:40: Error: operand mismatch -- `ldrb x14,[x1],#1'
permutations.c: /tmp/ccoy8dC2.s:40: Info: did you mean this?
permutations.c: /tmp/ccoy8dC2.s:40: Info: ldrb w14, [x1], #1

Number of similar (compiler,implementation) pairs: 1, namely:
CompilerImplementations
gcc -march=native -mtune=native -Os -fomit-frame-pointer -fwrapv -fPIC -fPIE bi32_armv7m_small

Compiler output

Implementation: T:esp32
Security model: timingleaks
Compiler: clang -mcpu=native -O3 -fomit-frame-pointer -fwrapv -Qunused-arguments -fPIC -fPIE
try.c: /usr/bin/ld: /tmp/try-small-29a9de.o: in function `doit':
try.c: try-small.c:(.text+0x...): undefined reference to `crypto_aead_ascon128av12_esp32_timingleaks_encrypt'
try.c: /usr/bin/ld: try-small.c:(.text+0x...): undefined reference to `crypto_aead_ascon128av12_esp32_timingleaks_decrypt'
try.c: /usr/bin/ld: /tmp/try-small-29a9de.o: in function `test':
try.c: try-small.c:(.text+0x...): undefined reference to `crypto_aead_ascon128av12_esp32_timingleaks_encrypt'
try.c: /usr/bin/ld: try-small.c:(.text+0x...): undefined reference to `crypto_aead_ascon128av12_esp32_timingleaks_encrypt'
try.c: /usr/bin/ld: try-small.c:(.text+0x...): undefined reference to `crypto_aead_ascon128av12_esp32_timingleaks_decrypt'
try.c: /usr/bin/ld: try-small.c:(.text+0x...): undefined reference to `crypto_aead_ascon128av12_esp32_timingleaks_decrypt'
try.c: /usr/bin/ld: try-small.c:(.text+0x...): undefined reference to `crypto_aead_ascon128av12_esp32_timingleaks_decrypt'
try.c: /usr/bin/ld: try-small.c:(.text+0x...): undefined reference to `crypto_aead_ascon128av12_esp32_timingleaks_decrypt'
try.c: /usr/bin/ld: try-small.c:(.text+0x...): undefined reference to `crypto_aead_ascon128av12_esp32_timingleaks_decrypt'
try.c: clang: error: linker command failed with exit code 1 (use -v to see invocation)

Number of similar (compiler,implementation) pairs: 1, namely:
CompilerImplementations
clang -mcpu=native -O3 -fomit-frame-pointer -fwrapv -Qunused-arguments -fPIC -fPIE T:esp32

Compiler output

Implementation: T:esp32
Security model: timingleaks
Compiler: gcc -march=native -mtune=native -O2 -fomit-frame-pointer -fwrapv -fPIC -fPIE
try.c: /usr/bin/ld: /tmp/cczY3htM.o: in function `doit':
try.c: try-small.c:(.text+0x...): undefined reference to `crypto_aead_ascon128av12_esp32_timingleaks_encrypt'
try.c: /usr/bin/ld: try-small.c:(.text+0x...): undefined reference to `crypto_aead_ascon128av12_esp32_timingleaks_decrypt'
try.c: /usr/bin/ld: /tmp/cczY3htM.o: in function `test':
try.c: try-small.c:(.text+0x...): undefined reference to `crypto_aead_ascon128av12_esp32_timingleaks_encrypt'
try.c: /usr/bin/ld: try-small.c:(.text+0x...): undefined reference to `crypto_aead_ascon128av12_esp32_timingleaks_decrypt'
try.c: /usr/bin/ld: try-small.c:(.text+0x...): undefined reference to `crypto_aead_ascon128av12_esp32_timingleaks_decrypt'
try.c: /usr/bin/ld: try-small.c:(.text+0x...): undefined reference to `crypto_aead_ascon128av12_esp32_timingleaks_decrypt'
try.c: /usr/bin/ld: try-small.c:(.text+0x...): undefined reference to `crypto_aead_ascon128av12_esp32_timingleaks_decrypt'
try.c: /usr/bin/ld: try-small.c:(.text+0x...): undefined reference to `crypto_aead_ascon128av12_esp32_timingleaks_decrypt'
try.c: /usr/bin/ld: try-small.c:(.text+0x...): undefined reference to `crypto_aead_ascon128av12_esp32_timingleaks_encrypt'
try.c: collect2: error: ld returned 1 exit status

Number of similar (compiler,implementation) pairs: 1, namely:
CompilerImplementations
gcc -march=native -mtune=native -O2 -fomit-frame-pointer -fwrapv -fPIC -fPIE T:esp32

Compiler output

Implementation: T:esp32
Security model: timingleaks
Compiler: gcc -march=native -mtune=native -O3 -fomit-frame-pointer -fwrapv -fPIC -fPIE
try.c: /usr/bin/ld: /tmp/cc17Lmw2.o: in function `doit':
try.c: try-small.c:(.text+0x...): undefined reference to `crypto_aead_ascon128av12_esp32_timingleaks_encrypt'
try.c: /usr/bin/ld: try-small.c:(.text+0x...): undefined reference to `crypto_aead_ascon128av12_esp32_timingleaks_decrypt'
try.c: /usr/bin/ld: /tmp/cc17Lmw2.o: in function `test':
try.c: try-small.c:(.text+0x...): undefined reference to `crypto_aead_ascon128av12_esp32_timingleaks_encrypt'
try.c: /usr/bin/ld: try-small.c:(.text+0x...): undefined reference to `crypto_aead_ascon128av12_esp32_timingleaks_decrypt'
try.c: /usr/bin/ld: try-small.c:(.text+0x...): undefined reference to `crypto_aead_ascon128av12_esp32_timingleaks_decrypt'
try.c: /usr/bin/ld: try-small.c:(.text+0x...): undefined reference to `crypto_aead_ascon128av12_esp32_timingleaks_decrypt'
try.c: /usr/bin/ld: try-small.c:(.text+0x...): undefined reference to `crypto_aead_ascon128av12_esp32_timingleaks_decrypt'
try.c: /usr/bin/ld: try-small.c:(.text+0x...): undefined reference to `crypto_aead_ascon128av12_esp32_timingleaks_decrypt'
try.c: /usr/bin/ld: try-small.c:(.text+0x...): undefined reference to `crypto_aead_ascon128av12_esp32_timingleaks_encrypt'
try.c: collect2: error: ld returned 1 exit status

Number of similar (compiler,implementation) pairs: 1, namely:
CompilerImplementations
gcc -march=native -mtune=native -O3 -fomit-frame-pointer -fwrapv -fPIC -fPIE T:esp32

Compiler output

Implementation: T:esp32
Security model: timingleaks
Compiler: gcc -march=native -mtune=native -O -fomit-frame-pointer -fwrapv -fPIC -fPIE
try.c: /usr/bin/ld: /tmp/ccECn6F5.o: in function `doit':
try.c: try-small.c:(.text+0x...): undefined reference to `crypto_aead_ascon128av12_esp32_timingleaks_encrypt'
try.c: /usr/bin/ld: try-small.c:(.text+0x...): undefined reference to `crypto_aead_ascon128av12_esp32_timingleaks_decrypt'
try.c: /usr/bin/ld: /tmp/ccECn6F5.o: in function `test':
try.c: try-small.c:(.text+0x...): undefined reference to `crypto_aead_ascon128av12_esp32_timingleaks_encrypt'
try.c: /usr/bin/ld: try-small.c:(.text+0x...): undefined reference to `crypto_aead_ascon128av12_esp32_timingleaks_encrypt'
try.c: /usr/bin/ld: try-small.c:(.text+0x...): undefined reference to `crypto_aead_ascon128av12_esp32_timingleaks_decrypt'
try.c: /usr/bin/ld: try-small.c:(.text+0x...): undefined reference to `crypto_aead_ascon128av12_esp32_timingleaks_decrypt'
try.c: /usr/bin/ld: try-small.c:(.text+0x...): undefined reference to `crypto_aead_ascon128av12_esp32_timingleaks_decrypt'
try.c: /usr/bin/ld: try-small.c:(.text+0x...): undefined reference to `crypto_aead_ascon128av12_esp32_timingleaks_decrypt'
try.c: /usr/bin/ld: try-small.c:(.text+0x...): undefined reference to `crypto_aead_ascon128av12_esp32_timingleaks_decrypt'
try.c: collect2: error: ld returned 1 exit status

Number of similar (compiler,implementation) pairs: 1, namely:
CompilerImplementations
gcc -march=native -mtune=native -O -fomit-frame-pointer -fwrapv -fPIC -fPIE T:esp32

Compiler output

Implementation: T:esp32
Security model: timingleaks
Compiler: gcc -march=native -mtune=native -Os -fomit-frame-pointer -fwrapv -fPIC -fPIE
try.c: /usr/bin/ld: /tmp/ccnbzOS1.o: in function `doit':
try.c: try-small.c:(.text+0x...): undefined reference to `crypto_aead_ascon128av12_esp32_timingleaks_encrypt'
try.c: /usr/bin/ld: try-small.c:(.text+0x...): undefined reference to `crypto_aead_ascon128av12_esp32_timingleaks_decrypt'
try.c: /usr/bin/ld: /tmp/ccnbzOS1.o: in function `test':
try.c: try-small.c:(.text+0x...): undefined reference to `crypto_aead_ascon128av12_esp32_timingleaks_encrypt'
try.c: /usr/bin/ld: try-small.c:(.text+0x...): undefined reference to `crypto_aead_ascon128av12_esp32_timingleaks_encrypt'
try.c: /usr/bin/ld: try-small.c:(.text+0x...): undefined reference to `crypto_aead_ascon128av12_esp32_timingleaks_decrypt'
try.c: /usr/bin/ld: try-small.c:(.text+0x...): undefined reference to `crypto_aead_ascon128av12_esp32_timingleaks_decrypt'
try.c: /usr/bin/ld: try-small.c:(.text+0x...): undefined reference to `crypto_aead_ascon128av12_esp32_timingleaks_decrypt'
try.c: /usr/bin/ld: try-small.c:(.text+0x...): undefined reference to `crypto_aead_ascon128av12_esp32_timingleaks_decrypt'
try.c: /usr/bin/ld: try-small.c:(.text+0x...): undefined reference to `crypto_aead_ascon128av12_esp32_timingleaks_decrypt'
try.c: collect2: error: ld returned 1 exit status

Number of similar (compiler,implementation) pairs: 1, namely:
CompilerImplementations
gcc -march=native -mtune=native -Os -fomit-frame-pointer -fwrapv -fPIC -fPIE T:esp32

Compiler output

Implementation: neon
Security model: constbranchindex
Compiler: clang -mcpu=native -O3 -fomit-frame-pointer -fwrapv -Qunused-arguments -fPIC -fPIE
aead.c: aead.c:164:5: warning: value size does not match register size specified by the constraint and modifier [-Wasm-operand-widths]
aead.c: AD(8, 16, "q0", "q8");
aead.c: ^
aead.c: aead.c:32:28: note: expanded from macro 'AD'
aead.c: : [adlen_hi] "+r" (adlen_hi), [adlen_lo] "+r" (adlen_lo), \
aead.c: ^
aead.c: aead.c:164:5: note: use constraint modifier "w"
aead.c: aead.c:14:14: note: expanded from macro 'AD'
aead.c: "cmp %[adlen_hi], #0 \n\t" \
aead.c: ^
aead.c: aead.c:164:5: warning: value size does not match register size specified by the constraint and modifier [-Wasm-operand-widths]
aead.c: AD(8, 16, "q0", "q8");
aead.c: ^
aead.c: aead.c:32:56: note: expanded from macro 'AD'
aead.c: : [adlen_hi] "+r" (adlen_hi), [adlen_lo] "+r" (adlen_lo), \
aead.c: ^
aead.c: aead.c:164:5: note: use constraint modifier "w"
aead.c: aead.c:15:16: note: expanded from macro 'AD'
aead.c: "cmpeq %[adlen_lo], #(%c[R]-1) \n\t" \
aead.c: ^
aead.c: aead.c:164:5: warning: value size does not match register size specified by the constraint and modifier [-Wasm-operand-widths]
aead.c: AD(8, 16, "q0", "q8");
aead.c: ^
aead.c: aead.c:32:56: note: expanded from macro 'AD'
aead.c: : [adlen_hi] "+r" (adlen_hi), [adlen_lo] "+r" (adlen_lo), \
aead.c: ...

Number of similar (compiler,implementation) pairs: 1, namely:
CompilerImplementations
clang -mcpu=native -O3 -fomit-frame-pointer -fwrapv -Qunused-arguments -fPIC -fPIE neon

Compiler output

Implementation: neon
Security model: constbranchindex
Compiler: gcc -march=native -mtune=native -O2 -fomit-frame-pointer -fwrapv -fPIC -fPIE
aead.c: /tmp/cc8oPW3R.s: Assembler messages:
aead.c: /tmp/cc8oPW3R.s:52: Error: unknown pseudo-op: `.arm'
aead.c: /tmp/cc8oPW3R.s:53: Error: unknown pseudo-op: `.fpu'
aead.c: /tmp/cc8oPW3R.s:54: Error: unknown mnemonic `vldm' -- `vldm x0,{d0-d4}'
aead.c: /tmp/cc8oPW3R.s:55: Error: unknown mnemonic `vmvn' -- `vmvn d2,d2'
aead.c: /tmp/cc8oPW3R.s:56: Error: unknown mnemonic `vldr' -- `vldr d31,[x3,#0]'
aead.c: /tmp/cc8oPW3R.s:57: Error: unknown mnemonic `veor' -- `veor d0,d0,d4'
aead.c: /tmp/cc8oPW3R.s:58: Error: unknown mnemonic `veor' -- `veor d4,d4,d3'
aead.c: /tmp/cc8oPW3R.s:59: Error: unknown mnemonic `veor' -- `veor d2,d2,d31'
aead.c: /tmp/cc8oPW3R.s:60: Error: unknown mnemonic `vbic' -- `vbic d13,d0,d4'
aead.c: /tmp/cc8oPW3R.s:61: Error: unknown mnemonic `vbic' -- `vbic d12,d4,d3'
aead.c: /tmp/cc8oPW3R.s:62: Error: unknown mnemonic `veor' -- `veor d2,d2,d1'
aead.c: /tmp/cc8oPW3R.s:63: Error: unknown mnemonic `vbic' -- `vbic d14,d1,d0'
aead.c: /tmp/cc8oPW3R.s:64: Error: unknown mnemonic `vbic' -- `vbic d11,d3,d2'
aead.c: /tmp/cc8oPW3R.s:65: Error: unknown mnemonic `vbic' -- `vbic d10,d2,d1'
aead.c: /tmp/cc8oPW3R.s:66: Error: unknown mnemonic `veor' -- `veor q0,q0,q5'
aead.c: /tmp/cc8oPW3R.s:67: Error: unknown mnemonic `veor' -- `veor q1,q1,q6'
aead.c: /tmp/cc8oPW3R.s:68: Error: unknown mnemonic `veor' -- `veor d4,d4,d14'
aead.c: /tmp/cc8oPW3R.s:69: Error: unknown mnemonic `veor' -- `veor d1,d1,d0'
aead.c: /tmp/cc8oPW3R.s:70: Error: unknown mnemonic `veor' -- `veor d3,d3,d2'
aead.c: /tmp/cc8oPW3R.s:71: Error: unknown mnemonic `veor' -- `veor d0,d0,d4'
aead.c: /tmp/cc8oPW3R.s:72: Error: unknown mnemonic `vsri.64' -- `vsri.64 d14,d4,#7'
aead.c: /tmp/cc8oPW3R.s:73: Error: unknown mnemonic `vsri.64' -- `vsri.64 d24,d4,#41'
aead.c: /tmp/cc8oPW3R.s:74: Error: unknown mnemonic `vsri.64' -- `vsri.64 d11,d1,#39'
aead.c: /tmp/cc8oPW3R.s:75: Error: unknown mnemonic `vsri.64' -- `vsri.64 d21,d1,#61'
aead.c: ...

Number of similar (compiler,implementation) pairs: 1, namely:
CompilerImplementations
gcc -march=native -mtune=native -O2 -fomit-frame-pointer -fwrapv -fPIC -fPIE neon

Compiler output

Implementation: neon
Security model: constbranchindex
Compiler: gcc -march=native -mtune=native -O3 -fomit-frame-pointer -fwrapv -fPIC -fPIE
aead.c: /tmp/ccMdR5Gg.s: Assembler messages:
aead.c: /tmp/ccMdR5Gg.s:52: Error: unknown pseudo-op: `.arm'
aead.c: /tmp/ccMdR5Gg.s:53: Error: unknown pseudo-op: `.fpu'
aead.c: /tmp/ccMdR5Gg.s:54: Error: unknown mnemonic `vldm' -- `vldm x0,{d0-d4}'
aead.c: /tmp/ccMdR5Gg.s:55: Error: unknown mnemonic `vmvn' -- `vmvn d2,d2'
aead.c: /tmp/ccMdR5Gg.s:56: Error: unknown mnemonic `vldr' -- `vldr d31,[x3,#0]'
aead.c: /tmp/ccMdR5Gg.s:57: Error: unknown mnemonic `veor' -- `veor d0,d0,d4'
aead.c: /tmp/ccMdR5Gg.s:58: Error: unknown mnemonic `veor' -- `veor d4,d4,d3'
aead.c: /tmp/ccMdR5Gg.s:59: Error: unknown mnemonic `veor' -- `veor d2,d2,d31'
aead.c: /tmp/ccMdR5Gg.s:60: Error: unknown mnemonic `vbic' -- `vbic d13,d0,d4'
aead.c: /tmp/ccMdR5Gg.s:61: Error: unknown mnemonic `vbic' -- `vbic d12,d4,d3'
aead.c: /tmp/ccMdR5Gg.s:62: Error: unknown mnemonic `veor' -- `veor d2,d2,d1'
aead.c: /tmp/ccMdR5Gg.s:63: Error: unknown mnemonic `vbic' -- `vbic d14,d1,d0'
aead.c: /tmp/ccMdR5Gg.s:64: Error: unknown mnemonic `vbic' -- `vbic d11,d3,d2'
aead.c: /tmp/ccMdR5Gg.s:65: Error: unknown mnemonic `vbic' -- `vbic d10,d2,d1'
aead.c: /tmp/ccMdR5Gg.s:66: Error: unknown mnemonic `veor' -- `veor q0,q0,q5'
aead.c: /tmp/ccMdR5Gg.s:67: Error: unknown mnemonic `veor' -- `veor q1,q1,q6'
aead.c: /tmp/ccMdR5Gg.s:68: Error: unknown mnemonic `veor' -- `veor d4,d4,d14'
aead.c: /tmp/ccMdR5Gg.s:69: Error: unknown mnemonic `veor' -- `veor d1,d1,d0'
aead.c: /tmp/ccMdR5Gg.s:70: Error: unknown mnemonic `veor' -- `veor d3,d3,d2'
aead.c: /tmp/ccMdR5Gg.s:71: Error: unknown mnemonic `veor' -- `veor d0,d0,d4'
aead.c: /tmp/ccMdR5Gg.s:72: Error: unknown mnemonic `vsri.64' -- `vsri.64 d14,d4,#7'
aead.c: /tmp/ccMdR5Gg.s:73: Error: unknown mnemonic `vsri.64' -- `vsri.64 d24,d4,#41'
aead.c: /tmp/ccMdR5Gg.s:74: Error: unknown mnemonic `vsri.64' -- `vsri.64 d11,d1,#39'
aead.c: /tmp/ccMdR5Gg.s:75: Error: unknown mnemonic `vsri.64' -- `vsri.64 d21,d1,#61'
aead.c: ...

Number of similar (compiler,implementation) pairs: 1, namely:
CompilerImplementations
gcc -march=native -mtune=native -O3 -fomit-frame-pointer -fwrapv -fPIC -fPIE neon

Compiler output

Implementation: neon
Security model: constbranchindex
Compiler: gcc -march=native -mtune=native -O -fomit-frame-pointer -fwrapv -fPIC -fPIE
aead.c: /tmp/ccMOda87.s: Assembler messages:
aead.c: /tmp/ccMOda87.s:128: Error: unknown pseudo-op: `.arm'
aead.c: /tmp/ccMOda87.s:129: Error: unknown pseudo-op: `.fpu'
aead.c: /tmp/ccMOda87.s:130: Error: unknown mnemonic `vldm' -- `vldm x0,{d0-d4}'
aead.c: /tmp/ccMOda87.s:131: Error: unknown mnemonic `vmvn' -- `vmvn d2,d2'
aead.c: /tmp/ccMOda87.s:132: Error: unknown mnemonic `vldr' -- `vldr d31,[x2,#0]'
aead.c: /tmp/ccMOda87.s:133: Error: unknown mnemonic `veor' -- `veor d0,d0,d4'
aead.c: /tmp/ccMOda87.s:134: Error: unknown mnemonic `veor' -- `veor d4,d4,d3'
aead.c: /tmp/ccMOda87.s:135: Error: unknown mnemonic `veor' -- `veor d2,d2,d31'
aead.c: /tmp/ccMOda87.s:136: Error: unknown mnemonic `vbic' -- `vbic d13,d0,d4'
aead.c: /tmp/ccMOda87.s:137: Error: unknown mnemonic `vbic' -- `vbic d12,d4,d3'
aead.c: /tmp/ccMOda87.s:138: Error: unknown mnemonic `veor' -- `veor d2,d2,d1'
aead.c: /tmp/ccMOda87.s:139: Error: unknown mnemonic `vbic' -- `vbic d14,d1,d0'
aead.c: /tmp/ccMOda87.s:140: Error: unknown mnemonic `vbic' -- `vbic d11,d3,d2'
aead.c: /tmp/ccMOda87.s:141: Error: unknown mnemonic `vbic' -- `vbic d10,d2,d1'
aead.c: /tmp/ccMOda87.s:142: Error: unknown mnemonic `veor' -- `veor q0,q0,q5'
aead.c: /tmp/ccMOda87.s:143: Error: unknown mnemonic `veor' -- `veor q1,q1,q6'
aead.c: /tmp/ccMOda87.s:144: Error: unknown mnemonic `veor' -- `veor d4,d4,d14'
aead.c: /tmp/ccMOda87.s:145: Error: unknown mnemonic `veor' -- `veor d1,d1,d0'
aead.c: /tmp/ccMOda87.s:146: Error: unknown mnemonic `veor' -- `veor d3,d3,d2'
aead.c: /tmp/ccMOda87.s:147: Error: unknown mnemonic `veor' -- `veor d0,d0,d4'
aead.c: /tmp/ccMOda87.s:148: Error: unknown mnemonic `vsri.64' -- `vsri.64 d14,d4,#7'
aead.c: /tmp/ccMOda87.s:149: Error: unknown mnemonic `vsri.64' -- `vsri.64 d24,d4,#41'
aead.c: /tmp/ccMOda87.s:150: Error: unknown mnemonic `vsri.64' -- `vsri.64 d11,d1,#39'
aead.c: /tmp/ccMOda87.s:151: Error: unknown mnemonic `vsri.64' -- `vsri.64 d21,d1,#61'
aead.c: ...

Number of similar (compiler,implementation) pairs: 1, namely:
CompilerImplementations
gcc -march=native -mtune=native -O -fomit-frame-pointer -fwrapv -fPIC -fPIE neon

Compiler output

Implementation: neon
Security model: constbranchindex
Compiler: gcc -march=native -mtune=native -Os -fomit-frame-pointer -fwrapv -fPIC -fPIE
aead.c: /tmp/ccwLqgVM.s: Assembler messages:
aead.c: /tmp/ccwLqgVM.s:52: Error: unknown pseudo-op: `.arm'
aead.c: /tmp/ccwLqgVM.s:53: Error: unknown pseudo-op: `.fpu'
aead.c: /tmp/ccwLqgVM.s:54: Error: unknown mnemonic `vldm' -- `vldm x0,{d0-d4}'
aead.c: /tmp/ccwLqgVM.s:55: Error: unknown mnemonic `vmvn' -- `vmvn d2,d2'
aead.c: /tmp/ccwLqgVM.s:56: Error: unknown mnemonic `vldr' -- `vldr d31,[x2,#0]'
aead.c: /tmp/ccwLqgVM.s:57: Error: unknown mnemonic `veor' -- `veor d0,d0,d4'
aead.c: /tmp/ccwLqgVM.s:58: Error: unknown mnemonic `veor' -- `veor d4,d4,d3'
aead.c: /tmp/ccwLqgVM.s:59: Error: unknown mnemonic `veor' -- `veor d2,d2,d31'
aead.c: /tmp/ccwLqgVM.s:60: Error: unknown mnemonic `vbic' -- `vbic d13,d0,d4'
aead.c: /tmp/ccwLqgVM.s:61: Error: unknown mnemonic `vbic' -- `vbic d12,d4,d3'
aead.c: /tmp/ccwLqgVM.s:62: Error: unknown mnemonic `veor' -- `veor d2,d2,d1'
aead.c: /tmp/ccwLqgVM.s:63: Error: unknown mnemonic `vbic' -- `vbic d14,d1,d0'
aead.c: /tmp/ccwLqgVM.s:64: Error: unknown mnemonic `vbic' -- `vbic d11,d3,d2'
aead.c: /tmp/ccwLqgVM.s:65: Error: unknown mnemonic `vbic' -- `vbic d10,d2,d1'
aead.c: /tmp/ccwLqgVM.s:66: Error: unknown mnemonic `veor' -- `veor q0,q0,q5'
aead.c: /tmp/ccwLqgVM.s:67: Error: unknown mnemonic `veor' -- `veor q1,q1,q6'
aead.c: /tmp/ccwLqgVM.s:68: Error: unknown mnemonic `veor' -- `veor d4,d4,d14'
aead.c: /tmp/ccwLqgVM.s:69: Error: unknown mnemonic `veor' -- `veor d1,d1,d0'
aead.c: /tmp/ccwLqgVM.s:70: Error: unknown mnemonic `veor' -- `veor d3,d3,d2'
aead.c: /tmp/ccwLqgVM.s:71: Error: unknown mnemonic `veor' -- `veor d0,d0,d4'
aead.c: /tmp/ccwLqgVM.s:72: Error: unknown mnemonic `vsri.64' -- `vsri.64 d14,d4,#7'
aead.c: /tmp/ccwLqgVM.s:73: Error: unknown mnemonic `vsri.64' -- `vsri.64 d24,d4,#41'
aead.c: /tmp/ccwLqgVM.s:74: Error: unknown mnemonic `vsri.64' -- `vsri.64 d11,d1,#39'
aead.c: /tmp/ccwLqgVM.s:75: Error: unknown mnemonic `vsri.64' -- `vsri.64 d21,d1,#61'
aead.c: ...

Number of similar (compiler,implementation) pairs: 1, namely:
CompilerImplementations
gcc -march=native -mtune=native -Os -fomit-frame-pointer -fwrapv -fPIC -fPIE neon