Implementation notes: aarch64, pi4b, crypto_aead/aes128cpfbv1

Computer: pi4b
Microarchitecture: aarch64; Cortex-A72 (410fd083)
Architecture: aarch64
CPU ID: 410fd083
SUPERCOP version: 20240425
Operation: crypto_aead
Primitive: aes128cpfbv1
TimeObject sizeTest sizeImplementationCompilerBenchmark dateSUPERCOP version
11645315532 0 034314 864 856T:gladmanclang_-mcpu=native_-O3_-fomit-frame-pointer_-fwrapv_-Qunused-arguments_-fPIC_-fPIE2024042620240425
13461016924 0 035658 840 856T:aesrefclang_-mcpu=native_-O3_-fomit-frame-pointer_-fwrapv_-Qunused-arguments_-fPIC_-fPIE2024042620240425
14296916472 0 032076 824 840T:gladmangcc_-march=native_-mtune=native_-Os_-fomit-frame-pointer_-fwrapv_-fPIC_-fPIE2024042620240425
15073616584 0 033444 840 848T:gladmangcc_-march=native_-mtune=native_-O2_-fomit-frame-pointer_-fwrapv_-fPIC_-fPIE2024042620240425
15894716352 0 033139 808 848T:aesrefgcc_-march=native_-mtune=native_-O_-fomit-frame-pointer_-fwrapv_-fPIC_-fPIE2024042620240425
16153817484 0 034299 832 848T:gladmangcc_-march=native_-mtune=native_-O_-fomit-frame-pointer_-fwrapv_-fPIC_-fPIE2024042620240425
16445619020 0 036796 816 864T:aesrefgcc_-march=native_-mtune=native_-O3_-fomit-frame-pointer_-fwrapv_-fPIC_-fPIE2024042620240425
16509515900 0 031468 800 840T:aesrefgcc_-march=native_-mtune=native_-Os_-fomit-frame-pointer_-fwrapv_-fPIC_-fPIE2024042620240425
17444916120 0 032908 816 848T:aesrefgcc_-march=native_-mtune=native_-O2_-fomit-frame-pointer_-fwrapv_-fPIC_-fPIE2024042620240425
18036417444 0 035260 840 864T:gladmangcc_-march=native_-mtune=native_-O3_-fomit-frame-pointer_-fwrapv_-fPIC_-fPIE2024042620240425
2070933456 0 027308 816 864T:refgcc_-march=native_-mtune=native_-O3_-fomit-frame-pointer_-fwrapv_-fPIC_-fPIE2024042620240425
2143952424 0 027242 840 856T:refclang_-mcpu=native_-O3_-fomit-frame-pointer_-fwrapv_-Qunused-arguments_-fPIC_-fPIE2024042620240425
2552802360 0 025252 816 848T:refgcc_-march=native_-mtune=native_-O2_-fomit-frame-pointer_-fwrapv_-fPIC_-fPIE2024042620240425
2556652200 0 025115 808 848T:refgcc_-march=native_-mtune=native_-O_-fomit-frame-pointer_-fwrapv_-fPIC_-fPIE2024042620240425
2612371912 0 023604 800 840T:refgcc_-march=native_-mtune=native_-Os_-fomit-frame-pointer_-fwrapv_-fPIC_-fPIE2024042620240425

Compiler output

Implementation: T:aesni
Security model: timingleaks
Compiler: clang -mcpu=native -O3 -fomit-frame-pointer -fwrapv -Qunused-arguments -fPIC -fPIE
cpfbkey.c: In file included from cpfbkey.c:15:
cpfbkey.c: /usr/lib/llvm-14/lib/clang/14.0.0/include/wmmintrin.h:14:2: error: "This header is only meant to be used on x86 and x64 architecture"
cpfbkey.c: #error "This header is only meant to be used on x86 and x64 architecture"
cpfbkey.c: ^
cpfbkey.c: In file included from cpfbkey.c:15:
cpfbkey.c: In file included from /usr/lib/llvm-14/lib/clang/14.0.0/include/wmmintrin.h:17:
cpfbkey.c: /usr/lib/llvm-14/lib/clang/14.0.0/include/emmintrin.h:14:2: error: "This header is only meant to be used on x86 and x64 architecture"
cpfbkey.c: #error "This header is only meant to be used on x86 and x64 architecture"
cpfbkey.c: ^
cpfbkey.c: In file included from cpfbkey.c:15:
cpfbkey.c: In file included from /usr/lib/llvm-14/lib/clang/14.0.0/include/wmmintrin.h:17:
cpfbkey.c: In file included from /usr/lib/llvm-14/lib/clang/14.0.0/include/emmintrin.h:17:
cpfbkey.c: /usr/lib/llvm-14/lib/clang/14.0.0/include/xmmintrin.h:14:2: error: "This header is only meant to be used on x86 and x64 architecture"
cpfbkey.c: #error "This header is only meant to be used on x86 and x64 architecture"
cpfbkey.c: ^
cpfbkey.c: In file included from cpfbkey.c:15:
cpfbkey.c: In file included from /usr/lib/llvm-14/lib/clang/14.0.0/include/wmmintrin.h:17:
cpfbkey.c: In file included from /usr/lib/llvm-14/lib/clang/14.0.0/include/emmintrin.h:17:
cpfbkey.c: In file included from /usr/lib/llvm-14/lib/clang/14.0.0/include/xmmintrin.h:17:
cpfbkey.c: /usr/lib/llvm-14/lib/clang/14.0.0/include/mmintrin.h:14:2: error: "This header is only meant to be used on x86 and x64 architecture"
cpfbkey.c: #error "This header is only meant to be used on x86 and x64 architecture"
cpfbkey.c: ^
cpfbkey.c: /usr/lib/llvm-14/lib/clang/14.0.0/include/mmintrin.h:54:12: error: invalid conversion between vector type '__m64' (vector of 1 'long long' value) and integer type 'int' of different size
cpfbkey.c: return (__m64)__builtin_ia32_vec_init_v2si(__i, 0);
cpfbkey.c: ^~~~~~~~~~~~~~~~~~~~~~~~~~~~~~~~~~~~~~~~~~~
cpfbkey.c: ...

Number of similar (compiler,implementation) pairs: 1, namely:
CompilerImplementations
clang -mcpu=native -O3 -fomit-frame-pointer -fwrapv -Qunused-arguments -fPIC -fPIE T:aesni

Compiler output

Implementation: T:aesni
Security model: timingleaks
Compiler: gcc -march=native -mtune=native -O2 -fomit-frame-pointer -fwrapv -fPIC -fPIE
cpfbkey.c: cpfbkey.c:15:10: fatal error: wmmintrin.h: No such file or directory
cpfbkey.c: 15 | #include <wmmintrin.h>
cpfbkey.c: | ^~~~~~~~~~~~~
cpfbkey.c: compilation terminated.

Number of similar (compiler,implementation) pairs: 4, namely:
CompilerImplementations
gcc -march=native -mtune=native -O2 -fomit-frame-pointer -fwrapv -fPIC -fPIE T:aesni
gcc -march=native -mtune=native -O3 -fomit-frame-pointer -fwrapv -fPIC -fPIE T:aesni
gcc -march=native -mtune=native -O -fomit-frame-pointer -fwrapv -fPIC -fPIE T:aesni
gcc -march=native -mtune=native -Os -fomit-frame-pointer -fwrapv -fPIC -fPIE T:aesni

Compiler output

Implementation: T:evp
Security model: timingleaks
Compiler: clang -mcpu=native -O3 -fomit-frame-pointer -fwrapv -Qunused-arguments -fPIC -fPIE
encrypt.c: encrypt.c:170:89: error: array has incomplete element type 'EVP_CIPHER_CTX' (aka 'struct evp_cipher_ctx_st')
encrypt.c: static void gen_kappa(unsigned char* nonce, unsigned char* kappa, EVP_CIPHER_CTX ctx_key[1]){
encrypt.c: ^
encrypt.c: /usr/include/openssl/types.h:102:16: note: forward declaration of 'struct evp_cipher_ctx_st'
encrypt.c: typedef struct evp_cipher_ctx_st EVP_CIPHER_CTX;
encrypt.c: ^
encrypt.c: encrypt.c:188:25: error: array has incomplete element type 'EVP_CIPHER_CTX' (aka 'struct evp_cipher_ctx_st')
encrypt.c: EVP_CIPHER_CTX ctx_k[1];
encrypt.c: ^
encrypt.c: /usr/include/openssl/types.h:102:16: note: forward declaration of 'struct evp_cipher_ctx_st'
encrypt.c: typedef struct evp_cipher_ctx_st EVP_CIPHER_CTX;
encrypt.c: ^
encrypt.c: encrypt.c:189:31: error: array has incomplete element type 'EVP_CIPHER_CTX' (aka 'struct evp_cipher_ctx_st')
encrypt.c: EVP_CIPHER_CTX ctx_kappa_0[1];
encrypt.c: ^
encrypt.c: /usr/include/openssl/types.h:102:16: note: forward declaration of 'struct evp_cipher_ctx_st'
encrypt.c: typedef struct evp_cipher_ctx_st EVP_CIPHER_CTX;
encrypt.c: ^
encrypt.c: encrypt.c:190:31: error: array has incomplete element type 'EVP_CIPHER_CTX' (aka 'struct evp_cipher_ctx_st')
encrypt.c: EVP_CIPHER_CTX ctx_kappa_m[1];
encrypt.c: ^
encrypt.c: /usr/include/openssl/types.h:102:16: note: forward declaration of 'struct evp_cipher_ctx_st'
encrypt.c: typedef struct evp_cipher_ctx_st EVP_CIPHER_CTX;
encrypt.c: ^
encrypt.c: encrypt.c:330:25: error: array has incomplete element type 'EVP_CIPHER_CTX' (aka 'struct evp_cipher_ctx_st')
encrypt.c: ...

Number of similar (compiler,implementation) pairs: 1, namely:
CompilerImplementations
clang -mcpu=native -O3 -fomit-frame-pointer -fwrapv -Qunused-arguments -fPIC -fPIE T:evp

Compiler output

Implementation: T:evp
Security model: timingleaks
Compiler: gcc -march=native -mtune=native -O2 -fomit-frame-pointer -fwrapv -fPIC -fPIE
encrypt.c: encrypt.c:170:82: error: array type has incomplete element type 'EVP_CIPHER_CTX' {aka 'struct evp_cipher_ctx_st'}
encrypt.c: 170 | static void gen_kappa(unsigned char* nonce, unsigned char* kappa, EVP_CIPHER_CTX ctx_key[1]){
encrypt.c: | ^~~~~~~
encrypt.c: encrypt.c: In function 'crypto_aead_aes128cpfbv1_evp_timingleaks_encrypt':
encrypt.c: encrypt.c:188:20: error: array type has incomplete element type 'EVP_CIPHER_CTX' {aka 'struct evp_cipher_ctx_st'}
encrypt.c: 188 | EVP_CIPHER_CTX ctx_k[1];
encrypt.c: | ^~~~~
encrypt.c: encrypt.c:189:20: error: array type has incomplete element type 'EVP_CIPHER_CTX' {aka 'struct evp_cipher_ctx_st'}
encrypt.c: 189 | EVP_CIPHER_CTX ctx_kappa_0[1];
encrypt.c: | ^~~~~~~~~~~
encrypt.c: encrypt.c:190:20: error: array type has incomplete element type 'EVP_CIPHER_CTX' {aka 'struct evp_cipher_ctx_st'}
encrypt.c: 190 | EVP_CIPHER_CTX ctx_kappa_m[1];
encrypt.c: | ^~~~~~~~~~~
encrypt.c: encrypt.c:204:31: error: type of formal parameter 3 is incomplete
encrypt.c: 204 | gen_kappa(nonce, kappa_0, ctx_k);
encrypt.c: | ^~~~~
encrypt.c: encrypt.c:265:35: error: type of formal parameter 3 is incomplete
encrypt.c: 265 | gen_kappa(nonce, kappa_m, ctx_k);
encrypt.c: | ^~~~~
encrypt.c: encrypt.c: In function 'crypto_aead_aes128cpfbv1_evp_timingleaks_decrypt':
encrypt.c: encrypt.c:330:20: error: array type has incomplete element type 'EVP_CIPHER_CTX' {aka 'struct evp_cipher_ctx_st'}
encrypt.c: 330 | EVP_CIPHER_CTX ctx_k[1];
encrypt.c: | ^~~~~
encrypt.c: encrypt.c:331:20: error: array type has incomplete element type 'EVP_CIPHER_CTX' {aka 'struct evp_cipher_ctx_st'}
encrypt.c: 331 | EVP_CIPHER_CTX ctx_kappa_0[1];
encrypt.c: ...

Number of similar (compiler,implementation) pairs: 4, namely:
CompilerImplementations
gcc -march=native -mtune=native -O2 -fomit-frame-pointer -fwrapv -fPIC -fPIE T:evp
gcc -march=native -mtune=native -O3 -fomit-frame-pointer -fwrapv -fPIC -fPIE T:evp
gcc -march=native -mtune=native -O -fomit-frame-pointer -fwrapv -fPIC -fPIE T:evp
gcc -march=native -mtune=native -Os -fomit-frame-pointer -fwrapv -fPIC -fPIE T:evp