Implementation notes: aarch64, pi4b, crypto_aead/aeadaes256ocbtaglen128v1

Computer: pi4b
Microarchitecture: aarch64; A72 (410fd083)
Architecture: aarch64
CPU ID: 410fd083
SUPERCOP version: 20221122
Operation: crypto_aead
Primitive: aeadaes256ocbtaglen128v1
TimeObject sizeTest sizeImplementationCompilerBenchmark dateSUPERCOP version
3692596148 18 024927 946 864T:optgcc_-march=native_-mtune=native_-O3_-fomit-frame-pointer_-fwrapv_-fPIC_-fPIE2022102820221025
3697195788 18 023615 938 848T:optgcc_-march=native_-mtune=native_-O2_-fomit-frame-pointer_-fwrapv_-fPIC_-fPIE2022102820221025
3704546440 18 024327 938 848T:optgcc_-march=native_-mtune=native_-O_-fomit-frame-pointer_-fwrapv_-fPIC_-fPIE2022102820221025
3710345579 18 022167 922 840T:optgcc_-march=native_-mtune=native_-Os_-fomit-frame-pointer_-fwrapv_-fPIC_-fPIE2022102820221025

Test failure

Implementation: T:dolbeau/armv8crypto
Security model: timingleaks
Compiler: clang -mcpu=native -O3 -fomit-frame-pointer -fwrapv -Qunused-arguments -fPIC -fPIE
error 111

Number of similar (compiler,implementation) pairs: 2, namely:
CompilerImplementations
clang -mcpu=native -O3 -fomit-frame-pointer -fwrapv -Qunused-arguments -fPIC -fPIE T:dolbeau/armv8crypto T:opt

Compiler output

Implementation: T:dolbeau/armv8crypto
Security model: timingleaks
Compiler: gcc -march=native -mtune=native -O2 -fomit-frame-pointer -fwrapv -fPIC -fPIE
encrypt.c: In file included from encrypt.c:47:
encrypt.c: encrypt.c: In function 'aes256ni_setkey_e2d':
encrypt.c: /usr/lib/gcc/aarch64-linux-gnu/11/include/arm_neon.h:10920:1: error: inlining failed in call to 'always_inline' 'vaesimcq_u8': target specific option mismatch
encrypt.c: 10920 | vaesimcq_u8 (uint8x16_t data)
encrypt.c: | ^~~~~~~~~~~
encrypt.c: encrypt.c:81:16: note: called from here
encrypt.c: 81 | dkeys[i] = vaesimcq_u8(ekeys[14-i]);
encrypt.c: | ^~~~~~~~~~~~~~~~~~~~~~~~

Number of similar (compiler,implementation) pairs: 4, namely:
CompilerImplementations
gcc -march=native -mtune=native -O2 -fomit-frame-pointer -fwrapv -fPIC -fPIE T:dolbeau/armv8crypto
gcc -march=native -mtune=native -O3 -fomit-frame-pointer -fwrapv -fPIC -fPIE T:dolbeau/armv8crypto
gcc -march=native -mtune=native -O -fomit-frame-pointer -fwrapv -fPIC -fPIE T:dolbeau/armv8crypto
gcc -march=native -mtune=native -Os -fomit-frame-pointer -fwrapv -fPIC -fPIE T:dolbeau/armv8crypto

Compiler output

Implementation: T:ref
Security model: timingleaks
Compiler: clang -mcpu=native -O3 -fomit-frame-pointer -fwrapv -Qunused-arguments -fPIC -fPIE
encrypt.c: encrypt.c:86:5: warning: 'AES_set_encrypt_key' is deprecated [-Wdeprecated-declarations]
encrypt.c: AES_set_encrypt_key(k, KEYBYTES*8, &aes_key);
encrypt.c: ^
encrypt.c: /usr/include/openssl/aes.h:50:1: note: 'AES_set_encrypt_key' has been explicitly marked deprecated here
encrypt.c: OSSL_DEPRECATEDIN_3_0
encrypt.c: ^
encrypt.c: /usr/include/openssl/macros.h:182:49: note: expanded from macro 'OSSL_DEPRECATEDIN_3_0'
encrypt.c: # define OSSL_DEPRECATEDIN_3_0 OSSL_DEPRECATED(3.0)
encrypt.c: ^
encrypt.c: /usr/include/openssl/macros.h:62:52: note: expanded from macro 'OSSL_DEPRECATED'
encrypt.c: # define OSSL_DEPRECATED(since) __attribute__((deprecated))
encrypt.c: ^
encrypt.c: encrypt.c:88:5: warning: 'AES_encrypt' is deprecated [-Wdeprecated-declarations]
encrypt.c: AES_encrypt(tmp, lstar, &aes_key);
encrypt.c: ^
encrypt.c: /usr/include/openssl/aes.h:56:1: note: 'AES_encrypt' has been explicitly marked deprecated here
encrypt.c: OSSL_DEPRECATEDIN_3_0
encrypt.c: ^
encrypt.c: /usr/include/openssl/macros.h:182:49: note: expanded from macro 'OSSL_DEPRECATEDIN_3_0'
encrypt.c: # define OSSL_DEPRECATEDIN_3_0 OSSL_DEPRECATED(3.0)
encrypt.c: ^
encrypt.c: /usr/include/openssl/macros.h:62:52: note: expanded from macro 'OSSL_DEPRECATED'
encrypt.c: # define OSSL_DEPRECATED(since) __attribute__((deprecated))
encrypt.c: ^
encrypt.c: encrypt.c:104:9: warning: 'AES_encrypt' is deprecated [-Wdeprecated-declarations]
encrypt.c: ...

Number of similar (compiler,implementation) pairs: 1, namely:
CompilerImplementations
clang -mcpu=native -O3 -fomit-frame-pointer -fwrapv -Qunused-arguments -fPIC -fPIE T:ref

Compiler output

Implementation: T:ref
Security model: timingleaks
Compiler: gcc -march=native -mtune=native -O2 -fomit-frame-pointer -fwrapv -fPIC -fPIE
encrypt.c: encrypt.c: In function 'hash':
encrypt.c: encrypt.c:86:5: warning: 'AES_set_encrypt_key' is deprecated: Since OpenSSL 3.0 [-Wdeprecated-declarations]
encrypt.c: 86 | AES_set_encrypt_key(k, KEYBYTES*8, &aes_key);
encrypt.c: | ^~~~~~~~~~~~~~~~~~~
encrypt.c: In file included from encrypt.c:39:
encrypt.c: /usr/include/openssl/aes.h:51:5: note: declared here
encrypt.c: 51 | int AES_set_encrypt_key(const unsigned char *userKey, const int bits,
encrypt.c: | ^~~~~~~~~~~~~~~~~~~
encrypt.c: encrypt.c:88:5: warning: 'AES_encrypt' is deprecated: Since OpenSSL 3.0 [-Wdeprecated-declarations]
encrypt.c: 88 | AES_encrypt(tmp, lstar, &aes_key);
encrypt.c: | ^~~~~~~~~~~
encrypt.c: In file included from encrypt.c:39:
encrypt.c: /usr/include/openssl/aes.h:57:6: note: declared here
encrypt.c: 57 | void AES_encrypt(const unsigned char *in, unsigned char *out,
encrypt.c: | ^~~~~~~~~~~
encrypt.c: encrypt.c:104:9: warning: 'AES_encrypt' is deprecated: Since OpenSSL 3.0 [-Wdeprecated-declarations]
encrypt.c: 104 | AES_encrypt(tmp, tmp, &aes_key);
encrypt.c: | ^~~~~~~~~~~
encrypt.c: In file included from encrypt.c:39:
encrypt.c: /usr/include/openssl/aes.h:57:6: note: declared here
encrypt.c: 57 | void AES_encrypt(const unsigned char *in, unsigned char *out,
encrypt.c: | ^~~~~~~~~~~
encrypt.c: encrypt.c:120:9: warning: 'AES_encrypt' is deprecated: Since OpenSSL 3.0 [-Wdeprecated-declarations]
encrypt.c: 120 | AES_encrypt(tmp, tmp, &aes_key);
encrypt.c: | ^~~~~~~~~~~
encrypt.c: ...

Number of similar (compiler,implementation) pairs: 4, namely:
CompilerImplementations
gcc -march=native -mtune=native -O2 -fomit-frame-pointer -fwrapv -fPIC -fPIE T:ref
gcc -march=native -mtune=native -O3 -fomit-frame-pointer -fwrapv -fPIC -fPIE T:ref
gcc -march=native -mtune=native -O -fomit-frame-pointer -fwrapv -fPIC -fPIE T:ref
gcc -march=native -mtune=native -Os -fomit-frame-pointer -fwrapv -fPIC -fPIE T:ref

Compiler output

Implementation: T:vaes
Security model: timingleaks
Compiler: clang -mcpu=native -O3 -fomit-frame-pointer -fwrapv -Qunused-arguments -fPIC -fPIE
ocb_vaes.c: In file included from ocb_vaes.c:71:
ocb_vaes.c: /usr/lib/llvm-14/lib/clang/14.0.0/include/immintrin.h:14:2: error: "This header is only meant to be used on x86 and x64 architecture"
ocb_vaes.c: #error "This header is only meant to be used on x86 and x64 architecture"
ocb_vaes.c: ^
ocb_vaes.c: In file included from ocb_vaes.c:71:
ocb_vaes.c: In file included from /usr/lib/llvm-14/lib/clang/14.0.0/include/immintrin.h:17:
ocb_vaes.c: In file included from /usr/lib/llvm-14/lib/clang/14.0.0/include/x86gprintrin.h:15:
ocb_vaes.c: /usr/lib/llvm-14/lib/clang/14.0.0/include/hresetintrin.h:42:27: error: invalid input constraint 'a' in asm
ocb_vaes.c: __asm__ ("hreset $0" :: "a"(__eax));
ocb_vaes.c: ^
ocb_vaes.c: In file included from ocb_vaes.c:71:
ocb_vaes.c: In file included from /usr/lib/llvm-14/lib/clang/14.0.0/include/immintrin.h:21:
ocb_vaes.c: /usr/lib/llvm-14/lib/clang/14.0.0/include/mmintrin.h:14:2: error: "This header is only meant to be used on x86 and x64 architecture"
ocb_vaes.c: #error "This header is only meant to be used on x86 and x64 architecture"
ocb_vaes.c: ^
ocb_vaes.c: /usr/lib/llvm-14/lib/clang/14.0.0/include/mmintrin.h:54:12: error: invalid conversion between vector type '__m64' (vector of 1 'long long' value) and integer type 'int' of different size
ocb_vaes.c: return (__m64)__builtin_ia32_vec_init_v2si(__i, 0);
ocb_vaes.c: ^~~~~~~~~~~~~~~~~~~~~~~~~~~~~~~~~~~~~~~~~~~
ocb_vaes.c: /usr/lib/llvm-14/lib/clang/14.0.0/include/mmintrin.h:133:12: error: invalid conversion between vector type '__m64' (vector of 1 'long long' value) and integer type 'int' of different size
ocb_vaes.c: return (__m64)__builtin_ia32_packsswb((__v4hi)__m1, (__v4hi)__m2);
ocb_vaes.c: ^~~~~~~~~~~~~~~~~~~~~~~~~~~~~~~~~~~~~~~~~~~~~~~~~~~~~~~~~~
ocb_vaes.c: /usr/lib/llvm-14/lib/clang/14.0.0/include/mmintrin.h:163:12: error: invalid conversion between vector type '__m64' (vector of 1 'long long' value) and integer type 'int' of different size
ocb_vaes.c: return (__m64)__builtin_ia32_packssdw((__v2si)__m1, (__v2si)__m2);
ocb_vaes.c: ^~~~~~~~~~~~~~~~~~~~~~~~~~~~~~~~~~~~~~~~~~~~~~~~~~~~~~~~~~
ocb_vaes.c: /usr/lib/llvm-14/lib/clang/14.0.0/include/mmintrin.h:193:12: error: invalid conversion between vector type '__m64' (vector of 1 'long long' value) and integer type 'int' of different size
ocb_vaes.c: ...

Number of similar (compiler,implementation) pairs: 1, namely:
CompilerImplementations
clang -mcpu=native -O3 -fomit-frame-pointer -fwrapv -Qunused-arguments -fPIC -fPIE T:vaes

Compiler output

Implementation: T:vaes
Security model: timingleaks
Compiler: gcc -march=native -mtune=native -O2 -fomit-frame-pointer -fwrapv -fPIC -fPIE
ocb_vaes.c: ocb_vaes.c:71:10: fatal error: immintrin.h: No such file or directory
ocb_vaes.c: 71 | #include <immintrin.h>
ocb_vaes.c: | ^~~~~~~~~~~~~
ocb_vaes.c: compilation terminated.

Number of similar (compiler,implementation) pairs: 4, namely:
CompilerImplementations
gcc -march=native -mtune=native -O2 -fomit-frame-pointer -fwrapv -fPIC -fPIE T:vaes
gcc -march=native -mtune=native -O3 -fomit-frame-pointer -fwrapv -fPIC -fPIE T:vaes
gcc -march=native -mtune=native -O -fomit-frame-pointer -fwrapv -fPIC -fPIE T:vaes
gcc -march=native -mtune=native -Os -fomit-frame-pointer -fwrapv -fPIC -fPIE T:vaes