Implementation notes: aarch64, pi3bplus, crypto_stream/rabbit

Computer: pi3bplus
Architecture: aarch64
CPU ID: 410fd034
SUPERCOP version: 20190816
Operation: crypto_stream
Primitive: rabbit

Compiler output

Implementation: crypto_stream/rabbit/e/opt/2/4
Compiler: gcc -march=native -mtune=native -O3 -fomit-frame-pointer -fwrapv
rabbit.c: In file included from rabbit.c:2:
rabbit.c: e/rabbit.c: In function 'RABBIT_next_state':
rabbit.c: e/rabbit.c:314:4: warning: implicit declaration of function 'RABBIT_G_AND_LATE_COUNTER'; did you mean 'RABBIT_G_AND_COUNTER'? [-Wimplicit-function-declaration]
rabbit.c: RABBIT_G_AND_LATE_COUNTER(0, 0xD34D34D3)
rabbit.c: ^~~~~~~~~~~~~~~~~~~~~~~~~
rabbit.c: RABBIT_G_AND_COUNTER
rabbit.c: e/rabbit.c:314:44: error: expected ';' before 'RABBIT_G_AND_LATE_COUNTER'
rabbit.c: RABBIT_G_AND_LATE_COUNTER(0, 0xD34D34D3)
rabbit.c: ^
rabbit.c: ;
rabbit.c: RABBIT_G_AND_LATE_COUNTER(1, 0x34D34D34)
rabbit.c: ~~~~~~~~~~~~~~~~~~~~~~~~~
rabbit.c: e/rabbit.c:318:44: error: expected ';' before 'p_instance'
rabbit.c: RABBIT_G_AND_LATE_COUNTER(3, 0xD34D34D3)
rabbit.c: ^
rabbit.c: ;
rabbit.c: e/rabbit.c:320:44: error: expected ';' before 'p_instance'
rabbit.c: RABBIT_G_AND_LATE_COUNTER(4, 0x34D34D34)
rabbit.c: ^
rabbit.c: ;
rabbit.c: e/rabbit.c:322:44: error: expected ';' before 'p_instance'
rabbit.c: RABBIT_G_AND_LATE_COUNTER(5, 0x4D34D34D)
rabbit.c: ^
rabbit.c: ;
rabbit.c: e/rabbit.c:324:44: error: expected ';' before 'p_instance'
rabbit.c: ...

Number of similar (compiler,implementation) pairs: 1, namely:
CompilerImplementations
gcc -march=native -mtune=native -O3 -fomit-frame-pointer -fwrapv e/opt/2/4

Compiler output

Implementation: crypto_stream/rabbit/e/opt/1/1
Compiler: gcc -march=native -mtune=native -O3 -fomit-frame-pointer -fwrapv
rabbit.c: In file included from rabbit.c:2:
rabbit.c: e/rabbit.c: In function 'crypto_stream_rabbit_e_opt_1_1_ECRYPT_process_bytes':
rabbit.c: e/rabbit.c:432:48: warning: implicit declaration of function 'U32TO32_LITTLE'; did you mean 'U8TO32_LITTLE'? [-Wimplicit-function-declaration]
rabbit.c: *(u32*)(output+ 0) = *(u32*)(input+ 0) ^ U32TO32_LITTLE(ctx->work_ctx.x0 ^
rabbit.c: ^~~~~~~~~~~~~~
rabbit.c: U8TO32_LITTLE
try.c: /usr/bin/ld: crypto_stream_rabbit.a(rabbit.o): in function `crypto_stream_rabbit_e_opt_1_1_ECRYPT_process_bytes':
try.c: rabbit.c:(.text+0x...): undefined reference to `U32TO32_LITTLE'
try.c: /usr/bin/ld: rabbit.c:(.text+0x...): undefined reference to `U32TO32_LITTLE'
try.c: /usr/bin/ld: rabbit.c:(.text+0x...): undefined reference to `U32TO32_LITTLE'
try.c: /usr/bin/ld: rabbit.c:(.text+0x...): undefined reference to `U32TO32_LITTLE'
try.c: /usr/bin/ld: rabbit.c:(.text+0x...): undefined reference to `U32TO32_LITTLE'
try.c: /usr/bin/ld: crypto_stream_rabbit.a(rabbit.o):rabbit.c:(.text+0x...): more undefined references to `U32TO32_LITTLE' follow
try.c: collect2: error: ld returned 1 exit status

Number of similar (compiler,implementation) pairs: 1, namely:
CompilerImplementations
gcc -march=native -mtune=native -O3 -fomit-frame-pointer -fwrapv e/opt/1/1

Compiler output

Implementation: crypto_stream/rabbit/e/opt/1/2
Compiler: gcc -march=native -mtune=native -O3 -fomit-frame-pointer -fwrapv
rabbit.c: In file included from rabbit.c:2:
rabbit.c: e/rabbit.c: In function 'crypto_stream_rabbit_e_opt_1_2_ECRYPT_process_bytes':
rabbit.c: e/rabbit.c:432:48: warning: implicit declaration of function 'U32TO32_LITTLE'; did you mean 'U8TO32_LITTLE'? [-Wimplicit-function-declaration]
rabbit.c: *(u32*)(output+ 0) = *(u32*)(input+ 0) ^ U32TO32_LITTLE(ctx->work_ctx.x0 ^
rabbit.c: ^~~~~~~~~~~~~~
rabbit.c: U8TO32_LITTLE
try.c: /usr/bin/ld: crypto_stream_rabbit.a(rabbit.o): in function `crypto_stream_rabbit_e_opt_1_2_ECRYPT_process_bytes':
try.c: rabbit.c:(.text+0x...): undefined reference to `U32TO32_LITTLE'
try.c: /usr/bin/ld: rabbit.c:(.text+0x...): undefined reference to `U32TO32_LITTLE'
try.c: /usr/bin/ld: rabbit.c:(.text+0x...): undefined reference to `U32TO32_LITTLE'
try.c: /usr/bin/ld: rabbit.c:(.text+0x...): undefined reference to `U32TO32_LITTLE'
try.c: /usr/bin/ld: rabbit.c:(.text+0x...): undefined reference to `U32TO32_LITTLE'
try.c: /usr/bin/ld: crypto_stream_rabbit.a(rabbit.o):rabbit.c:(.text+0x...): more undefined references to `U32TO32_LITTLE' follow
try.c: collect2: error: ld returned 1 exit status

Number of similar (compiler,implementation) pairs: 1, namely:
CompilerImplementations
gcc -march=native -mtune=native -O3 -fomit-frame-pointer -fwrapv e/opt/1/2

Compiler output

Implementation: crypto_stream/rabbit/e/opt/1/3
Compiler: gcc -march=native -mtune=native -O3 -fomit-frame-pointer -fwrapv
rabbit.c: In file included from rabbit.c:2:
rabbit.c: e/rabbit.c: In function 'crypto_stream_rabbit_e_opt_1_3_ECRYPT_process_bytes':
rabbit.c: e/rabbit.c:432:48: warning: implicit declaration of function 'U32TO32_LITTLE'; did you mean 'U8TO32_LITTLE'? [-Wimplicit-function-declaration]
rabbit.c: *(u32*)(output+ 0) = *(u32*)(input+ 0) ^ U32TO32_LITTLE(ctx->work_ctx.x0 ^
rabbit.c: ^~~~~~~~~~~~~~
rabbit.c: U8TO32_LITTLE
try.c: /usr/bin/ld: crypto_stream_rabbit.a(rabbit.o): in function `crypto_stream_rabbit_e_opt_1_3_ECRYPT_process_bytes':
try.c: rabbit.c:(.text+0x...): undefined reference to `U32TO32_LITTLE'
try.c: /usr/bin/ld: rabbit.c:(.text+0x...): undefined reference to `U32TO32_LITTLE'
try.c: /usr/bin/ld: rabbit.c:(.text+0x...): undefined reference to `U32TO32_LITTLE'
try.c: /usr/bin/ld: rabbit.c:(.text+0x...): undefined reference to `U32TO32_LITTLE'
try.c: /usr/bin/ld: rabbit.c:(.text+0x...): undefined reference to `U32TO32_LITTLE'
try.c: /usr/bin/ld: crypto_stream_rabbit.a(rabbit.o):rabbit.c:(.text+0x...): more undefined references to `U32TO32_LITTLE' follow
try.c: collect2: error: ld returned 1 exit status

Number of similar (compiler,implementation) pairs: 1, namely:
CompilerImplementations
gcc -march=native -mtune=native -O3 -fomit-frame-pointer -fwrapv e/opt/1/3

Compiler output

Implementation: crypto_stream/rabbit/e/opt/1/4
Compiler: gcc -march=native -mtune=native -O3 -fomit-frame-pointer -fwrapv
rabbit.c: In file included from rabbit.c:2:
rabbit.c: e/rabbit.c: In function 'crypto_stream_rabbit_e_opt_1_4_ECRYPT_process_bytes':
rabbit.c: e/rabbit.c:432:48: warning: implicit declaration of function 'U32TO32_LITTLE'; did you mean 'U8TO32_LITTLE'? [-Wimplicit-function-declaration]
rabbit.c: *(u32*)(output+ 0) = *(u32*)(input+ 0) ^ U32TO32_LITTLE(ctx->work_ctx.x0 ^
rabbit.c: ^~~~~~~~~~~~~~
rabbit.c: U8TO32_LITTLE
try.c: /usr/bin/ld: crypto_stream_rabbit.a(rabbit.o): in function `crypto_stream_rabbit_e_opt_1_4_ECRYPT_process_bytes':
try.c: rabbit.c:(.text+0x...): undefined reference to `U32TO32_LITTLE'
try.c: /usr/bin/ld: rabbit.c:(.text+0x...): undefined reference to `U32TO32_LITTLE'
try.c: /usr/bin/ld: rabbit.c:(.text+0x...): undefined reference to `U32TO32_LITTLE'
try.c: /usr/bin/ld: rabbit.c:(.text+0x...): undefined reference to `U32TO32_LITTLE'
try.c: /usr/bin/ld: rabbit.c:(.text+0x...): undefined reference to `U32TO32_LITTLE'
try.c: /usr/bin/ld: crypto_stream_rabbit.a(rabbit.o):rabbit.c:(.text+0x...): more undefined references to `U32TO32_LITTLE' follow
try.c: collect2: error: ld returned 1 exit status

Number of similar (compiler,implementation) pairs: 1, namely:
CompilerImplementations
gcc -march=native -mtune=native -O3 -fomit-frame-pointer -fwrapv e/opt/1/4

Compiler output

Implementation: crypto_stream/rabbit/e/opt/2/1
Compiler: gcc -march=native -mtune=native -O3 -fomit-frame-pointer -fwrapv
rabbit.c: In file included from rabbit.c:2:
rabbit.c: e/rabbit.c: In function 'crypto_stream_rabbit_e_opt_2_1_ECRYPT_process_bytes':
rabbit.c: e/rabbit.c:1313:48: warning: implicit declaration of function 'U32TO32_LITTLE'; did you mean 'U8TO32_LITTLE'? [-Wimplicit-function-declaration]
rabbit.c: *(u32*)(output+ 0) = *(u32*)(input+ 0) ^ U32TO32_LITTLE(ctx->work_ctx.x0 ^
rabbit.c: ^~~~~~~~~~~~~~
rabbit.c: U8TO32_LITTLE
try.c: /usr/bin/ld: crypto_stream_rabbit.a(rabbit.o): in function `crypto_stream_rabbit_e_opt_2_1_ECRYPT_process_bytes':
try.c: rabbit.c:(.text+0x...): undefined reference to `U32TO32_LITTLE'
try.c: /usr/bin/ld: rabbit.c:(.text+0x...): undefined reference to `U32TO32_LITTLE'
try.c: /usr/bin/ld: rabbit.c:(.text+0x...): undefined reference to `U32TO32_LITTLE'
try.c: /usr/bin/ld: rabbit.c:(.text+0x...): undefined reference to `U32TO32_LITTLE'
try.c: /usr/bin/ld: rabbit.c:(.text+0x...): undefined reference to `U32TO32_LITTLE'
try.c: /usr/bin/ld: crypto_stream_rabbit.a(rabbit.o):rabbit.c:(.text+0x...): more undefined references to `U32TO32_LITTLE' follow
try.c: collect2: error: ld returned 1 exit status

Number of similar (compiler,implementation) pairs: 1, namely:
CompilerImplementations
gcc -march=native -mtune=native -O3 -fomit-frame-pointer -fwrapv e/opt/2/1

Compiler output

Implementation: crypto_stream/rabbit/e/opt/2/2
Compiler: gcc -march=native -mtune=native -O3 -fomit-frame-pointer -fwrapv
rabbit.c: In file included from rabbit.c:2:
rabbit.c: e/rabbit.c: In function 'crypto_stream_rabbit_e_opt_2_2_ECRYPT_process_bytes':
rabbit.c: e/rabbit.c:1313:48: warning: implicit declaration of function 'U32TO32_LITTLE'; did you mean 'U8TO32_LITTLE'? [-Wimplicit-function-declaration]
rabbit.c: *(u32*)(output+ 0) = *(u32*)(input+ 0) ^ U32TO32_LITTLE(ctx->work_ctx.x0 ^
rabbit.c: ^~~~~~~~~~~~~~
rabbit.c: U8TO32_LITTLE
try.c: /usr/bin/ld: crypto_stream_rabbit.a(rabbit.o): in function `crypto_stream_rabbit_e_opt_2_2_ECRYPT_process_bytes':
try.c: rabbit.c:(.text+0x...): undefined reference to `U32TO32_LITTLE'
try.c: /usr/bin/ld: rabbit.c:(.text+0x...): undefined reference to `U32TO32_LITTLE'
try.c: /usr/bin/ld: rabbit.c:(.text+0x...): undefined reference to `U32TO32_LITTLE'
try.c: /usr/bin/ld: rabbit.c:(.text+0x...): undefined reference to `U32TO32_LITTLE'
try.c: /usr/bin/ld: rabbit.c:(.text+0x...): undefined reference to `U32TO32_LITTLE'
try.c: /usr/bin/ld: crypto_stream_rabbit.a(rabbit.o):rabbit.c:(.text+0x...): more undefined references to `U32TO32_LITTLE' follow
try.c: collect2: error: ld returned 1 exit status

Number of similar (compiler,implementation) pairs: 1, namely:
CompilerImplementations
gcc -march=native -mtune=native -O3 -fomit-frame-pointer -fwrapv e/opt/2/2

Compiler output

Implementation: crypto_stream/rabbit/e/opt/2/3
Compiler: gcc -march=native -mtune=native -O3 -fomit-frame-pointer -fwrapv
rabbit.c: In file included from rabbit.c:2:
rabbit.c: e/rabbit.c: In function 'crypto_stream_rabbit_e_opt_2_3_ECRYPT_process_bytes':
rabbit.c: e/rabbit.c:1313:48: warning: implicit declaration of function 'U32TO32_LITTLE'; did you mean 'U8TO32_LITTLE'? [-Wimplicit-function-declaration]
rabbit.c: *(u32*)(output+ 0) = *(u32*)(input+ 0) ^ U32TO32_LITTLE(ctx->work_ctx.x0 ^
rabbit.c: ^~~~~~~~~~~~~~
rabbit.c: U8TO32_LITTLE
try.c: /usr/bin/ld: crypto_stream_rabbit.a(rabbit.o): in function `crypto_stream_rabbit_e_opt_2_3_ECRYPT_process_bytes':
try.c: rabbit.c:(.text+0x...): undefined reference to `U32TO32_LITTLE'
try.c: /usr/bin/ld: rabbit.c:(.text+0x...): undefined reference to `U32TO32_LITTLE'
try.c: /usr/bin/ld: rabbit.c:(.text+0x...): undefined reference to `U32TO32_LITTLE'
try.c: /usr/bin/ld: rabbit.c:(.text+0x...): undefined reference to `U32TO32_LITTLE'
try.c: /usr/bin/ld: rabbit.c:(.text+0x...): undefined reference to `U32TO32_LITTLE'
try.c: /usr/bin/ld: crypto_stream_rabbit.a(rabbit.o):rabbit.c:(.text+0x...): more undefined references to `U32TO32_LITTLE' follow
try.c: collect2: error: ld returned 1 exit status

Number of similar (compiler,implementation) pairs: 1, namely:
CompilerImplementations
gcc -march=native -mtune=native -O3 -fomit-frame-pointer -fwrapv e/opt/2/3

Compiler output

Implementation: crypto_stream/rabbit/e/ref
Compiler: gcc -march=native -mtune=native -O3 -fomit-frame-pointer -fwrapv
rabbit.c: In file included from rabbit.c:2:
rabbit.c: e/rabbit.c: In function 'crypto_stream_rabbit_e_ref_ECRYPT_process_bytes':
rabbit.c: e/rabbit.c:203:48: warning: implicit declaration of function 'U32TO32_LITTLE'; did you mean 'U8TO32_LITTLE'? [-Wimplicit-function-declaration]
rabbit.c: *(u32*)(output+ 0) = *(u32*)(input+ 0) ^ U32TO32_LITTLE(ctx->work_ctx.x[0] ^
rabbit.c: ^~~~~~~~~~~~~~
rabbit.c: U8TO32_LITTLE
try.c: /usr/bin/ld: crypto_stream_rabbit.a(rabbit.o): in function `crypto_stream_rabbit_e_ref_ECRYPT_process_bytes':
try.c: rabbit.c:(.text+0x...): undefined reference to `U32TO32_LITTLE'
try.c: /usr/bin/ld: rabbit.c:(.text+0x...): undefined reference to `U32TO32_LITTLE'
try.c: /usr/bin/ld: rabbit.c:(.text+0x...): undefined reference to `U32TO32_LITTLE'
try.c: /usr/bin/ld: rabbit.c:(.text+0x...): undefined reference to `U32TO32_LITTLE'
try.c: /usr/bin/ld: rabbit.c:(.text+0x...): undefined reference to `U32TO32_LITTLE'
try.c: /usr/bin/ld: crypto_stream_rabbit.a(rabbit.o):rabbit.c:(.text+0x...): more undefined references to `U32TO32_LITTLE' follow
try.c: collect2: error: ld returned 1 exit status

Number of similar (compiler,implementation) pairs: 1, namely:
CompilerImplementations
gcc -march=native -mtune=native -O3 -fomit-frame-pointer -fwrapv e/ref

Compiler output

Implementation: crypto_stream/rabbit/e/opt/2/5
Compiler: gcc -march=native -mtune=native -O3 -fomit-frame-pointer -fwrapv
rabbit.c: In file included from rabbit.c:2:
rabbit.c: e/rabbit.c:37:2: error: #error this variant does not compile on this platform
rabbit.c: #error this variant does not compile on this platform
rabbit.c: ^~~~~
rabbit.c: e/rabbit.c: In function 'RABBIT_next_state':
rabbit.c: e/rabbit.c:314:4: warning: implicit declaration of function 'RABBIT_G_AND_LATE_COUNTER'; did you mean 'RABBIT_G_AND_COUNTER'? [-Wimplicit-function-declaration]
rabbit.c: RABBIT_G_AND_LATE_COUNTER(0, 0xD34D34D3)
rabbit.c: ^~~~~~~~~~~~~~~~~~~~~~~~~
rabbit.c: RABBIT_G_AND_COUNTER
rabbit.c: e/rabbit.c:314:44: error: expected ';' before 'RABBIT_G_AND_LATE_COUNTER'
rabbit.c: RABBIT_G_AND_LATE_COUNTER(0, 0xD34D34D3)
rabbit.c: ^
rabbit.c: ;
rabbit.c: RABBIT_G_AND_LATE_COUNTER(1, 0x34D34D34)
rabbit.c: ~~~~~~~~~~~~~~~~~~~~~~~~~
rabbit.c: e/rabbit.c:318:44: error: expected ';' before 'p_instance'
rabbit.c: RABBIT_G_AND_LATE_COUNTER(3, 0xD34D34D3)
rabbit.c: ^
rabbit.c: ;
rabbit.c: e/rabbit.c:320:44: error: expected ';' before 'p_instance'
rabbit.c: RABBIT_G_AND_LATE_COUNTER(4, 0x34D34D34)
rabbit.c: ^
rabbit.c: ;
rabbit.c: e/rabbit.c:322:44: error: expected ';' before 'p_instance'
rabbit.c: RABBIT_G_AND_LATE_COUNTER(5, 0x4D34D34D)
rabbit.c: ...

Number of similar (compiler,implementation) pairs: 1, namely:
CompilerImplementations
gcc -march=native -mtune=native -O3 -fomit-frame-pointer -fwrapv e/opt/2/5