Implementation notes: aarch64, pi3bplus, crypto_sign/gemss192

Computer: pi3bplus
Architecture: aarch64
CPU ID: 410fd034
SUPERCOP version: 20191221
Operation: crypto_sign
Primitive: gemss192

Compiler output

Implementation: crypto_sign/gemss192/opt
Compiler: clang -mcpu=native -O3 -fomit-frame-pointer -fwrapv -Qunused-arguments -fPIC -fPIE
arith_gf2n.c: In file included from arith_gf2n.c:1:
arith_gf2n.c: In file included from ./arith_gf2n.h:9:
arith_gf2n.c: In file included from ./tools_gf2n.h:162:
arith_gf2n.c: ./mul_gf2x.h:17:14: fatal error: 'gf2x/gf2x_mul1.h' file not found
arith_gf2n.c: #include <gf2x/gf2x_mul1.h>
arith_gf2n.c: ^~~~~~~~~~~~~~~~~~
arith_gf2n.c: 1 error generated.

Number of similar (compiler,implementation) pairs: 2, namely:
CompilerImplementations
clang -mcpu=native -O3 -fomit-frame-pointer -fwrapv -Qunused-arguments -fPIC -fPIE opt skylake

Compiler output

Implementation: crypto_sign/gemss192/ref
Compiler: g++ -march=native -mtune=native -O2 -fomit-frame-pointer -fwrapv -fPIC -fPIE
try.cpp: /usr/bin/ld: /home/djb/benchmarking/supercop-20191221/supercop-data/pi3bplus/aarch64/lib/libntl.a(GF2E.o): undefined reference to symbol 'pthread_setspecific@@GLIBC_2.17'
try.cpp: /usr/bin/ld: //lib/aarch64-linux-gnu/libpthread.so.0: error adding symbols: DSO missing from command line
try.cpp: collect2: error: ld returned 1 exit status

Number of similar (compiler,implementation) pairs: 4, namely:
CompilerImplementations
g++ -march=native -mtune=native -O2 -fomit-frame-pointer -fwrapv -fPIC -fPIE ref
g++ -march=native -mtune=native -O3 -fomit-frame-pointer -fwrapv -fPIC -fPIE ref
g++ -march=native -mtune=native -O -fomit-frame-pointer -fwrapv -fPIC -fPIE ref
g++ -march=native -mtune=native -Os -fomit-frame-pointer -fwrapv -fPIC -fPIE ref

Compiler output

Implementation: crypto_sign/gemss192/opt
Compiler: gcc -march=native -mtune=native -O2 -fomit-frame-pointer -fwrapv -fPIC -fPIE
arith_gf2n.c: In file included from tools_gf2n.h:162,
arith_gf2n.c: from arith_gf2n.h:9,
arith_gf2n.c: from arith_gf2n.c:1:
arith_gf2n.c: mul_gf2x.h:17:14: fatal error: gf2x/gf2x_mul1.h: No such file or directory
arith_gf2n.c: #include <gf2x/gf2x_mul1.h>
arith_gf2n.c: ^~~~~~~~~~~~~~~~~~
arith_gf2n.c: compilation terminated.

Number of similar (compiler,implementation) pairs: 8, namely:
CompilerImplementations
gcc -march=native -mtune=native -O2 -fomit-frame-pointer -fwrapv -fPIC -fPIE opt skylake
gcc -march=native -mtune=native -O3 -fomit-frame-pointer -fwrapv -fPIC -fPIE opt skylake
gcc -march=native -mtune=native -O -fomit-frame-pointer -fwrapv -fPIC -fPIE opt skylake
gcc -march=native -mtune=native -Os -fomit-frame-pointer -fwrapv -fPIC -fPIE opt skylake