Implementation notes: aarch64, pi3bplus, crypto_sign/donald2048

Computer: pi3bplus
Architecture: aarch64
CPU ID: 410fd034
SUPERCOP version: 20200702
Operation: crypto_sign
Primitive: donald2048

Compiler output

Implementation: crypto_sign/donald2048/openssl
Compiler: clang -mcpu=native -O3 -fomit-frame-pointer -fwrapv -Qunused-arguments -fPIC -fPIE
keypair.c: keypair.c:18:4: error: incomplete definition of type 'struct dsa_st'
keypair.c: x->p = BN_new(); if (!x->p) goto error;
keypair.c: ~^
keypair.c: /usr/include/openssl/ossl_typ.h:107:16: note: forward declaration of 'struct dsa_st'
keypair.c: typedef struct dsa_st DSA;
keypair.c: ^
keypair.c: keypair.c:18:26: error: incomplete definition of type 'struct dsa_st'
keypair.c: x->p = BN_new(); if (!x->p) goto error;
keypair.c: ~^
keypair.c: /usr/include/openssl/ossl_typ.h:107:16: note: forward declaration of 'struct dsa_st'
keypair.c: typedef struct dsa_st DSA;
keypair.c: ^
keypair.c: keypair.c:19:4: error: incomplete definition of type 'struct dsa_st'
keypair.c: x->q = BN_new(); if (!x->q) goto error;
keypair.c: ~^
keypair.c: /usr/include/openssl/ossl_typ.h:107:16: note: forward declaration of 'struct dsa_st'
keypair.c: typedef struct dsa_st DSA;
keypair.c: ^
keypair.c: keypair.c:19:26: error: incomplete definition of type 'struct dsa_st'
keypair.c: x->q = BN_new(); if (!x->q) goto error;
keypair.c: ~^
keypair.c: /usr/include/openssl/ossl_typ.h:107:16: note: forward declaration of 'struct dsa_st'
keypair.c: typedef struct dsa_st DSA;
keypair.c: ^
keypair.c: keypair.c:20:4: error: incomplete definition of type 'struct dsa_st'
keypair.c: ...

Number of similar (compiler,implementation) pairs: 1, namely:
CompilerImplementations
clang -mcpu=native -O3 -fomit-frame-pointer -fwrapv -Qunused-arguments -fPIC -fPIE openssl

Compiler output

Implementation: crypto_sign/donald2048/cryptopp
Compiler: g++ -march=native -mtune=native -O2 -fomit-frame-pointer -fwrapv -fPIC -fPIE
sign.cpp: sign.cpp:1:10: fatal error: cryptopp/dsa.h: No such file or directory
sign.cpp: #include <cryptopp/dsa.h>
sign.cpp: ^~~~~~~~~~~~~~~~
sign.cpp: compilation terminated.

Number of similar (compiler,implementation) pairs: 4, namely:
CompilerImplementations
g++ -march=native -mtune=native -O2 -fomit-frame-pointer -fwrapv -fPIC -fPIE cryptopp
g++ -march=native -mtune=native -O3 -fomit-frame-pointer -fwrapv -fPIC -fPIE cryptopp
g++ -march=native -mtune=native -O -fomit-frame-pointer -fwrapv -fPIC -fPIE cryptopp
g++ -march=native -mtune=native -Os -fomit-frame-pointer -fwrapv -fPIC -fPIE cryptopp

Compiler output

Implementation: crypto_sign/donald2048/openssl
Compiler: gcc -march=native -mtune=native -O2 -fomit-frame-pointer -fwrapv -fPIC -fPIE
keypair.c: keypair.c: In function 'crypto_sign_donald2048_openssl_keypair':
keypair.c: keypair.c:18:4: error: dereferencing pointer to incomplete type 'DSA' {aka 'struct dsa_st'}
keypair.c: x->p = BN_new(); if (!x->p) goto error;
keypair.c: ^~

Number of similar (compiler,implementation) pairs: 4, namely:
CompilerImplementations
gcc -march=native -mtune=native -O2 -fomit-frame-pointer -fwrapv -fPIC -fPIE openssl
gcc -march=native -mtune=native -O3 -fomit-frame-pointer -fwrapv -fPIC -fPIE openssl
gcc -march=native -mtune=native -O -fomit-frame-pointer -fwrapv -fPIC -fPIE openssl
gcc -march=native -mtune=native -Os -fomit-frame-pointer -fwrapv -fPIC -fPIE openssl