Implementation notes: aarch64, pi3bplus, crypto_kem/hqc1921

Computer: pi3bplus
Architecture: aarch64
CPU ID: 410fd034
SUPERCOP version: 20191221
Operation: crypto_kem
Primitive: hqc1921
TimeObject sizeTest sizeImplementationCompilerBenchmark dateSUPERCOP version
1770101225142 0 042594 928 1624optgcc_-march=native_-mtune=native_-O3_-fomit-frame-pointer_-fwrapv_-fPIC_-fPIE2020012120191221
1942993812718 0 028864 920 1608optgcc_-march=native_-mtune=native_-O2_-fomit-frame-pointer_-fwrapv_-fPIC_-fPIE2020012120191221
2058961411561 0 026440 904 1592optgcc_-march=native_-mtune=native_-Os_-fomit-frame-pointer_-fwrapv_-fPIC_-fPIE2020012120191221
2813218012714 0 028544 920 1608optgcc_-march=native_-mtune=native_-O_-fomit-frame-pointer_-fwrapv_-fPIC_-fPIE2020012120191221

Compiler output

Implementation: crypto_kem/hqc1921/opt
Compiler: clang -mcpu=native -O3 -fomit-frame-pointer -fwrapv -Qunused-arguments -fPIC -fPIE
gf2x_avx2.c: gf2x_avx2.c:87:19: error: use of unknown builtin '__builtin_shuffle' [-Wimplicit-function-declaration]
gf2x_avx2.c: rightVector = __builtin_shuffle(
gf2x_avx2.c: ^
gf2x_avx2.c: gf2x_avx2.c:87:17: error: assigning to 'v8uint32' (vector of 8 'uint32_t' values) from incompatible type 'int'
gf2x_avx2.c: rightVector = __builtin_shuffle(
gf2x_avx2.c: ^ ~~~~~~~~~~~~~~~~~~
gf2x_avx2.c: gf2x_avx2.c:89:16: error: assigning to 'v8uint32' (vector of 8 'uint32_t' values) from incompatible type 'int'
gf2x_avx2.c: leftVector = __builtin_shuffle(
gf2x_avx2.c: ^ ~~~~~~~~~~~~~~~~~~
gf2x_avx2.c: 3 errors generated.

Number of similar (compiler,implementation) pairs: 1, namely:
CompilerImplementations
clang -mcpu=native -O3 -fomit-frame-pointer -fwrapv -Qunused-arguments -fPIC -fPIE opt

Compiler output

Implementation: crypto_kem/hqc1921/ref
Compiler: g++ -march=native -mtune=native -O2 -fomit-frame-pointer -fwrapv -fPIC -fPIE
try.cpp: /usr/bin/ld: /home/djb/benchmarking/supercop-20191221/supercop-data/pi3bplus/aarch64/lib/libntl.a(GF2X.o): undefined reference to symbol 'pthread_setspecific@@GLIBC_2.17'
try.cpp: /usr/bin/ld: //lib/aarch64-linux-gnu/libpthread.so.0: error adding symbols: DSO missing from command line
try.cpp: collect2: error: ld returned 1 exit status

Number of similar (compiler,implementation) pairs: 4, namely:
CompilerImplementations
g++ -march=native -mtune=native -O2 -fomit-frame-pointer -fwrapv -fPIC -fPIE ref
g++ -march=native -mtune=native -O3 -fomit-frame-pointer -fwrapv -fPIC -fPIE ref
g++ -march=native -mtune=native -O -fomit-frame-pointer -fwrapv -fPIC -fPIE ref
g++ -march=native -mtune=native -Os -fomit-frame-pointer -fwrapv -fPIC -fPIE ref

Namespace violations

Implementation: crypto_kem/hqc1921/opt
Compiler: gcc -march=native -mtune=native -O2 -fomit-frame-pointer -fwrapv -fPIC -fPIE
bch.o array_to_codeword T
bch.o bch_code_decode T
bch.o bch_code_encode T
bch.o chien_search T
bch.o compute_generator_poly T
bch.o cyclotomic_clear T
bch.o cyclotomic_gen T
bch.o cyclotomic_init T
bch.o error_poly_gen T
bch.o get_error_location_poly T
bch.o get_generator_poly T
bch.o gf_generation T
bch.o gf_get_antilog T
bch.o gf_get_log T
bch.o gf_mod T
bch.o gf_mult T
bch.o gf_tables_clear T
bch.o gf_tables_init T
bch.o lfsr_encoder T
bch.o message_from_codeword T
bch.o message_to_array T
bch.o polynomial_hex T
bch.o sigma_poly_clear T
bch.o sigma_poly_copy T
bch.o sigma_poly_init T
bch.o syndrome_clear T
bch.o syndrome_gen T
bch.o syndrome_init T
gf2x_avx2.o shiftXor T
gf2x_avx2.o sparse_dense_mul T
gf2x_avx2.o vect_sparse_from_bytes T
hqc.o hqc_pke_decrypt T
hqc.o hqc_pke_encrypt T
hqc.o hqc_pke_keygen T
parsing.o hqc_ciphertext_from_string T
parsing.o hqc_ciphertext_to_string T
parsing.o hqc_public_key_from_string T
parsing.o hqc_public_key_to_string T
parsing.o hqc_secret_key_from_string T
parsing.o hqc_secret_key_to_string T
repetition.o array_to_rep_codeword T
repetition.o repetition_code_decode T
repetition.o repetition_code_encode T
rng.o AES256_ECB T
rng.o DRBG_ctx C
rng.o handleErrors T
rng.o seedexpander T
rng.o seedexpander_init T
tensor.o tensor_code_decode T
tensor.o tensor_code_encode T
vector.o vect_add T
vector.o vect_compare T
vector.o vect_fixed_weight T
vector.o vect_print T
vector.o vect_resize T
vector.o vect_set_random T
vector.o vect_set_random_from_randombytes T

Number of similar (compiler,implementation) pairs: 4, namely:
CompilerImplementations
gcc -march=native -mtune=native -O2 -fomit-frame-pointer -fwrapv -fPIC -fPIE opt
gcc -march=native -mtune=native -O3 -fomit-frame-pointer -fwrapv -fPIC -fPIE opt
gcc -march=native -mtune=native -O -fomit-frame-pointer -fwrapv -fPIC -fPIE opt
gcc -march=native -mtune=native -Os -fomit-frame-pointer -fwrapv -fPIC -fPIE opt