Implementation notes: aarch64, pi3bplus, crypto_hash/blake2b

Computer: pi3bplus
Architecture: aarch64
CPU ID: 410fd034
SUPERCOP version: 20190816
Operation: crypto_hash
Primitive: blake2b
TimeImplementationCompilerBenchmark dateSUPERCOP version
9244regsgcc -march=native -mtune=native -O3 -fomit-frame-pointer -fwrapv2019081920190816
11631refgcc -march=native -mtune=native -O3 -fomit-frame-pointer -fwrapv2019081920190816

Compiler output

Implementation: crypto_hash/blake2b/xmm
Compiler: gcc -march=native -mtune=native -O3 -fomit-frame-pointer -fwrapv
blake2b.c: In file included from blake2b.c:6:
blake2b.c: blake2-config.h:68:2: error: #error "This code requires at least SSE2."
blake2b.c: #error "This code requires at least SSE2."
blake2b.c: ^~~~~
blake2b.c: blake2b.c:11:10: fatal error: immintrin.h: No such file or directory
blake2b.c: #include <immintrin.h>
blake2b.c: ^~~~~~~~~~~~~
blake2b.c: compilation terminated.

Number of similar (compiler,implementation) pairs: 2, namely:
CompilerImplementations
gcc -march=native -mtune=native -O3 -fomit-frame-pointer -fwrapv xmm ymm

Compiler output

Implementation: crypto_hash/blake2b/avx2-1
Compiler: gcc -march=native -mtune=native -O3 -fomit-frame-pointer -fwrapv
blake2b.c: blake2b.c:11:10: fatal error: immintrin.h: No such file or directory
blake2b.c: #include <immintrin.h>
blake2b.c: ^~~~~~~~~~~~~
blake2b.c: compilation terminated.

Number of similar (compiler,implementation) pairs: 1, namely:
CompilerImplementations
gcc -march=native -mtune=native -O3 -fomit-frame-pointer -fwrapv avx2-1

Compiler output

Implementation: crypto_hash/blake2b/avx2-2
Compiler: gcc -march=native -mtune=native -O3 -fomit-frame-pointer -fwrapv
blake2b.c: blake2b.c:12:10: fatal error: immintrin.h: No such file or directory
blake2b.c: #include <immintrin.h>
blake2b.c: ^~~~~~~~~~~~~
blake2b.c: compilation terminated.

Number of similar (compiler,implementation) pairs: 2, namely:
CompilerImplementations
gcc -march=native -mtune=native -O3 -fomit-frame-pointer -fwrapv avx2-2 avx2-3

Compiler output

Implementation: crypto_hash/blake2b/avxicc
Compiler: gcc -march=native -mtune=native -O3 -fomit-frame-pointer -fwrapv
blake2b.s: blake2b.s: Assembler messages:
blake2b.s: blake2b.s:3: Error: unknown pseudo-op: `.intel_syntax'
blake2b.s: blake2b.s:14: Error: operand 1 must be an integer or stack pointer register -- `sub rsp,552'
blake2b.s: blake2b.s:16: Error: unknown mnemonic `xor' -- `xor r11d,r11d'
blake2b.s: blake2b.s:17: Error: unknown mnemonic `xor' -- `xor ecx,ecx'
blake2b.s: blake2b.s:18: Error: operand 1 must be an integer register -- `mov r9,rsi'
blake2b.s: blake2b.s:19: Error: unknown mnemonic `vmovdqu' -- `vmovdqu xmm2,XMMWORD PTR .L_2il0floatpacket.13[rip]'
blake2b.s: blake2b.s:20: Error: unknown mnemonic `xor' -- `xor eax,eax'
blake2b.s: blake2b.s:21: Error: unknown mnemonic `vmovdqu' -- `vmovdqu xmm3,XMMWORD PTR .L_2il0floatpacket.14[rip]'
blake2b.s: blake2b.s:22: Error: operand 1 must be an integer register -- `mov r8,rdx'
blake2b.s: blake2b.s:23: Error: unknown mnemonic `vmovdqu' -- `vmovdqu xmm4,XMMWORD PTR .L_2il0floatpacket.15[rip]'
blake2b.s: blake2b.s:24: Error: unknown mnemonic `xor' -- `xor r10d,r10d'
blake2b.s: blake2b.s:25: Error: unknown mnemonic `vmovdqu' -- `vmovdqu xmm11,XMMWORD PTR .L_2il0floatpacket.16[rip]'
blake2b.s: blake2b.s:26: Error: unknown mnemonic `vmovdqu' -- `vmovdqu xmm1,XMMWORD PTR .L_2il0floatpacket.11[rip]'
blake2b.s: blake2b.s:27: Error: unknown mnemonic `vmovdqu' -- `vmovdqu xmm0,XMMWORD PTR .L_2il0floatpacket.12[rip]'
blake2b.s: blake2b.s:28: Error: unknown mnemonic `vmovdqu' -- `vmovdqu XMMWORD PTR[448+rsp],xmm2'
blake2b.s: blake2b.s:29: Error: unknown mnemonic `vmovdqu' -- `vmovdqu XMMWORD PTR[464+rsp],xmm3'
blake2b.s: blake2b.s:30: Error: unknown mnemonic `vmovdqu' -- `vmovdqu XMMWORD PTR[496+rsp],xmm4'
blake2b.s: blake2b.s:31: Error: unknown mnemonic `vmovdqu' -- `vmovdqu XMMWORD PTR[480+rsp],xmm11'
blake2b.s: blake2b.s:32: Error: unknown mnemonic `vmovdqu' -- `vmovdqu xmm5,XMMWORD PTR .L_2il0floatpacket.17[rip]'
blake2b.s: blake2b.s:33: Error: operand 1 must be an integer or stack pointer register -- `cmp rdx,128'
blake2b.s: blake2b.s:34: Error: unknown mnemonic `jbe' -- `jbe ..B1.5'
blake2b.s: blake2b.s:37: Error: operand 1 must be an integer register -- `mov QWORD PTR[rsp],rbp'
blake2b.s: blake2b.s:38: Error: unknown mnemonic `lea' -- `lea rsi,QWORD PTR[-1+rdx]'
blake2b.s: blake2b.s:39: Error: unknown mnemonic `sar' -- `sar rsi,6'
blake2b.s: ...

Number of similar (compiler,implementation) pairs: 1, namely:
CompilerImplementations
gcc -march=native -mtune=native -O3 -fomit-frame-pointer -fwrapv avxicc