Implementation notes: aarch64, pi3bplus, crypto_aead/schwaemm256256v1

Computer: pi3bplus
Architecture: aarch64
CPU ID: 410fd034
SUPERCOP version: 20200702
Operation: crypto_aead
Primitive: schwaemm256256v1
TimeObject sizeTest sizeImplementationCompilerBenchmark dateSUPERCOP version
39133910797 0 023127 880 864refgcc_-march=native_-mtune=native_-O3_-fomit-frame-pointer_-fwrapv_-fPIC_-fPIE2020042520200417
5303165053 0 017279 872 864optgcc_-march=native_-mtune=native_-O3_-fomit-frame-pointer_-fwrapv_-fPIC_-fPIE2020042520200417
5604944373 0 015399 872 848optgcc_-march=native_-mtune=native_-O2_-fomit-frame-pointer_-fwrapv_-fPIC_-fPIE2020042520200417
6051564881 0 015991 880 848refgcc_-march=native_-mtune=native_-O2_-fomit-frame-pointer_-fwrapv_-fPIC_-fPIE2020042520200417
7092794537 0 015647 872 848optgcc_-march=native_-mtune=native_-O_-fomit-frame-pointer_-fwrapv_-fPIC_-fPIE2020042520200417
7254595133 0 016335 880 848refgcc_-march=native_-mtune=native_-O_-fomit-frame-pointer_-fwrapv_-fPIC_-fPIE2020042520200417

Compiler output

Implementation: crypto_aead/schwaemm256256v1/opt
Compiler: clang -mcpu=native -O3 -fomit-frame-pointer -fwrapv -Qunused-arguments -fPIC -fPIE
try.c: /usr/bin/ld: crypto_aead_schwaemm256256v1.a(encrypt.o): in function `crypto_aead_schwaemm256256v1_opt_encrypt':
try.c: encrypt.c:(.text+0x...): undefined reference to `initialize'
try.c: /usr/bin/ld: encrypt.c:(.text+0x...): undefined reference to `processAD'
try.c: /usr/bin/ld: encrypt.c:(.text+0x...): undefined reference to `encryptPT'
try.c: /usr/bin/ld: crypto_aead_schwaemm256256v1.a(encrypt.o): in function `crypto_aead_schwaemm256256v1_opt_decrypt':
try.c: encrypt.c:(.text+0x...): undefined reference to `initialize'
try.c: /usr/bin/ld: encrypt.c:(.text+0x...): undefined reference to `processAD'
try.c: /usr/bin/ld: encrypt.c:(.text+0x...): undefined reference to `decryptCT'
try.c: clang: error: linker command failed with exit code 1 (use -v to see invocation)

Number of similar (compiler,implementation) pairs: 1, namely:
CompilerImplementations
clang -mcpu=native -O3 -fomit-frame-pointer -fwrapv -Qunused-arguments -fPIC -fPIE opt

Compiler output

Implementation: crypto_aead/schwaemm256256v1/ref
Compiler: clang -mcpu=native -O3 -fomit-frame-pointer -fwrapv -Qunused-arguments -fPIC -fPIE
try.c: /usr/bin/ld: crypto_aead_schwaemm256256v1.a(encrypt.o): in function `crypto_aead_schwaemm256256v1_ref_encrypt':
try.c: encrypt.c:(.text+0x...): undefined reference to `initialize'
try.c: /usr/bin/ld: encrypt.c:(.text+0x...): undefined reference to `processAD'
try.c: /usr/bin/ld: encrypt.c:(.text+0x...): undefined reference to `encryptPT'
try.c: /usr/bin/ld: crypto_aead_schwaemm256256v1.a(encrypt.o): in function `crypto_aead_schwaemm256256v1_ref_decrypt':
try.c: encrypt.c:(.text+0x...): undefined reference to `initialize'
try.c: /usr/bin/ld: encrypt.c:(.text+0x...): undefined reference to `processAD'
try.c: /usr/bin/ld: encrypt.c:(.text+0x...): undefined reference to `decryptCT'
try.c: clang: error: linker command failed with exit code 1 (use -v to see invocation)

Number of similar (compiler,implementation) pairs: 1, namely:
CompilerImplementations
clang -mcpu=native -O3 -fomit-frame-pointer -fwrapv -Qunused-arguments -fPIC -fPIE ref

Compiler output

Implementation: crypto_aead/schwaemm256256v1/opt
Compiler: gcc -march=native -mtune=native -Os -fomit-frame-pointer -fwrapv -fPIC -fPIE
try.c: /usr/bin/ld: crypto_aead_schwaemm256256v1.a(encrypt.o): in function `crypto_aead_schwaemm256256v1_opt_encrypt':
try.c: encrypt.c:(.text+0x...): undefined reference to `initialize'
try.c: /usr/bin/ld: encrypt.c:(.text+0x...): undefined reference to `processAD'
try.c: /usr/bin/ld: encrypt.c:(.text+0x...): undefined reference to `encryptPT'
try.c: /usr/bin/ld: crypto_aead_schwaemm256256v1.a(encrypt.o): in function `crypto_aead_schwaemm256256v1_opt_decrypt':
try.c: encrypt.c:(.text+0x...): undefined reference to `initialize'
try.c: /usr/bin/ld: encrypt.c:(.text+0x...): undefined reference to `processAD'
try.c: /usr/bin/ld: encrypt.c:(.text+0x...): undefined reference to `decryptCT'
try.c: collect2: error: ld returned 1 exit status

Number of similar (compiler,implementation) pairs: 1, namely:
CompilerImplementations
gcc -march=native -mtune=native -Os -fomit-frame-pointer -fwrapv -fPIC -fPIE opt

Compiler output

Implementation: crypto_aead/schwaemm256256v1/ref
Compiler: gcc -march=native -mtune=native -Os -fomit-frame-pointer -fwrapv -fPIC -fPIE
try.c: /usr/bin/ld: crypto_aead_schwaemm256256v1.a(encrypt.o): in function `crypto_aead_schwaemm256256v1_ref_encrypt':
try.c: encrypt.c:(.text+0x...): undefined reference to `initialize'
try.c: /usr/bin/ld: encrypt.c:(.text+0x...): undefined reference to `processAD'
try.c: /usr/bin/ld: encrypt.c:(.text+0x...): undefined reference to `encryptPT'
try.c: /usr/bin/ld: crypto_aead_schwaemm256256v1.a(encrypt.o): in function `crypto_aead_schwaemm256256v1_ref_decrypt':
try.c: encrypt.c:(.text+0x...): undefined reference to `initialize'
try.c: /usr/bin/ld: encrypt.c:(.text+0x...): undefined reference to `processAD'
try.c: /usr/bin/ld: encrypt.c:(.text+0x...): undefined reference to `decryptCT'
try.c: collect2: error: ld returned 1 exit status

Number of similar (compiler,implementation) pairs: 1, namely:
CompilerImplementations
gcc -march=native -mtune=native -Os -fomit-frame-pointer -fwrapv -fPIC -fPIE ref

Namespace violations

Implementation: crypto_aead/schwaemm256256v1/opt
Compiler: gcc -march=native -mtune=native -O2 -fomit-frame-pointer -fwrapv -fPIC -fPIE
sparkle_opt.o print_state_opt T
sparkle_opt.o sparkle_inv_opt T
sparkle_opt.o sparkle_opt T
sparkle_opt.o test_sparkle_opt T
util.o C_SEED R
util.o feistelSwap T
util.o load32 T
util.o pad T
util.o rho1 T
util.o rho2 T
util.o rhop1 T
util.o sparklePermutation T
util.o store32 T

Number of similar (compiler,implementation) pairs: 3, namely:
CompilerImplementations
gcc -march=native -mtune=native -O2 -fomit-frame-pointer -fwrapv -fPIC -fPIE opt
gcc -march=native -mtune=native -O3 -fomit-frame-pointer -fwrapv -fPIC -fPIE opt
gcc -march=native -mtune=native -O -fomit-frame-pointer -fwrapv -fPIC -fPIE opt

Namespace violations

Implementation: crypto_aead/schwaemm256256v1/ref
Compiler: gcc -march=native -mtune=native -O2 -fomit-frame-pointer -fwrapv -fPIC -fPIE
sparkle_ref.o linear_layer T
sparkle_ref.o linear_layer_inv T
sparkle_ref.o print_state_ref T
sparkle_ref.o sparkle_inv_ref T
sparkle_ref.o sparkle_ref T
sparkle_ref.o test_sparkle_ref T
util.o C_SEED R
util.o feistelSwap T
util.o load32 T
util.o pad T
util.o rho1 T
util.o rho2 T
util.o rhop1 T
util.o sparklePermutation T
util.o store32 T

Number of similar (compiler,implementation) pairs: 3, namely:
CompilerImplementations
gcc -march=native -mtune=native -O2 -fomit-frame-pointer -fwrapv -fPIC -fPIE ref
gcc -march=native -mtune=native -O3 -fomit-frame-pointer -fwrapv -fPIC -fPIE ref
gcc -march=native -mtune=native -O -fomit-frame-pointer -fwrapv -fPIC -fPIE ref