Implementation notes: aarch64, pi3aplus, crypto_aead/silverv1

Computer: pi3aplus
Microarchitecture: aarch64; A53 (410fd034)
Architecture: aarch64
CPU ID: 410fd034
SUPERCOP version: 20221122
Operation: crypto_aead
Primitive: silverv1
TimeObject sizeTest sizeImplementationCompilerBenchmark dateSUPERCOP version
13544524900 0 042992 864 864T:littleendoptnotaesnigcc_-march=native_-mtune=native_-O3_-fomit-frame-pointer_-fwrapv_-fPIC_-fPIE2022053120220506
14431622740 0 039567 856 848T:littleendoptnotaesnigcc_-march=native_-mtune=native_-O2_-fomit-frame-pointer_-fwrapv_-fPIC_-fPIE2022053120220506
15886424024 0 042205 768 856T:littleendoptnotaesniclang_-mcpu=native_-O3_-fomit-frame-pointer_-fwrapv_-Qunused-arguments_-fPIC_-fPIE2022053120220506
17314719212 0 037397 768 856T:anotherlittleendclang_-mcpu=native_-O3_-fomit-frame-pointer_-fwrapv_-Qunused-arguments_-fPIC_-fPIE2022053120220506
17394519744 0 037840 864 864T:anotherlittleendgcc_-march=native_-mtune=native_-O3_-fomit-frame-pointer_-fwrapv_-fPIC_-fPIE2022053120220506
18322717384 0 034223 856 848T:anotherlittleendgcc_-march=native_-mtune=native_-O2_-fomit-frame-pointer_-fwrapv_-fPIC_-fPIE2022053120220506
21613922472 0 038271 840 840T:littleendoptnotaesnigcc_-march=native_-mtune=native_-Os_-fomit-frame-pointer_-fwrapv_-fPIC_-fPIE2022053120220506
22742116892 0 032719 840 840T:anotherlittleendgcc_-march=native_-mtune=native_-Os_-fomit-frame-pointer_-fwrapv_-fPIC_-fPIE2022053120220506
30302423120 0 040127 856 848T:littleendoptnotaesnigcc_-march=native_-mtune=native_-O_-fomit-frame-pointer_-fwrapv_-fPIC_-fPIE2022053120220506
34755517528 0 034543 856 848T:anotherlittleendgcc_-march=native_-mtune=native_-O_-fomit-frame-pointer_-fwrapv_-fPIC_-fPIE2022053120220506
88667915620 0 033768 864 864T:refgcc_-march=native_-mtune=native_-O3_-fomit-frame-pointer_-fwrapv_-fPIC_-fPIE2022053120220506
112104414602 0 032757 768 856T:refclang_-mcpu=native_-O3_-fomit-frame-pointer_-fwrapv_-Qunused-arguments_-fPIC_-fPIE2022053120220506
14933938880 0 025743 856 848T:refgcc_-march=native_-mtune=native_-O2_-fomit-frame-pointer_-fwrapv_-fPIC_-fPIE2022053120220506
17550097726 0 023567 840 840T:refgcc_-march=native_-mtune=native_-Os_-fomit-frame-pointer_-fwrapv_-fPIC_-fPIE2022053120220506
18964238136 0 025167 856 848T:refgcc_-march=native_-mtune=native_-O_-fomit-frame-pointer_-fwrapv_-fPIC_-fPIE2022053120220506

Compiler output

Implementation: T:aesnioptimized
Security model: timingleaks
Compiler: clang -mcpu=native -O3 -fomit-frame-pointer -fwrapv -Qunused-arguments -fPIC -fPIE
encrypt.c: In file included from encrypt.c:36:
encrypt.c: In file included from ./macs4AESNI.h:6:
encrypt.c: In file included from /usr/lib/llvm-7/lib/clang/7.0.1/include/wmmintrin.h:27:
encrypt.c: In file included from /usr/lib/llvm-7/lib/clang/7.0.1/include/emmintrin.h:27:
encrypt.c: In file included from /usr/lib/llvm-7/lib/clang/7.0.1/include/xmmintrin.h:27:
encrypt.c: /usr/lib/llvm-7/lib/clang/7.0.1/include/mmintrin.h:64:12: error: invalid conversion between vector type '__m64' (vector of 1 'long long' value) and integer type 'int' of different size
encrypt.c: return (__m64)__builtin_ia32_vec_init_v2si(__i, 0);
encrypt.c: ^~~~~~~~~~~~~~~~~~~~~~~~~~~~~~~~~~~~~~~~~~~
encrypt.c: /usr/lib/llvm-7/lib/clang/7.0.1/include/mmintrin.h:143:12: error: invalid conversion between vector type '__m64' (vector of 1 'long long' value) and integer type 'int' of different size
encrypt.c: return (__m64)__builtin_ia32_packsswb((__v4hi)__m1, (__v4hi)__m2);
encrypt.c: ^~~~~~~~~~~~~~~~~~~~~~~~~~~~~~~~~~~~~~~~~~~~~~~~~~~~~~~~~~
encrypt.c: /usr/lib/llvm-7/lib/clang/7.0.1/include/mmintrin.h:173:12: error: invalid conversion between vector type '__m64' (vector of 1 'long long' value) and integer type 'int' of different size
encrypt.c: return (__m64)__builtin_ia32_packssdw((__v2si)__m1, (__v2si)__m2);
encrypt.c: ^~~~~~~~~~~~~~~~~~~~~~~~~~~~~~~~~~~~~~~~~~~~~~~~~~~~~~~~~~
encrypt.c: /usr/lib/llvm-7/lib/clang/7.0.1/include/mmintrin.h:203:12: error: invalid conversion between vector type '__m64' (vector of 1 'long long' value) and integer type 'int' of different size
encrypt.c: return (__m64)__builtin_ia32_packuswb((__v4hi)__m1, (__v4hi)__m2);
encrypt.c: ^~~~~~~~~~~~~~~~~~~~~~~~~~~~~~~~~~~~~~~~~~~~~~~~~~~~~~~~~~
encrypt.c: /usr/lib/llvm-7/lib/clang/7.0.1/include/mmintrin.h:230:12: error: invalid conversion between vector type '__m64' (vector of 1 'long long' value) and integer type 'int' of different size
encrypt.c: return (__m64)__builtin_ia32_punpckhbw((__v8qi)__m1, (__v8qi)__m2);
encrypt.c: ^~~~~~~~~~~~~~~~~~~~~~~~~~~~~~~~~~~~~~~~~~~~~~~~~~~~~~~~~~~
encrypt.c: /usr/lib/llvm-7/lib/clang/7.0.1/include/mmintrin.h:253:12: error: invalid conversion between vector type '__m64' (vector of 1 'long long' value) and integer type 'int' of different size
encrypt.c: return (__m64)__builtin_ia32_punpckhwd((__v4hi)__m1, (__v4hi)__m2);
encrypt.c: ^~~~~~~~~~~~~~~~~~~~~~~~~~~~~~~~~~~~~~~~~~~~~~~~~~~~~~~~~~~
encrypt.c: /usr/lib/llvm-7/lib/clang/7.0.1/include/mmintrin.h:274:12: error: invalid conversion between vector type '__m64' (vector of 1 'long long' value) and integer type 'int' of different size
encrypt.c: return (__m64)__builtin_ia32_punpckhdq((__v2si)__m1, (__v2si)__m2);
encrypt.c: ...

Number of similar (compiler,implementation) pairs: 1, namely:
CompilerImplementations
clang -mcpu=native -O3 -fomit-frame-pointer -fwrapv -Qunused-arguments -fPIC -fPIE T:aesnioptimized

Compiler output

Implementation: T:aesnioptimized
Security model: timingleaks
Compiler: gcc -march=native -mtune=native -O2 -fomit-frame-pointer -fwrapv -fPIC -fPIE
encrypt.c: In file included from encrypt.c:36:
encrypt.c: macs4AESNI.h:6:10: fatal error: wmmintrin.h: No such file or directory
encrypt.c: #include <wmmintrin.h>
encrypt.c: ^~~~~~~~~~~~~
encrypt.c: compilation terminated.

Number of similar (compiler,implementation) pairs: 4, namely:
CompilerImplementations
gcc -march=native -mtune=native -O2 -fomit-frame-pointer -fwrapv -fPIC -fPIE T:aesnioptimized
gcc -march=native -mtune=native -O3 -fomit-frame-pointer -fwrapv -fPIC -fPIE T:aesnioptimized
gcc -march=native -mtune=native -O -fomit-frame-pointer -fwrapv -fPIC -fPIE T:aesnioptimized
gcc -march=native -mtune=native -Os -fomit-frame-pointer -fwrapv -fPIC -fPIE T:aesnioptimized

Compiler output

Implementation: T:bigendoptimized
Security model: timingleaks
Compiler: clang -mcpu=native -O3 -fomit-frame-pointer -fwrapv -Qunused-arguments -fPIC -fPIE
encrypt.c: encrypt.c:28:2: error: "This code produces standard results only on BE machines"
encrypt.c: #error "This code produces standard results only on BE machines"
encrypt.c: ^
encrypt.c: 1 error generated.

Number of similar (compiler,implementation) pairs: 1, namely:
CompilerImplementations
clang -mcpu=native -O3 -fomit-frame-pointer -fwrapv -Qunused-arguments -fPIC -fPIE T:bigendoptimized

Compiler output

Implementation: T:bigendoptimized
Security model: timingleaks
Compiler: gcc -march=native -mtune=native -O2 -fomit-frame-pointer -fwrapv -fPIC -fPIE
encrypt.c: encrypt.c:28:2: error: #error "This code produces standard results only on BE machines"
encrypt.c: #error "This code produces standard results only on BE machines"
encrypt.c: ^~~~~

Number of similar (compiler,implementation) pairs: 4, namely:
CompilerImplementations
gcc -march=native -mtune=native -O2 -fomit-frame-pointer -fwrapv -fPIC -fPIE T:bigendoptimized
gcc -march=native -mtune=native -O3 -fomit-frame-pointer -fwrapv -fPIC -fPIE T:bigendoptimized
gcc -march=native -mtune=native -O -fomit-frame-pointer -fwrapv -fPIC -fPIE T:bigendoptimized
gcc -march=native -mtune=native -Os -fomit-frame-pointer -fwrapv -fPIC -fPIE T:bigendoptimized

Namespace violations

Implementation: T:anotherlittleend
Security model: timingleaks
Compiler: clang -mcpu=native -O3 -fomit-frame-pointer -fwrapv -Qunused-arguments -fPIC -fPIE
encrypt.o AES_128_KEY_EXPANSION T
encrypt.o CONVERT2DECKEY T
encrypt.o Obtain_sessionrkeys T
encrypt.o PartialBlock T
encrypt.o ProcessAD T
encrypt.o SETUPcounterLEFT T
encrypt.o TAES_DECRYPT T
encrypt.o TAES_ENCRYPT T
encrypt.o TAG T
rijndael-alg-fstplus.o INVERT T
rijndael-alg-fstplus.o rijndaelDecrypt T
rijndael-alg-fstplus.o rijndaelEncrypt T
rijndael-alg-fstplus.o rijndaelKeySetupDec T
rijndael-alg-fstplus.o rijndaelKeySetupEnc T

Number of similar (compiler,implementation) pairs: 5, namely:
CompilerImplementations
clang -mcpu=native -O3 -fomit-frame-pointer -fwrapv -Qunused-arguments -fPIC -fPIE T:anotherlittleend
gcc -march=native -mtune=native -O2 -fomit-frame-pointer -fwrapv -fPIC -fPIE T:anotherlittleend
gcc -march=native -mtune=native -O3 -fomit-frame-pointer -fwrapv -fPIC -fPIE T:anotherlittleend
gcc -march=native -mtune=native -O -fomit-frame-pointer -fwrapv -fPIC -fPIE T:anotherlittleend
gcc -march=native -mtune=native -Os -fomit-frame-pointer -fwrapv -fPIC -fPIE T:anotherlittleend

Namespace violations

Implementation: T:littleendoptnotaesni
Security model: timingleaks
Compiler: clang -mcpu=native -O3 -fomit-frame-pointer -fwrapv -Qunused-arguments -fPIC -fPIE
AES-128TS.o CONVERT2DECKEY T
AES-128TS.o INVERT T
AES-128TS.o SilverDecrypt T
AES-128TS.o SilverEncrypt T
AES-128TS.o rijndaelDecrypt T
AES-128TS.o rijndaelEncrypt T
AES-128TS.o rijndaelKeySetupEnc T
encrypt.o Obtain_sessionrkeys T
encrypt.o PartialBlock T
encrypt.o ProcessAD T
encrypt.o SETUPcounterLEFT T
encrypt.o TAG T

Number of similar (compiler,implementation) pairs: 5, namely:
CompilerImplementations
clang -mcpu=native -O3 -fomit-frame-pointer -fwrapv -Qunused-arguments -fPIC -fPIE T:littleendoptnotaesni
gcc -march=native -mtune=native -O2 -fomit-frame-pointer -fwrapv -fPIC -fPIE T:littleendoptnotaesni
gcc -march=native -mtune=native -O3 -fomit-frame-pointer -fwrapv -fPIC -fPIE T:littleendoptnotaesni
gcc -march=native -mtune=native -O -fomit-frame-pointer -fwrapv -fPIC -fPIE T:littleendoptnotaesni
gcc -march=native -mtune=native -Os -fomit-frame-pointer -fwrapv -fPIC -fPIE T:littleendoptnotaesni

Namespace violations

Implementation: T:ref
Security model: timingleaks
Compiler: clang -mcpu=native -O3 -fomit-frame-pointer -fwrapv -Qunused-arguments -fPIC -fPIE
encrypt.o LESTOREu64inbytearray T
encrypt.o NADD64 T
encrypt.o Obtain_sessionrkeys T
encrypt.o PartialBlock T
encrypt.o ProcessAD T
encrypt.o SETUPcounterLEFT T
encrypt.o TAES_DECRYPT T
encrypt.o TAES_ENCRYPT T
encrypt.o TAG T
encrypt.o XOR128 T
encrypt.o XORADD T
rijndaelEndianNeutral.o INVSBOX R
rijndaelEndianNeutral.o InvMixColumn T
rijndaelEndianNeutral.o InvShiftRowOnly T
rijndaelEndianNeutral.o SBOX R
rijndaelEndianNeutral.o ShiftRowOnly T
rijndaelEndianNeutral.o ShiftRowandMixColumn T
rijndaelEndianNeutral.o rijndaelDecrypt T
rijndaelEndianNeutral.o rijndaelEncrypt T
rijndaelEndianNeutral.o rijndaelexpandKey T

Number of similar (compiler,implementation) pairs: 5, namely:
CompilerImplementations
clang -mcpu=native -O3 -fomit-frame-pointer -fwrapv -Qunused-arguments -fPIC -fPIE T:ref
gcc -march=native -mtune=native -O2 -fomit-frame-pointer -fwrapv -fPIC -fPIE T:ref
gcc -march=native -mtune=native -O3 -fomit-frame-pointer -fwrapv -fPIC -fPIE T:ref
gcc -march=native -mtune=native -O -fomit-frame-pointer -fwrapv -fPIC -fPIE T:ref
gcc -march=native -mtune=native -Os -fomit-frame-pointer -fwrapv -fPIC -fPIE T:ref