Implementation notes: aarch64, pi3aplus, crypto_aead/pi32cipher128v2

Computer: pi3aplus
Microarchitecture: aarch64; Cortex-A53 (410fd034)
Architecture: aarch64
CPU ID: 410fd034
SUPERCOP version: 20240425
Operation: crypto_aead
Primitive: pi32cipher128v2
TimeObject sizeTest sizeImplementationCompilerBenchmark dateSUPERCOP version
13427716567 8 030272 872 864T:goptvgcc_-march=native_-mtune=native_-O3_-fomit-frame-pointer_-fwrapv_-fPIC_-fPIE2024042720240425
15781114431 8 026855 864 848T:goptvgcc_-march=native_-mtune=native_-O2_-fomit-frame-pointer_-fwrapv_-fPIC_-fPIE2024042720240425
21397415783 8 028151 864 848T:goptvgcc_-march=native_-mtune=native_-O_-fomit-frame-pointer_-fwrapv_-fPIC_-fPIE2024042720240425
2378418447 8 022141 776 856T:ref2clang_-mcpu=native_-O3_-fomit-frame-pointer_-fwrapv_-Qunused-arguments_-fPIC_-fPIE2024042720240425
2402835859 8 019565 776 856T:ref3clang_-mcpu=native_-O3_-fomit-frame-pointer_-fwrapv_-Qunused-arguments_-fPIC_-fPIE2024042720240425
3997307595 8 021264 872 864T:ref3gcc_-march=native_-mtune=native_-O3_-fomit-frame-pointer_-fwrapv_-fPIC_-fPIE2024042720240425
4691425539 8 017919 864 848T:ref3gcc_-march=native_-mtune=native_-O2_-fomit-frame-pointer_-fwrapv_-fPIC_-fPIE2024042720240425
4813407383 8 018807 848 840T:goptvgcc_-march=native_-mtune=native_-Os_-fomit-frame-pointer_-fwrapv_-fPIC_-fPIE2024042720240425
5106114343 8 015663 848 840T:ref3gcc_-march=native_-mtune=native_-Os_-fomit-frame-pointer_-fwrapv_-fPIC_-fPIE2024042720240425
6615054755 8 017103 864 848T:ref3gcc_-march=native_-mtune=native_-O_-fomit-frame-pointer_-fwrapv_-fPIC_-fPIE2024042720240425
13451667871 8 021560 872 864T:ref2gcc_-march=native_-mtune=native_-O3_-fomit-frame-pointer_-fwrapv_-fPIC_-fPIE2024042720240425
17969585535 8 017959 864 848T:ref2gcc_-march=native_-mtune=native_-O2_-fomit-frame-pointer_-fwrapv_-fPIC_-fPIE2024042720240425
22783854787 8 016119 848 840T:ref2gcc_-march=native_-mtune=native_-Os_-fomit-frame-pointer_-fwrapv_-fPIC_-fPIE2024042720240425
26867025335 8 017703 864 848T:ref2gcc_-march=native_-mtune=native_-O_-fomit-frame-pointer_-fwrapv_-fPIC_-fPIE2024042720240425

Test failure

Implementation: T:optimized_nonSSE
Security model: timingleaks
Compiler: clang -mcpu=native -O3 -fomit-frame-pointer -fwrapv -Qunused-arguments -fPIC -fPIE
error 111
crypto_aead_encrypt returns more than crypto_aead_ABYTES extra bytes

Number of similar (compiler,implementation) pairs: 8, namely:
CompilerImplementations
clang -mcpu=native -O3 -fomit-frame-pointer -fwrapv -Qunused-arguments -fPIC -fPIE T:optimized_nonSSE
gcc -march=native -mtune=native -O -fomit-frame-pointer -fwrapv -fPIC -fPIE T:optimized_nonSSE
gcc -march=native -mtune=native -Os -fomit-frame-pointer -fwrapv -fPIC -fPIE T:optimized_nonSSE
clang -mcpu=native -O3 -fomit-frame-pointer -fwrapv -Qunused-arguments -fPIC -fPIE T:ref
gcc -march=native -mtune=native -O2 -fomit-frame-pointer -fwrapv -fPIC -fPIE T:ref
gcc -march=native -mtune=native -O3 -fomit-frame-pointer -fwrapv -fPIC -fPIE T:ref
gcc -march=native -mtune=native -O -fomit-frame-pointer -fwrapv -fPIC -fPIE T:ref
gcc -march=native -mtune=native -Os -fomit-frame-pointer -fwrapv -fPIC -fPIE T:ref

Compiler output

Implementation: T:goptv
Security model: timingleaks
Compiler: clang -mcpu=native -O3 -fomit-frame-pointer -fwrapv -Qunused-arguments -fPIC -fPIE
pi-cipher.c: pi-cipher.c:286:9: error: use of unknown builtin '__builtin_shuffle' [-Wimplicit-function-declaration]
pi-cipher.c: n_t += __builtin_shuffle(y, g_mask);
pi-cipher.c: ^
pi-cipher.c: pi-cipher.c:305:9: error: use of unknown builtin '__builtin_shuffle' [-Wimplicit-function-declaration]
pi-cipher.c: m_t += __builtin_shuffle(x, g_mask);
pi-cipher.c: ^
pi-cipher.c: pi-cipher.c:354:9: error: use of unknown builtin '__builtin_shuffle' [-Wimplicit-function-declaration]
pi-cipher.c: m_t += __builtin_shuffle(x, g_mask);
pi-cipher.c: ^
pi-cipher.c: 3 errors generated.

Number of similar (compiler,implementation) pairs: 1, namely:
CompilerImplementations
clang -mcpu=native -O3 -fomit-frame-pointer -fwrapv -Qunused-arguments -fPIC -fPIE T:goptv

Compiler output

Implementation: T:optimized_nonSSE
Security model: timingleaks
Compiler: gcc -march=native -mtune=native -O2 -fomit-frame-pointer -fwrapv -fPIC -fPIE
encrypt.c: gcc: fatal error: Killed signal terminated program cc1
encrypt.c: compilation terminated.

Number of similar (compiler,implementation) pairs: 2, namely:
CompilerImplementations
gcc -march=native -mtune=native -O2 -fomit-frame-pointer -fwrapv -fPIC -fPIE T:optimized_nonSSE
gcc -march=native -mtune=native -O3 -fomit-frame-pointer -fwrapv -fPIC -fPIE T:optimized_nonSSE

Namespace violations

Implementation: T:goptv
Security model: timingleaks
Compiler: gcc -march=native -mtune=native -O2 -fomit-frame-pointer -fwrapv -fPIC -fPIE
pi-cipher.o PI_DECRYPT_BLOCK_Q T
pi-cipher.o pi32_decrypt_block T
pi-cipher.o pi32_decrypt_last_block T
pi-cipher.o pi32_decrypt_simple T
pi-cipher.o pi32_decrypt_smn T
pi-cipher.o pi32_encrypt_block T
pi-cipher.o pi32_encrypt_block_q T
pi-cipher.o pi32_encrypt_last_block T
pi-cipher.o pi32_encrypt_simple T
pi-cipher.o pi32_encrypt_smn T
pi-cipher.o pi32_extract_tag T
pi-cipher.o pi32_init T
pi-cipher.o pi32_process_ad_block T
pi-cipher.o pi32_process_ad_block_q T
pi-cipher.o pi32_process_ad_last_block T
pi-cipher.o pi_cipher_name D

Number of similar (compiler,implementation) pairs: 4, namely:
CompilerImplementations
gcc -march=native -mtune=native -O2 -fomit-frame-pointer -fwrapv -fPIC -fPIE T:goptv
gcc -march=native -mtune=native -O3 -fomit-frame-pointer -fwrapv -fPIC -fPIE T:goptv
gcc -march=native -mtune=native -O -fomit-frame-pointer -fwrapv -fPIC -fPIE T:goptv
gcc -march=native -mtune=native -Os -fomit-frame-pointer -fwrapv -fPIC -fPIE T:goptv

Namespace violations

Implementation: T:ref2
Security model: timingleaks
Compiler: clang -mcpu=native -O3 -fomit-frame-pointer -fwrapv -Qunused-arguments -fPIC -fPIE
pi-cipher.o pi32_decrypt_block T
pi-cipher.o pi32_decrypt_last_block T
pi-cipher.o pi32_decrypt_simple T
pi-cipher.o pi32_decrypt_smn T
pi-cipher.o pi32_encrypt_block T
pi-cipher.o pi32_encrypt_last_block T
pi-cipher.o pi32_encrypt_simple T
pi-cipher.o pi32_extract_tag T
pi-cipher.o pi32_init T
pi-cipher.o pi32_process_ad_block T
pi-cipher.o pi32_process_ad_last_block T
pi-cipher.o pi32_process_smn T
pi-cipher.o pi_cipher_name D

Number of similar (compiler,implementation) pairs: 5, namely:
CompilerImplementations
clang -mcpu=native -O3 -fomit-frame-pointer -fwrapv -Qunused-arguments -fPIC -fPIE T:ref2
gcc -march=native -mtune=native -O2 -fomit-frame-pointer -fwrapv -fPIC -fPIE T:ref2
gcc -march=native -mtune=native -O3 -fomit-frame-pointer -fwrapv -fPIC -fPIE T:ref2
gcc -march=native -mtune=native -O -fomit-frame-pointer -fwrapv -fPIC -fPIE T:ref2
gcc -march=native -mtune=native -Os -fomit-frame-pointer -fwrapv -fPIC -fPIE T:ref2

Namespace violations

Implementation: T:ref3
Security model: timingleaks
Compiler: clang -mcpu=native -O3 -fomit-frame-pointer -fwrapv -Qunused-arguments -fPIC -fPIE
pi-cipher.o pi32_decrypt_block T
pi-cipher.o pi32_decrypt_last_block T
pi-cipher.o pi32_decrypt_simple T
pi-cipher.o pi32_decrypt_smn T
pi-cipher.o pi32_encrypt_block T
pi-cipher.o pi32_encrypt_last_block T
pi-cipher.o pi32_encrypt_simple T
pi-cipher.o pi32_encrypt_smn T
pi-cipher.o pi32_extract_tag T
pi-cipher.o pi32_init T
pi-cipher.o pi32_process_ad_block T
pi-cipher.o pi32_process_ad_last_block T
pi-cipher.o pi_cipher_name D

Number of similar (compiler,implementation) pairs: 5, namely:
CompilerImplementations
clang -mcpu=native -O3 -fomit-frame-pointer -fwrapv -Qunused-arguments -fPIC -fPIE T:ref3
gcc -march=native -mtune=native -O2 -fomit-frame-pointer -fwrapv -fPIC -fPIE T:ref3
gcc -march=native -mtune=native -O3 -fomit-frame-pointer -fwrapv -fPIC -fPIE T:ref3
gcc -march=native -mtune=native -O -fomit-frame-pointer -fwrapv -fPIC -fPIE T:ref3
gcc -march=native -mtune=native -Os -fomit-frame-pointer -fwrapv -fPIC -fPIE T:ref3