Implementation notes: aarch64, pi3aplus, crypto_aead/ascon128av12

Computer: pi3aplus
Microarchitecture: aarch64; A53 (410fd034)
Architecture: aarch64
CPU ID: 410fd034
SUPERCOP version: 20221122
Operation: crypto_aead
Primitive: ascon128av12
TimeObject sizeTest sizeImplementationCompilerBenchmark dateSUPERCOP version
4699312668 0 025896 864 864opt64gcc_-march=native_-mtune=native_-O3_-fomit-frame-pointer_-fwrapv_-fPIC_-fPIE2022112320221122
4699812676 0 024607 856 848opt64gcc_-march=native_-mtune=native_-O2_-fomit-frame-pointer_-fwrapv_-fPIC_-fPIE2022112320221122
4769711916 0 025621 768 856opt64clang_-mcpu=native_-O3_-fomit-frame-pointer_-fwrapv_-Qunused-arguments_-fPIC_-fPIE2022112320221122
4896712600 0 023751 840 840opt64gcc_-march=native_-mtune=native_-Os_-fomit-frame-pointer_-fwrapv_-fPIC_-fPIE2022112320221122
5262016364 0 029949 768 856refclang_-mcpu=native_-O3_-fomit-frame-pointer_-fwrapv_-Qunused-arguments_-fPIC_-fPIE2022112320221122
5888414060 0 027765 768 856opt32clang_-mcpu=native_-O3_-fomit-frame-pointer_-fwrapv_-Qunused-arguments_-fPIC_-fPIE2022112320221122
5947720276 0 033520 864 864refgcc_-march=native_-mtune=native_-O3_-fomit-frame-pointer_-fwrapv_-fPIC_-fPIE2022112320221122
6286516432 0 029664 864 864opt32gcc_-march=native_-mtune=native_-O3_-fomit-frame-pointer_-fwrapv_-fPIC_-fPIE2022112320221122
6289316440 0 028367 856 848opt32gcc_-march=native_-mtune=native_-O2_-fomit-frame-pointer_-fwrapv_-fPIC_-fPIE2022112320221122
6471516360 0 027519 840 840opt32gcc_-march=native_-mtune=native_-Os_-fomit-frame-pointer_-fwrapv_-fPIC_-fPIE2022112320221122
661451700 0 014912 864 864opt64_lowsizegcc_-march=native_-mtune=native_-O3_-fomit-frame-pointer_-fwrapv_-fPIC_-fPIE2022112320221122
705971476 0 013407 856 848opt64_lowsizegcc_-march=native_-mtune=native_-O2_-fomit-frame-pointer_-fwrapv_-fPIC_-fPIE2022112320221122
737801488 0 015213 768 856opt64_lowsizeclang_-mcpu=native_-O3_-fomit-frame-pointer_-fwrapv_-Qunused-arguments_-fPIC_-fPIE2022112320221122
744261456 0 012583 840 840opt64_lowsizegcc_-march=native_-mtune=native_-Os_-fomit-frame-pointer_-fwrapv_-fPIC_-fPIE2022112320221122
828631744 0 014960 864 864opt32_lowsizegcc_-march=native_-mtune=native_-O3_-fomit-frame-pointer_-fwrapv_-fPIC_-fPIE2022112320221122
834801512 0 015229 768 856opt32_lowsizeclang_-mcpu=native_-O3_-fomit-frame-pointer_-fwrapv_-Qunused-arguments_-fPIC_-fPIE2022112320221122
862611520 0 013455 856 848opt32_lowsizegcc_-march=native_-mtune=native_-O2_-fomit-frame-pointer_-fwrapv_-fPIC_-fPIE2022112320221122
8824115680 0 027807 856 848opt64gcc_-march=native_-mtune=native_-O_-fomit-frame-pointer_-fwrapv_-fPIC_-fPIE2022112320221122
928681500 0 012615 840 840opt32_lowsizegcc_-march=native_-mtune=native_-Os_-fomit-frame-pointer_-fwrapv_-fPIC_-fPIE2022112320221122
9696719640 0 031775 856 848opt32gcc_-march=native_-mtune=native_-O_-fomit-frame-pointer_-fwrapv_-fPIC_-fPIE2022112320221122
1022372268 0 014367 856 848opt64_lowsizegcc_-march=native_-mtune=native_-O_-fomit-frame-pointer_-fwrapv_-fPIC_-fPIE2022112320221122
10275216372 0 028311 856 848refgcc_-march=native_-mtune=native_-O2_-fomit-frame-pointer_-fwrapv_-fPIC_-fPIE2022112320221122
1053142312 0 014415 856 848opt32_lowsizegcc_-march=native_-mtune=native_-O_-fomit-frame-pointer_-fwrapv_-fPIC_-fPIE2022112320221122
13735117580 0 029719 856 848refgcc_-march=native_-mtune=native_-O_-fomit-frame-pointer_-fwrapv_-fPIC_-fPIE2022112320221122
17814114656 0 026599 864 848bi32gcc_-march=native_-mtune=native_-O2_-fomit-frame-pointer_-fwrapv_-fPIC_-fPIE2022112320221122
18460014648 0 027896 872 864bi32gcc_-march=native_-mtune=native_-O3_-fomit-frame-pointer_-fwrapv_-fPIC_-fPIE2022112320221122
1884549100 0 021143 872 848bi32_lowreggcc_-march=native_-mtune=native_-O2_-fomit-frame-pointer_-fwrapv_-fPIC_-fPIE2022112320221122
1927152444 0 013631 840 840refgcc_-march=native_-mtune=native_-Os_-fomit-frame-pointer_-fwrapv_-fPIC_-fPIE2022112320221122
20177413960 0 027645 776 856bi32clang_-mcpu=native_-O3_-fomit-frame-pointer_-fwrapv_-Qunused-arguments_-fPIC_-fPIE2022112320221122
2124748876 0 022208 880 864bi32_lowreggcc_-march=native_-mtune=native_-O3_-fomit-frame-pointer_-fwrapv_-fPIC_-fPIE2022112320221122
2128922312 0 014255 864 848bi32_lowsizegcc_-march=native_-mtune=native_-O2_-fomit-frame-pointer_-fwrapv_-fPIC_-fPIE2022112320221122
2173002572 0 015800 872 864bi32_lowsizegcc_-march=native_-mtune=native_-O3_-fomit-frame-pointer_-fwrapv_-fPIC_-fPIE2022112320221122
2304988892 0 022605 784 856bi32_lowregclang_-mcpu=native_-O3_-fomit-frame-pointer_-fwrapv_-Qunused-arguments_-fPIC_-fPIE2022112320221122
23615514616 0 025751 848 840bi32gcc_-march=native_-mtune=native_-Os_-fomit-frame-pointer_-fwrapv_-fPIC_-fPIE2022112320221122
2383512180 0 015901 776 856bi32_lowsizeclang_-mcpu=native_-O3_-fomit-frame-pointer_-fwrapv_-Qunused-arguments_-fPIC_-fPIE2022112320221122
33655418412 0 030543 864 848bi32gcc_-march=native_-mtune=native_-O_-fomit-frame-pointer_-fwrapv_-fPIC_-fPIE2022112320221122
3544068644 0 019895 856 840bi32_lowreggcc_-march=native_-mtune=native_-Os_-fomit-frame-pointer_-fwrapv_-fPIC_-fPIE2022112320221122
3729162172 0 013287 848 840bi32_lowsizegcc_-march=native_-mtune=native_-Os_-fomit-frame-pointer_-fwrapv_-fPIC_-fPIE2022112320221122
43307011564 0 023799 872 848bi32_lowreggcc_-march=native_-mtune=native_-O_-fomit-frame-pointer_-fwrapv_-fPIC_-fPIE2022112320221122
4427402416 0 014543 864 848bi32_lowsizegcc_-march=native_-mtune=native_-O_-fomit-frame-pointer_-fwrapv_-fPIC_-fPIE2022112320221122
6305817808 0 020664 872 864bi8gcc_-march=native_-mtune=native_-O3_-fomit-frame-pointer_-fwrapv_-fPIC_-fPIE2022112320221122
6330557608 0 019327 864 848bi8gcc_-march=native_-mtune=native_-O2_-fomit-frame-pointer_-fwrapv_-fPIC_-fPIE2022112320221122
6543196820 0 020213 776 856bi8clang_-mcpu=native_-O3_-fomit-frame-pointer_-fwrapv_-Qunused-arguments_-fPIC_-fPIE2022112320221122
7944336640 0 020317 768 856opt8clang_-mcpu=native_-O3_-fomit-frame-pointer_-fwrapv_-Qunused-arguments_-fPIC_-fPIE2022112320221122
7986077572 0 021285 768 856opt8_lowsizeclang_-mcpu=native_-O3_-fomit-frame-pointer_-fwrapv_-Qunused-arguments_-fPIC_-fPIE2022112320221122
9370067480 0 020752 864 864opt8gcc_-march=native_-mtune=native_-O3_-fomit-frame-pointer_-fwrapv_-fPIC_-fPIE2022112320221122
9374207344 0 020584 864 864opt8_lowsizegcc_-march=native_-mtune=native_-O3_-fomit-frame-pointer_-fwrapv_-fPIC_-fPIE2022112320221122
11271244204 0 016191 856 848opt8gcc_-march=native_-mtune=native_-O2_-fomit-frame-pointer_-fwrapv_-fPIC_-fPIE2022112320221122
11312553968 0 015935 856 848opt8_lowsizegcc_-march=native_-mtune=native_-O2_-fomit-frame-pointer_-fwrapv_-fPIC_-fPIE2022112320221122
12000026632 0 017551 848 840bi8gcc_-march=native_-mtune=native_-Os_-fomit-frame-pointer_-fwrapv_-fPIC_-fPIE2022112320221122
131659410784 0 022519 864 848bi8gcc_-march=native_-mtune=native_-O_-fomit-frame-pointer_-fwrapv_-fPIC_-fPIE2022112320221122
16918943784 0 014967 840 840opt8gcc_-march=native_-mtune=native_-Os_-fomit-frame-pointer_-fwrapv_-fPIC_-fPIE2022112320221122
17003003604 0 014759 840 840opt8_lowsizegcc_-march=native_-mtune=native_-Os_-fomit-frame-pointer_-fwrapv_-fPIC_-fPIE2022112320221122
18830503744 0 015895 856 848opt8_lowsizegcc_-march=native_-mtune=native_-O_-fomit-frame-pointer_-fwrapv_-fPIC_-fPIE2022112320221122
19026883928 0 016095 856 848opt8gcc_-march=native_-mtune=native_-O_-fomit-frame-pointer_-fwrapv_-fPIC_-fPIE2022112320221122

Compiler output

Implementation: armv6
Security model: constbranchindex
Compiler: clang -mcpu=native -O3 -fomit-frame-pointer -fwrapv -Qunused-arguments -fPIC -fPIE
aead.c: In file included from aead.c:4:
aead.c: In file included from ./permutations.h:11:
aead.c: ./round.h:96:44: warning: value size does not match register size specified by the constraint and modifier [-Wasm-operand-widths]
aead.c: [x1_h] "+r"(s->w[1][1]), [x2_l] "+r"(s->w[2][0]), [x2_h] "+r"(s->w[2][1]),
aead.c: ^
aead.c: ./round.h:14:12: note: use constraint modifier "w"
aead.c: "eor %[x2_l], %[x2_l], %[C]\n\t"
aead.c: ^~~~~~~
aead.c: %w[x2_l]
aead.c: ./round.h:96:44: warning: value size does not match register size specified by the constraint and modifier [-Wasm-operand-widths]
aead.c: [x1_h] "+r"(s->w[1][1]), [x2_l] "+r"(s->w[2][0]), [x2_h] "+r"(s->w[2][1]),
aead.c: ^
aead.c: ./round.h:14:21: note: use constraint modifier "w"
aead.c: "eor %[x2_l], %[x2_l], %[C]\n\t"
aead.c: ^~~~~~~
aead.c: %w[x2_l]
aead.c: ./round.h:98:41: warning: value size does not match register size specified by the constraint and modifier [-Wasm-operand-widths]
aead.c: [x4_h] "+r"(s->w[4][1]), [C] "+r"(C), [tmp0] "=r"(tmp0), [tmp1] "=r"(tmp1)
aead.c: ^
aead.c: ./round.h:14:30: note: use constraint modifier "w"
aead.c: "eor %[x2_l], %[x2_l], %[C]\n\t"
aead.c: ^~~~
aead.c: %w[C]
aead.c: ./round.h:95:19: warning: value size does not match register size specified by the constraint and modifier [-Wasm-operand-widths]
aead.c: [x0_l] "+r"(s->w[0][0]), [x0_h] "+r"(s->w[0][1]), [x1_l] "+r"(s->w[1][0]),
aead.c: ...

Number of similar (compiler,implementation) pairs: 1, namely:
CompilerImplementations
clang -mcpu=native -O3 -fomit-frame-pointer -fwrapv -Qunused-arguments -fPIC -fPIE armv6

Compiler output

Implementation: armv6
Security model: constbranchindex
Compiler: gcc -march=native -mtune=native -O2 -fomit-frame-pointer -fwrapv -fPIC -fPIE
permutations.c: /tmp/ccVXWOcd.s: Assembler messages:
permutations.c: /tmp/ccVXWOcd.s:124: Error: immediate out of range at operand 3 -- `eor x13,x13,225'
permutations.c: /tmp/ccVXWOcd.s:222: Error: immediate out of range at operand 3 -- `eor x13,x13,210'
permutations.c: /tmp/ccVXWOcd.s:320: Error: immediate out of range at operand 3 -- `eor x13,x13,195'
permutations.c: /tmp/ccVXWOcd.s:418: Error: immediate out of range at operand 3 -- `eor x13,x13,180'
permutations.c: /tmp/ccVXWOcd.s:516: Error: immediate out of range at operand 3 -- `eor x13,x13,165'
permutations.c: /tmp/ccVXWOcd.s:614: Error: immediate out of range at operand 3 -- `eor x13,x13,150'
permutations.c: /tmp/ccVXWOcd.s:712: Error: immediate out of range at operand 3 -- `eor x13,x13,135'
permutations.c: /tmp/ccVXWOcd.s:908: Error: immediate out of range at operand 3 -- `eor x13,x13,105'
permutations.c: /tmp/ccVXWOcd.s:1006: Error: immediate out of range at operand 3 -- `eor x13,x13,90'
permutations.c: /tmp/ccVXWOcd.s:1104: Error: immediate out of range at operand 3 -- `eor x13,x13,75'
permutations.c: /tmp/ccVXWOcd.s:1219: Error: immediate out of range at operand 3 -- `eor x13,x13,180'
permutations.c: /tmp/ccVXWOcd.s:1317: Error: immediate out of range at operand 3 -- `eor x13,x13,165'
permutations.c: /tmp/ccVXWOcd.s:1415: Error: immediate out of range at operand 3 -- `eor x13,x13,150'
permutations.c: /tmp/ccVXWOcd.s:1513: Error: immediate out of range at operand 3 -- `eor x13,x13,135'
permutations.c: /tmp/ccVXWOcd.s:1709: Error: immediate out of range at operand 3 -- `eor x13,x13,105'
permutations.c: /tmp/ccVXWOcd.s:1807: Error: immediate out of range at operand 3 -- `eor x13,x13,90'
permutations.c: /tmp/ccVXWOcd.s:1905: Error: immediate out of range at operand 3 -- `eor x13,x13,75'

Number of similar (compiler,implementation) pairs: 1, namely:
CompilerImplementations
gcc -march=native -mtune=native -O2 -fomit-frame-pointer -fwrapv -fPIC -fPIE armv6

Compiler output

Implementation: armv6
Security model: constbranchindex
Compiler: gcc -march=native -mtune=native -O3 -fomit-frame-pointer -fwrapv -fPIC -fPIE
permutations.c: /tmp/cc1bMNJc.s: Assembler messages:
permutations.c: /tmp/cc1bMNJc.s:124: Error: immediate out of range at operand 3 -- `eor x13,x13,225'
permutations.c: /tmp/cc1bMNJc.s:222: Error: immediate out of range at operand 3 -- `eor x13,x13,210'
permutations.c: /tmp/cc1bMNJc.s:320: Error: immediate out of range at operand 3 -- `eor x13,x13,195'
permutations.c: /tmp/cc1bMNJc.s:418: Error: immediate out of range at operand 3 -- `eor x13,x13,180'
permutations.c: /tmp/cc1bMNJc.s:516: Error: immediate out of range at operand 3 -- `eor x13,x13,165'
permutations.c: /tmp/cc1bMNJc.s:614: Error: immediate out of range at operand 3 -- `eor x13,x13,150'
permutations.c: /tmp/cc1bMNJc.s:712: Error: immediate out of range at operand 3 -- `eor x13,x13,135'
permutations.c: /tmp/cc1bMNJc.s:908: Error: immediate out of range at operand 3 -- `eor x13,x13,105'
permutations.c: /tmp/cc1bMNJc.s:1006: Error: immediate out of range at operand 3 -- `eor x13,x13,90'
permutations.c: /tmp/cc1bMNJc.s:1104: Error: immediate out of range at operand 3 -- `eor x13,x13,75'
permutations.c: /tmp/cc1bMNJc.s:1219: Error: immediate out of range at operand 3 -- `eor x13,x13,180'
permutations.c: /tmp/cc1bMNJc.s:1317: Error: immediate out of range at operand 3 -- `eor x13,x13,165'
permutations.c: /tmp/cc1bMNJc.s:1415: Error: immediate out of range at operand 3 -- `eor x13,x13,150'
permutations.c: /tmp/cc1bMNJc.s:1513: Error: immediate out of range at operand 3 -- `eor x13,x13,135'
permutations.c: /tmp/cc1bMNJc.s:1709: Error: immediate out of range at operand 3 -- `eor x13,x13,105'
permutations.c: /tmp/cc1bMNJc.s:1807: Error: immediate out of range at operand 3 -- `eor x13,x13,90'
permutations.c: /tmp/cc1bMNJc.s:1905: Error: immediate out of range at operand 3 -- `eor x13,x13,75'

Number of similar (compiler,implementation) pairs: 1, namely:
CompilerImplementations
gcc -march=native -mtune=native -O3 -fomit-frame-pointer -fwrapv -fPIC -fPIE armv6

Compiler output

Implementation: armv6
Security model: constbranchindex
Compiler: gcc -march=native -mtune=native -O -fomit-frame-pointer -fwrapv -fPIC -fPIE
permutations.c: /tmp/ccOku73Z.s: Assembler messages:
permutations.c: /tmp/ccOku73Z.s:125: Error: immediate out of range at operand 3 -- `eor x13,x13,225'
permutations.c: /tmp/ccOku73Z.s:223: Error: immediate out of range at operand 3 -- `eor x13,x13,210'
permutations.c: /tmp/ccOku73Z.s:321: Error: immediate out of range at operand 3 -- `eor x13,x13,195'
permutations.c: /tmp/ccOku73Z.s:419: Error: immediate out of range at operand 3 -- `eor x13,x13,180'
permutations.c: /tmp/ccOku73Z.s:517: Error: immediate out of range at operand 3 -- `eor x13,x13,165'
permutations.c: /tmp/ccOku73Z.s:615: Error: immediate out of range at operand 3 -- `eor x13,x13,150'
permutations.c: /tmp/ccOku73Z.s:713: Error: immediate out of range at operand 3 -- `eor x13,x13,135'
permutations.c: /tmp/ccOku73Z.s:909: Error: immediate out of range at operand 3 -- `eor x13,x13,105'
permutations.c: /tmp/ccOku73Z.s:1007: Error: immediate out of range at operand 3 -- `eor x13,x13,90'
permutations.c: /tmp/ccOku73Z.s:1105: Error: immediate out of range at operand 3 -- `eor x13,x13,75'
permutations.c: /tmp/ccOku73Z.s:1223: Error: immediate out of range at operand 3 -- `eor x8,x8,180'
permutations.c: /tmp/ccOku73Z.s:1321: Error: immediate out of range at operand 3 -- `eor x13,x13,165'
permutations.c: /tmp/ccOku73Z.s:1419: Error: immediate out of range at operand 3 -- `eor x13,x13,150'
permutations.c: /tmp/ccOku73Z.s:1517: Error: immediate out of range at operand 3 -- `eor x13,x13,135'
permutations.c: /tmp/ccOku73Z.s:1713: Error: immediate out of range at operand 3 -- `eor x13,x13,105'
permutations.c: /tmp/ccOku73Z.s:1811: Error: immediate out of range at operand 3 -- `eor x13,x13,90'
permutations.c: /tmp/ccOku73Z.s:1909: Error: immediate out of range at operand 3 -- `eor x13,x13,75'

Number of similar (compiler,implementation) pairs: 1, namely:
CompilerImplementations
gcc -march=native -mtune=native -O -fomit-frame-pointer -fwrapv -fPIC -fPIE armv6

Compiler output

Implementation: armv6
Security model: constbranchindex
Compiler: gcc -march=native -mtune=native -Os -fomit-frame-pointer -fwrapv -fPIC -fPIE
permutations.c: /tmp/ccOJtbYQ.s: Assembler messages:
permutations.c: /tmp/ccOJtbYQ.s:123: Error: immediate out of range at operand 3 -- `eor x13,x13,225'
permutations.c: /tmp/ccOJtbYQ.s:221: Error: immediate out of range at operand 3 -- `eor x13,x13,210'
permutations.c: /tmp/ccOJtbYQ.s:319: Error: immediate out of range at operand 3 -- `eor x13,x13,195'
permutations.c: /tmp/ccOJtbYQ.s:417: Error: immediate out of range at operand 3 -- `eor x13,x13,180'
permutations.c: /tmp/ccOJtbYQ.s:515: Error: immediate out of range at operand 3 -- `eor x13,x13,165'
permutations.c: /tmp/ccOJtbYQ.s:613: Error: immediate out of range at operand 3 -- `eor x13,x13,150'
permutations.c: /tmp/ccOJtbYQ.s:711: Error: immediate out of range at operand 3 -- `eor x13,x13,135'
permutations.c: /tmp/ccOJtbYQ.s:907: Error: immediate out of range at operand 3 -- `eor x13,x13,105'
permutations.c: /tmp/ccOJtbYQ.s:1005: Error: immediate out of range at operand 3 -- `eor x13,x13,90'
permutations.c: /tmp/ccOJtbYQ.s:1103: Error: immediate out of range at operand 3 -- `eor x13,x13,75'
permutations.c: /tmp/ccOJtbYQ.s:1217: Error: immediate out of range at operand 3 -- `eor x13,x13,180'
permutations.c: /tmp/ccOJtbYQ.s:1315: Error: immediate out of range at operand 3 -- `eor x13,x13,165'
permutations.c: /tmp/ccOJtbYQ.s:1413: Error: immediate out of range at operand 3 -- `eor x13,x13,150'
permutations.c: /tmp/ccOJtbYQ.s:1511: Error: immediate out of range at operand 3 -- `eor x13,x13,135'
permutations.c: /tmp/ccOJtbYQ.s:1707: Error: immediate out of range at operand 3 -- `eor x13,x13,105'
permutations.c: /tmp/ccOJtbYQ.s:1805: Error: immediate out of range at operand 3 -- `eor x13,x13,90'
permutations.c: /tmp/ccOJtbYQ.s:1903: Error: immediate out of range at operand 3 -- `eor x13,x13,75'

Number of similar (compiler,implementation) pairs: 1, namely:
CompilerImplementations
gcc -march=native -mtune=native -Os -fomit-frame-pointer -fwrapv -fPIC -fPIE armv6

Compiler output

Implementation: armv6_lowsize
Security model: constbranchindex
Compiler: clang -mcpu=native -O3 -fomit-frame-pointer -fwrapv -Qunused-arguments -fPIC -fPIE
aead.c: In file included from aead.c:3:
aead.c: In file included from ./permutations.h:11:
aead.c: ./round.h:96:44: warning: value size does not match register size specified by the constraint and modifier [-Wasm-operand-widths]
aead.c: [x1_h] "+r"(s->w[1][1]), [x2_l] "+r"(s->w[2][0]), [x2_h] "+r"(s->w[2][1]),
aead.c: ^
aead.c: ./round.h:14:12: note: use constraint modifier "w"
aead.c: "eor %[x2_l], %[x2_l], %[C]\n\t"
aead.c: ^~~~~~~
aead.c: %w[x2_l]
aead.c: ./round.h:96:44: warning: value size does not match register size specified by the constraint and modifier [-Wasm-operand-widths]
aead.c: [x1_h] "+r"(s->w[1][1]), [x2_l] "+r"(s->w[2][0]), [x2_h] "+r"(s->w[2][1]),
aead.c: ^
aead.c: ./round.h:14:21: note: use constraint modifier "w"
aead.c: "eor %[x2_l], %[x2_l], %[C]\n\t"
aead.c: ^~~~~~~
aead.c: %w[x2_l]
aead.c: ./round.h:98:41: warning: value size does not match register size specified by the constraint and modifier [-Wasm-operand-widths]
aead.c: [x4_h] "+r"(s->w[4][1]), [C] "+r"(C), [tmp0] "=r"(tmp0), [tmp1] "=r"(tmp1)
aead.c: ^
aead.c: ./round.h:14:30: note: use constraint modifier "w"
aead.c: "eor %[x2_l], %[x2_l], %[C]\n\t"
aead.c: ^~~~
aead.c: %w[C]
aead.c: ./round.h:95:19: warning: value size does not match register size specified by the constraint and modifier [-Wasm-operand-widths]
aead.c: [x0_l] "+r"(s->w[0][0]), [x0_h] "+r"(s->w[0][1]), [x1_l] "+r"(s->w[1][0]),
aead.c: ...

Number of similar (compiler,implementation) pairs: 1, namely:
CompilerImplementations
clang -mcpu=native -O3 -fomit-frame-pointer -fwrapv -Qunused-arguments -fPIC -fPIE armv6_lowsize

Compiler output

Implementation: armv6_lowsize
Security model: constbranchindex
Compiler: gcc -march=native -mtune=native -O2 -fomit-frame-pointer -fwrapv -fPIC -fPIE
permutations.c: /tmp/ccUHrh9P.s: Assembler messages:
permutations.c: /tmp/ccUHrh9P.s:100: Error: operand 2 must be an integer or stack pointer register -- `sub x1,#15'

Number of similar (compiler,implementation) pairs: 1, namely:
CompilerImplementations
gcc -march=native -mtune=native -O2 -fomit-frame-pointer -fwrapv -fPIC -fPIE armv6_lowsize

Compiler output

Implementation: armv6_lowsize
Security model: constbranchindex
Compiler: gcc -march=native -mtune=native -O3 -fomit-frame-pointer -fwrapv -fPIC -fPIE
permutations.c: /tmp/ccqvUYvb.s: Assembler messages:
permutations.c: /tmp/ccqvUYvb.s:100: Error: operand 2 must be an integer or stack pointer register -- `sub x1,#15'

Number of similar (compiler,implementation) pairs: 1, namely:
CompilerImplementations
gcc -march=native -mtune=native -O3 -fomit-frame-pointer -fwrapv -fPIC -fPIE armv6_lowsize

Compiler output

Implementation: armv6_lowsize
Security model: constbranchindex
Compiler: gcc -march=native -mtune=native -O -fomit-frame-pointer -fwrapv -fPIC -fPIE
permutations.c: /tmp/ccN2ztTH.s: Assembler messages:
permutations.c: /tmp/ccN2ztTH.s:104: Error: operand 2 must be an integer or stack pointer register -- `sub x1,#15'

Number of similar (compiler,implementation) pairs: 1, namely:
CompilerImplementations
gcc -march=native -mtune=native -O -fomit-frame-pointer -fwrapv -fPIC -fPIE armv6_lowsize

Compiler output

Implementation: armv6_lowsize
Security model: constbranchindex
Compiler: gcc -march=native -mtune=native -Os -fomit-frame-pointer -fwrapv -fPIC -fPIE
permutations.c: /tmp/ccrvRBLf.s: Assembler messages:
permutations.c: /tmp/ccrvRBLf.s:99: Error: operand 2 must be an integer or stack pointer register -- `sub x1,#15'

Number of similar (compiler,implementation) pairs: 1, namely:
CompilerImplementations
gcc -march=native -mtune=native -Os -fomit-frame-pointer -fwrapv -fPIC -fPIE armv6_lowsize

Compiler output

Implementation: armv6m
Security model: constbranchindex
Compiler: clang -mcpu=native -O3 -fomit-frame-pointer -fwrapv -Qunused-arguments -fPIC -fPIE
aead.c: In file included from aead.c:4:
aead.c: In file included from ./permutations.h:11:
aead.c: ./round.h:173:14: error: invalid output constraint '+l' in asm
aead.c: [x0_l] "+l"(s->w[0][0]), [x0_h] "+h"(s->w[0][1]), [x1_l] "+l"(s->w[1][0]),
aead.c: ^
aead.c: ./round.h:338:14: error: invalid output constraint '+l' in asm
aead.c: [x0_l] "+l"(s->w[0][0]), [x0_h] "+h"(s->w[0][1]), [x1_l] "+l"(s->w[1][0]),
aead.c: ^
aead.c: 2 errors generated.

Number of similar (compiler,implementation) pairs: 1, namely:
CompilerImplementations
clang -mcpu=native -O3 -fomit-frame-pointer -fwrapv -Qunused-arguments -fPIC -fPIE armv6m

Compiler output

Implementation: armv6m
Security model: constbranchindex
Compiler: gcc -march=native -mtune=native -O2 -fomit-frame-pointer -fwrapv -fPIC -fPIE
aead.c: In file included from permutations.h:11,
aead.c: from aead.c:4:
aead.c: aead.c: In function 'crypto_aead_ascon128av12_armv6m_constbranchindex_encrypt':
aead.c: round.h:12:3: error: impossible constraint in 'asm'
aead.c: __asm__ __volatile__(
aead.c: ^~~~~~~
aead.c: round.h:12:3: error: impossible constraint in 'asm'
aead.c: __asm__ __volatile__(
aead.c: ^~~~~~~
aead.c: round.h:12:3: error: impossible constraint in 'asm'
aead.c: __asm__ __volatile__(
aead.c: ^~~~~~~
aead.c: round.h:12:3: error: impossible constraint in 'asm'
aead.c: __asm__ __volatile__(
aead.c: ^~~~~~~
aead.c: round.h:12:3: error: impossible constraint in 'asm'
aead.c: __asm__ __volatile__(
aead.c: ^~~~~~~

Number of similar (compiler,implementation) pairs: 4, namely:
CompilerImplementations
gcc -march=native -mtune=native -O2 -fomit-frame-pointer -fwrapv -fPIC -fPIE armv6m
gcc -march=native -mtune=native -O3 -fomit-frame-pointer -fwrapv -fPIC -fPIE armv6m
gcc -march=native -mtune=native -O -fomit-frame-pointer -fwrapv -fPIC -fPIE armv6m
gcc -march=native -mtune=native -Os -fomit-frame-pointer -fwrapv -fPIC -fPIE armv6m

Compiler output

Implementation: armv6m_lowsize
Security model: constbranchindex
Compiler: clang -mcpu=native -O3 -fomit-frame-pointer -fwrapv -Qunused-arguments -fPIC -fPIE
aead.c: In file included from aead.c:3:
aead.c: In file included from ./permutations.h:11:
aead.c: ./round.h:173:14: error: invalid output constraint '+l' in asm
aead.c: [x0_l] "+l"(s->w[0][0]), [x0_h] "+h"(s->w[0][1]), [x1_l] "+l"(s->w[1][0]),
aead.c: ^
aead.c: ./round.h:338:14: error: invalid output constraint '+l' in asm
aead.c: [x0_l] "+l"(s->w[0][0]), [x0_h] "+h"(s->w[0][1]), [x1_l] "+l"(s->w[1][0]),
aead.c: ^
aead.c: 2 errors generated.

Number of similar (compiler,implementation) pairs: 1, namely:
CompilerImplementations
clang -mcpu=native -O3 -fomit-frame-pointer -fwrapv -Qunused-arguments -fPIC -fPIE armv6m_lowsize

Compiler output

Implementation: armv6m_lowsize
Security model: constbranchindex
Compiler: gcc -march=native -mtune=native -O2 -fomit-frame-pointer -fwrapv -fPIC -fPIE
permutations.c: In file included from permutations.h:11,
permutations.c: from permutations.c:1:
permutations.c: permutations.c: In function 'P':
permutations.c: round.h:12:3: error: impossible constraint in 'asm'
permutations.c: __asm__ __volatile__(
permutations.c: ^~~~~~~

Number of similar (compiler,implementation) pairs: 4, namely:
CompilerImplementations
gcc -march=native -mtune=native -O2 -fomit-frame-pointer -fwrapv -fPIC -fPIE armv6m_lowsize
gcc -march=native -mtune=native -O3 -fomit-frame-pointer -fwrapv -fPIC -fPIE armv6m_lowsize
gcc -march=native -mtune=native -O -fomit-frame-pointer -fwrapv -fPIC -fPIE armv6m_lowsize
gcc -march=native -mtune=native -Os -fomit-frame-pointer -fwrapv -fPIC -fPIE armv6m_lowsize

Compiler output

Implementation: armv7m
Security model: constbranchindex
Compiler: clang -mcpu=native -O3 -fomit-frame-pointer -fwrapv -Qunused-arguments -fPIC -fPIE
aead.c: In file included from aead.c:4:
aead.c: In file included from ./permutations.h:11:
aead.c: ./round.h:92:44: warning: value size does not match register size specified by the constraint and modifier [-Wasm-operand-widths]
aead.c: [x1_h] "+r"(s->w[1][1]), [x2_l] "+r"(s->w[2][0]), [x2_h] "+r"(s->w[2][1]),
aead.c: ^
aead.c: ./round.h:14:12: note: use constraint modifier "w"
aead.c: "eor %[x2_l], %[x2_l], %[C]\n\t"
aead.c: ^~~~~~~
aead.c: %w[x2_l]
aead.c: ./round.h:92:44: warning: value size does not match register size specified by the constraint and modifier [-Wasm-operand-widths]
aead.c: [x1_h] "+r"(s->w[1][1]), [x2_l] "+r"(s->w[2][0]), [x2_h] "+r"(s->w[2][1]),
aead.c: ^
aead.c: ./round.h:14:21: note: use constraint modifier "w"
aead.c: "eor %[x2_l], %[x2_l], %[C]\n\t"
aead.c: ^~~~~~~
aead.c: %w[x2_l]
aead.c: ./round.h:94:41: warning: value size does not match register size specified by the constraint and modifier [-Wasm-operand-widths]
aead.c: [x4_h] "+r"(s->w[4][1]), [C] "+r"(C), [tmp0] "=r"(tmp0), [tmp1] "=r"(tmp1)
aead.c: ^
aead.c: ./round.h:14:30: note: use constraint modifier "w"
aead.c: "eor %[x2_l], %[x2_l], %[C]\n\t"
aead.c: ^~~~
aead.c: %w[C]
aead.c: ./round.h:91:19: warning: value size does not match register size specified by the constraint and modifier [-Wasm-operand-widths]
aead.c: [x0_l] "+r"(s->w[0][0]), [x0_h] "+r"(s->w[0][1]), [x1_l] "+r"(s->w[1][0]),
aead.c: ...

Number of similar (compiler,implementation) pairs: 2, namely:
CompilerImplementations
clang -mcpu=native -O3 -fomit-frame-pointer -fwrapv -Qunused-arguments -fPIC -fPIE armv7m armv7m_small

Compiler output

Implementation: armv7m
Security model: constbranchindex
Compiler: gcc -march=native -mtune=native -O2 -fomit-frame-pointer -fwrapv -fPIC -fPIE
permutations.c: /tmp/ccdPyAbl.s: Assembler messages:
permutations.c: /tmp/ccdPyAbl.s:122: Error: immediate out of range at operand 3 -- `eor x13,x13,225'
permutations.c: /tmp/ccdPyAbl.s:218: Error: immediate out of range at operand 3 -- `eor x13,x13,210'
permutations.c: /tmp/ccdPyAbl.s:314: Error: immediate out of range at operand 3 -- `eor x13,x13,195'
permutations.c: /tmp/ccdPyAbl.s:410: Error: immediate out of range at operand 3 -- `eor x13,x13,180'
permutations.c: /tmp/ccdPyAbl.s:506: Error: immediate out of range at operand 3 -- `eor x13,x13,165'
permutations.c: /tmp/ccdPyAbl.s:602: Error: immediate out of range at operand 3 -- `eor x13,x13,150'
permutations.c: /tmp/ccdPyAbl.s:698: Error: immediate out of range at operand 3 -- `eor x13,x13,135'
permutations.c: /tmp/ccdPyAbl.s:890: Error: immediate out of range at operand 3 -- `eor x13,x13,105'
permutations.c: /tmp/ccdPyAbl.s:986: Error: immediate out of range at operand 3 -- `eor x13,x13,90'
permutations.c: /tmp/ccdPyAbl.s:1082: Error: immediate out of range at operand 3 -- `eor x13,x13,75'
permutations.c: /tmp/ccdPyAbl.s:1195: Error: immediate out of range at operand 3 -- `eor x13,x13,180'
permutations.c: /tmp/ccdPyAbl.s:1291: Error: immediate out of range at operand 3 -- `eor x13,x13,165'
permutations.c: /tmp/ccdPyAbl.s:1387: Error: immediate out of range at operand 3 -- `eor x13,x13,150'
permutations.c: /tmp/ccdPyAbl.s:1483: Error: immediate out of range at operand 3 -- `eor x13,x13,135'
permutations.c: /tmp/ccdPyAbl.s:1675: Error: immediate out of range at operand 3 -- `eor x13,x13,105'
permutations.c: /tmp/ccdPyAbl.s:1771: Error: immediate out of range at operand 3 -- `eor x13,x13,90'
permutations.c: /tmp/ccdPyAbl.s:1867: Error: immediate out of range at operand 3 -- `eor x13,x13,75'

Number of similar (compiler,implementation) pairs: 1, namely:
CompilerImplementations
gcc -march=native -mtune=native -O2 -fomit-frame-pointer -fwrapv -fPIC -fPIE armv7m

Compiler output

Implementation: armv7m
Security model: constbranchindex
Compiler: gcc -march=native -mtune=native -O3 -fomit-frame-pointer -fwrapv -fPIC -fPIE
permutations.c: /tmp/ccDrnehW.s: Assembler messages:
permutations.c: /tmp/ccDrnehW.s:122: Error: immediate out of range at operand 3 -- `eor x13,x13,225'
permutations.c: /tmp/ccDrnehW.s:218: Error: immediate out of range at operand 3 -- `eor x13,x13,210'
permutations.c: /tmp/ccDrnehW.s:314: Error: immediate out of range at operand 3 -- `eor x13,x13,195'
permutations.c: /tmp/ccDrnehW.s:410: Error: immediate out of range at operand 3 -- `eor x13,x13,180'
permutations.c: /tmp/ccDrnehW.s:506: Error: immediate out of range at operand 3 -- `eor x13,x13,165'
permutations.c: /tmp/ccDrnehW.s:602: Error: immediate out of range at operand 3 -- `eor x13,x13,150'
permutations.c: /tmp/ccDrnehW.s:698: Error: immediate out of range at operand 3 -- `eor x13,x13,135'
permutations.c: /tmp/ccDrnehW.s:890: Error: immediate out of range at operand 3 -- `eor x13,x13,105'
permutations.c: /tmp/ccDrnehW.s:986: Error: immediate out of range at operand 3 -- `eor x13,x13,90'
permutations.c: /tmp/ccDrnehW.s:1082: Error: immediate out of range at operand 3 -- `eor x13,x13,75'
permutations.c: /tmp/ccDrnehW.s:1195: Error: immediate out of range at operand 3 -- `eor x13,x13,180'
permutations.c: /tmp/ccDrnehW.s:1291: Error: immediate out of range at operand 3 -- `eor x13,x13,165'
permutations.c: /tmp/ccDrnehW.s:1387: Error: immediate out of range at operand 3 -- `eor x13,x13,150'
permutations.c: /tmp/ccDrnehW.s:1483: Error: immediate out of range at operand 3 -- `eor x13,x13,135'
permutations.c: /tmp/ccDrnehW.s:1675: Error: immediate out of range at operand 3 -- `eor x13,x13,105'
permutations.c: /tmp/ccDrnehW.s:1771: Error: immediate out of range at operand 3 -- `eor x13,x13,90'
permutations.c: /tmp/ccDrnehW.s:1867: Error: immediate out of range at operand 3 -- `eor x13,x13,75'

Number of similar (compiler,implementation) pairs: 1, namely:
CompilerImplementations
gcc -march=native -mtune=native -O3 -fomit-frame-pointer -fwrapv -fPIC -fPIE armv7m

Compiler output

Implementation: armv7m
Security model: constbranchindex
Compiler: gcc -march=native -mtune=native -O -fomit-frame-pointer -fwrapv -fPIC -fPIE
permutations.c: /tmp/ccOJEDJ8.s: Assembler messages:
permutations.c: /tmp/ccOJEDJ8.s:123: Error: immediate out of range at operand 3 -- `eor x13,x13,225'
permutations.c: /tmp/ccOJEDJ8.s:219: Error: immediate out of range at operand 3 -- `eor x13,x13,210'
permutations.c: /tmp/ccOJEDJ8.s:315: Error: immediate out of range at operand 3 -- `eor x13,x13,195'
permutations.c: /tmp/ccOJEDJ8.s:411: Error: immediate out of range at operand 3 -- `eor x13,x13,180'
permutations.c: /tmp/ccOJEDJ8.s:507: Error: immediate out of range at operand 3 -- `eor x13,x13,165'
permutations.c: /tmp/ccOJEDJ8.s:603: Error: immediate out of range at operand 3 -- `eor x13,x13,150'
permutations.c: /tmp/ccOJEDJ8.s:699: Error: immediate out of range at operand 3 -- `eor x13,x13,135'
permutations.c: /tmp/ccOJEDJ8.s:891: Error: immediate out of range at operand 3 -- `eor x13,x13,105'
permutations.c: /tmp/ccOJEDJ8.s:987: Error: immediate out of range at operand 3 -- `eor x13,x13,90'
permutations.c: /tmp/ccOJEDJ8.s:1083: Error: immediate out of range at operand 3 -- `eor x13,x13,75'
permutations.c: /tmp/ccOJEDJ8.s:1199: Error: immediate out of range at operand 3 -- `eor x8,x8,180'
permutations.c: /tmp/ccOJEDJ8.s:1295: Error: immediate out of range at operand 3 -- `eor x13,x13,165'
permutations.c: /tmp/ccOJEDJ8.s:1391: Error: immediate out of range at operand 3 -- `eor x13,x13,150'
permutations.c: /tmp/ccOJEDJ8.s:1487: Error: immediate out of range at operand 3 -- `eor x13,x13,135'
permutations.c: /tmp/ccOJEDJ8.s:1679: Error: immediate out of range at operand 3 -- `eor x13,x13,105'
permutations.c: /tmp/ccOJEDJ8.s:1775: Error: immediate out of range at operand 3 -- `eor x13,x13,90'
permutations.c: /tmp/ccOJEDJ8.s:1871: Error: immediate out of range at operand 3 -- `eor x13,x13,75'

Number of similar (compiler,implementation) pairs: 1, namely:
CompilerImplementations
gcc -march=native -mtune=native -O -fomit-frame-pointer -fwrapv -fPIC -fPIE armv7m

Compiler output

Implementation: armv7m
Security model: constbranchindex
Compiler: gcc -march=native -mtune=native -Os -fomit-frame-pointer -fwrapv -fPIC -fPIE
permutations.c: /tmp/ccb8O4ha.s: Assembler messages:
permutations.c: /tmp/ccb8O4ha.s:121: Error: immediate out of range at operand 3 -- `eor x13,x13,225'
permutations.c: /tmp/ccb8O4ha.s:217: Error: immediate out of range at operand 3 -- `eor x13,x13,210'
permutations.c: /tmp/ccb8O4ha.s:313: Error: immediate out of range at operand 3 -- `eor x13,x13,195'
permutations.c: /tmp/ccb8O4ha.s:409: Error: immediate out of range at operand 3 -- `eor x13,x13,180'
permutations.c: /tmp/ccb8O4ha.s:505: Error: immediate out of range at operand 3 -- `eor x13,x13,165'
permutations.c: /tmp/ccb8O4ha.s:601: Error: immediate out of range at operand 3 -- `eor x13,x13,150'
permutations.c: /tmp/ccb8O4ha.s:697: Error: immediate out of range at operand 3 -- `eor x13,x13,135'
permutations.c: /tmp/ccb8O4ha.s:889: Error: immediate out of range at operand 3 -- `eor x13,x13,105'
permutations.c: /tmp/ccb8O4ha.s:985: Error: immediate out of range at operand 3 -- `eor x13,x13,90'
permutations.c: /tmp/ccb8O4ha.s:1081: Error: immediate out of range at operand 3 -- `eor x13,x13,75'
permutations.c: /tmp/ccb8O4ha.s:1193: Error: immediate out of range at operand 3 -- `eor x13,x13,180'
permutations.c: /tmp/ccb8O4ha.s:1289: Error: immediate out of range at operand 3 -- `eor x13,x13,165'
permutations.c: /tmp/ccb8O4ha.s:1385: Error: immediate out of range at operand 3 -- `eor x13,x13,150'
permutations.c: /tmp/ccb8O4ha.s:1481: Error: immediate out of range at operand 3 -- `eor x13,x13,135'
permutations.c: /tmp/ccb8O4ha.s:1673: Error: immediate out of range at operand 3 -- `eor x13,x13,105'
permutations.c: /tmp/ccb8O4ha.s:1769: Error: immediate out of range at operand 3 -- `eor x13,x13,90'
permutations.c: /tmp/ccb8O4ha.s:1865: Error: immediate out of range at operand 3 -- `eor x13,x13,75'

Number of similar (compiler,implementation) pairs: 1, namely:
CompilerImplementations
gcc -march=native -mtune=native -Os -fomit-frame-pointer -fwrapv -fPIC -fPIE armv7m

Compiler output

Implementation: armv7m_lowsize
Security model: constbranchindex
Compiler: clang -mcpu=native -O3 -fomit-frame-pointer -fwrapv -Qunused-arguments -fPIC -fPIE
aead.c: In file included from aead.c:3:
aead.c: In file included from ./permutations.h:11:
aead.c: ./round.h:92:44: warning: value size does not match register size specified by the constraint and modifier [-Wasm-operand-widths]
aead.c: [x1_h] "+r"(s->w[1][1]), [x2_l] "+r"(s->w[2][0]), [x2_h] "+r"(s->w[2][1]),
aead.c: ^
aead.c: ./round.h:14:12: note: use constraint modifier "w"
aead.c: "eor %[x2_l], %[x2_l], %[C]\n\t"
aead.c: ^~~~~~~
aead.c: %w[x2_l]
aead.c: ./round.h:92:44: warning: value size does not match register size specified by the constraint and modifier [-Wasm-operand-widths]
aead.c: [x1_h] "+r"(s->w[1][1]), [x2_l] "+r"(s->w[2][0]), [x2_h] "+r"(s->w[2][1]),
aead.c: ^
aead.c: ./round.h:14:21: note: use constraint modifier "w"
aead.c: "eor %[x2_l], %[x2_l], %[C]\n\t"
aead.c: ^~~~~~~
aead.c: %w[x2_l]
aead.c: ./round.h:94:41: warning: value size does not match register size specified by the constraint and modifier [-Wasm-operand-widths]
aead.c: [x4_h] "+r"(s->w[4][1]), [C] "+r"(C), [tmp0] "=r"(tmp0), [tmp1] "=r"(tmp1)
aead.c: ^
aead.c: ./round.h:14:30: note: use constraint modifier "w"
aead.c: "eor %[x2_l], %[x2_l], %[C]\n\t"
aead.c: ^~~~
aead.c: %w[C]
aead.c: ./round.h:91:19: warning: value size does not match register size specified by the constraint and modifier [-Wasm-operand-widths]
aead.c: [x0_l] "+r"(s->w[0][0]), [x0_h] "+r"(s->w[0][1]), [x1_l] "+r"(s->w[1][0]),
aead.c: ...

Number of similar (compiler,implementation) pairs: 1, namely:
CompilerImplementations
clang -mcpu=native -O3 -fomit-frame-pointer -fwrapv -Qunused-arguments -fPIC -fPIE armv7m_lowsize

Compiler output

Implementation: armv7m_lowsize
Security model: constbranchindex
Compiler: gcc -march=native -mtune=native -O2 -fomit-frame-pointer -fwrapv -fPIC -fPIE
permutations.c: /tmp/ccUxWaoZ.s: Assembler messages:
permutations.c: /tmp/ccUxWaoZ.s:96: Error: operand 2 must be an integer or stack pointer register -- `sub x1,#15'

Number of similar (compiler,implementation) pairs: 1, namely:
CompilerImplementations
gcc -march=native -mtune=native -O2 -fomit-frame-pointer -fwrapv -fPIC -fPIE armv7m_lowsize

Compiler output

Implementation: armv7m_lowsize
Security model: constbranchindex
Compiler: gcc -march=native -mtune=native -O3 -fomit-frame-pointer -fwrapv -fPIC -fPIE
permutations.c: /tmp/cc98wZFn.s: Assembler messages:
permutations.c: /tmp/cc98wZFn.s:96: Error: operand 2 must be an integer or stack pointer register -- `sub x1,#15'

Number of similar (compiler,implementation) pairs: 1, namely:
CompilerImplementations
gcc -march=native -mtune=native -O3 -fomit-frame-pointer -fwrapv -fPIC -fPIE armv7m_lowsize

Compiler output

Implementation: armv7m_lowsize
Security model: constbranchindex
Compiler: gcc -march=native -mtune=native -O -fomit-frame-pointer -fwrapv -fPIC -fPIE
permutations.c: /tmp/ccY4HmQ0.s: Assembler messages:
permutations.c: /tmp/ccY4HmQ0.s:100: Error: operand 2 must be an integer or stack pointer register -- `sub x1,#15'

Number of similar (compiler,implementation) pairs: 1, namely:
CompilerImplementations
gcc -march=native -mtune=native -O -fomit-frame-pointer -fwrapv -fPIC -fPIE armv7m_lowsize

Compiler output

Implementation: armv7m_lowsize
Security model: constbranchindex
Compiler: gcc -march=native -mtune=native -Os -fomit-frame-pointer -fwrapv -fPIC -fPIE
permutations.c: /tmp/ccsjfrZr.s: Assembler messages:
permutations.c: /tmp/ccsjfrZr.s:95: Error: operand 2 must be an integer or stack pointer register -- `sub x1,#15'

Number of similar (compiler,implementation) pairs: 1, namely:
CompilerImplementations
gcc -march=native -mtune=native -Os -fomit-frame-pointer -fwrapv -fPIC -fPIE armv7m_lowsize

Compiler output

Implementation: armv7m_small
Security model: constbranchindex
Compiler: gcc -march=native -mtune=native -O2 -fomit-frame-pointer -fwrapv -fPIC -fPIE
permutations.c: /tmp/ccjHYUw7.s: Assembler messages:
permutations.c: /tmp/ccjHYUw7.s:96: Error: operand 2 must be an integer or stack pointer register -- `sub x1,#15'

Number of similar (compiler,implementation) pairs: 1, namely:
CompilerImplementations
gcc -march=native -mtune=native -O2 -fomit-frame-pointer -fwrapv -fPIC -fPIE armv7m_small

Compiler output

Implementation: armv7m_small
Security model: constbranchindex
Compiler: gcc -march=native -mtune=native -O3 -fomit-frame-pointer -fwrapv -fPIC -fPIE
permutations.c: /tmp/ccDNrYBi.s: Assembler messages:
permutations.c: /tmp/ccDNrYBi.s:96: Error: operand 2 must be an integer or stack pointer register -- `sub x1,#15'

Number of similar (compiler,implementation) pairs: 1, namely:
CompilerImplementations
gcc -march=native -mtune=native -O3 -fomit-frame-pointer -fwrapv -fPIC -fPIE armv7m_small

Compiler output

Implementation: armv7m_small
Security model: constbranchindex
Compiler: gcc -march=native -mtune=native -O -fomit-frame-pointer -fwrapv -fPIC -fPIE
permutations.c: /tmp/cc1wkSbd.s: Assembler messages:
permutations.c: /tmp/cc1wkSbd.s:100: Error: operand 2 must be an integer or stack pointer register -- `sub x1,#15'

Number of similar (compiler,implementation) pairs: 1, namely:
CompilerImplementations
gcc -march=native -mtune=native -O -fomit-frame-pointer -fwrapv -fPIC -fPIE armv7m_small

Compiler output

Implementation: armv7m_small
Security model: constbranchindex
Compiler: gcc -march=native -mtune=native -Os -fomit-frame-pointer -fwrapv -fPIC -fPIE
permutations.c: /tmp/ccTThiil.s: Assembler messages:
permutations.c: /tmp/ccTThiil.s:95: Error: operand 2 must be an integer or stack pointer register -- `sub x1,#15'

Number of similar (compiler,implementation) pairs: 1, namely:
CompilerImplementations
gcc -march=native -mtune=native -Os -fomit-frame-pointer -fwrapv -fPIC -fPIE armv7m_small

Compiler output

Implementation: T:asm_bi32_rv32b
Security model: timingleaks
Compiler: clang -mcpu=native -O3 -fomit-frame-pointer -fwrapv -Qunused-arguments -fPIC -fPIE
ascon.S: ascon.S:159:5: error: unrecognized instruction mnemonic, did you mean: b?
ascon.S: j .LPloopcond
ascon.S: ^
ascon.S: ascon.S:162:5: error: unrecognized instruction mnemonic, did you mean: eor, orn, orr, ror?
ascon.S: xor s5, s5, t2
ascon.S: ^
ascon.S: ascon.S:163:14: error: unexpected token in argument list
ascon.S: lbu t2, 1(t1)
ascon.S: ^
ascon.S: ascon.S:164:5: error: unrecognized instruction mnemonic, did you mean: eor, orn, orr, ror?
ascon.S: xor s4, s4, t2
ascon.S: ^
ascon.S: <instantiation>:1:1: error: unrecognized instruction mnemonic, did you mean: eor, orn, orr, ror?
ascon.S: xor t3, s1, s9
ascon.S: ^
ascon.S: ascon.S:167:5: note: while in macro instantiation
ascon.S: sbox s1, s3, s5, s7, s9, t4, t3, t5
ascon.S: ^
ascon.S: <instantiation>:2:5: error: unrecognized instruction mnemonic, did you mean: eor, orn, orr, ror?
ascon.S: xor t5, s7, s9
ascon.S: ^
ascon.S: ascon.S:167:5: note: while in macro instantiation
ascon.S: sbox s1, s3, s5, s7, s9, t4, t3, t5
ascon.S: ^
ascon.S: <instantiation>:3:5: error: unrecognized instruction mnemonic, did you mean: eor, orn, orr, ror?
ascon.S: ...

Number of similar (compiler,implementation) pairs: 1, namely:
CompilerImplementations
clang -mcpu=native -O3 -fomit-frame-pointer -fwrapv -Qunused-arguments -fPIC -fPIE T:asm_bi32_rv32b

Compiler output

Implementation: T:asm_bi32_rv32b
Security model: timingleaks
Compiler: gcc -march=native -mtune=native -O2 -fomit-frame-pointer -fwrapv -fPIC -fPIE
ascon.S: ascon.S: Assembler messages:
ascon.S: ascon.S:159: Error: unknown mnemonic `j' -- `j .LPloopcond'
ascon.S: ascon.S:162: Error: unknown mnemonic `xor' -- `xor s5,s5,t2'
ascon.S: ascon.S:163: Error: unknown mnemonic `lbu' -- `lbu t2,1(t1)'
ascon.S: ascon.S:164: Error: unknown mnemonic `xor' -- `xor s4,s4,t2'
ascon.S: ascon.S:167: Error: unknown mnemonic `xor' -- `xor t3,s1,s9'
ascon.S: ascon.S:167: Error: unknown mnemonic `xor' -- `xor t5,s7,s9'
ascon.S: ascon.S:167: Error: unknown mnemonic `xor' -- `xor t4,s3,s5'
ascon.S: ascon.S:167: Error: operand 1 must be an integer register -- `orn s9,s7,s9'
ascon.S: ascon.S:167: Error: unknown mnemonic `xor' -- `xor s9,s9,t4'
ascon.S: ascon.S:167: Error: unknown mnemonic `xor' -- `xor s7,s7,s3'
ascon.S: ascon.S:167: Error: unknown mnemonic `or' -- `or s7,s7,t4'
ascon.S: ascon.S:167: Error: unknown mnemonic `xor' -- `xor s7,s7,t3'
ascon.S: ascon.S:167: Error: unknown mnemonic `xor' -- `xor s5,s5,t3'
ascon.S: ascon.S:167: Error: unknown mnemonic `or' -- `or s5,s5,s3'
ascon.S: ascon.S:167: Error: unknown mnemonic `xor' -- `xor s5,s5,t5'
ascon.S: ascon.S:167: Error: unknown mnemonic `or' -- `or s1,s1,t5'
ascon.S: ascon.S:167: Error: unknown mnemonic `xor' -- `xor t4,t4,s1'
ascon.S: ascon.S:167: Error: unknown mnemonic `andn' -- `andn s3,s3,t3'
ascon.S: ascon.S:167: Error: unknown mnemonic `xor' -- `xor s3,s3,t5'
ascon.S: ascon.S:168: Error: unknown mnemonic `xor' -- `xor s1,s0,s8'
ascon.S: ascon.S:168: Error: unknown mnemonic `xor' -- `xor t5,s6,s8'
ascon.S: ascon.S:168: Error: unknown mnemonic `xor' -- `xor t3,s2,s4'
ascon.S: ascon.S:168: Error: operand 1 must be an integer register -- `orn s8,s6,s8'
ascon.S: ascon.S:168: Error: unknown mnemonic `xor' -- `xor s8,s8,t3'
ascon.S: ...

Number of similar (compiler,implementation) pairs: 4, namely:
CompilerImplementations
gcc -march=native -mtune=native -O2 -fomit-frame-pointer -fwrapv -fPIC -fPIE T:asm_bi32_rv32b
gcc -march=native -mtune=native -O3 -fomit-frame-pointer -fwrapv -fPIC -fPIE T:asm_bi32_rv32b
gcc -march=native -mtune=native -O -fomit-frame-pointer -fwrapv -fPIC -fPIE T:asm_bi32_rv32b
gcc -march=native -mtune=native -Os -fomit-frame-pointer -fwrapv -fPIC -fPIE T:asm_bi32_rv32b

Compiler output

Implementation: T:asm_esp32
Security model: timingleaks
Compiler: clang -mcpu=native -O3 -fomit-frame-pointer -fwrapv -Qunused-arguments -fPIC -fPIE
ascon.S: ascon.S:1:10: fatal error: 'xtensa/coreasm.h' file not found
ascon.S: #include <xtensa/coreasm.h>
ascon.S: ^~~~~~~~~~~~~~~~~~
ascon.S: 1 error generated.

Number of similar (compiler,implementation) pairs: 1, namely:
CompilerImplementations
clang -mcpu=native -O3 -fomit-frame-pointer -fwrapv -Qunused-arguments -fPIC -fPIE T:asm_esp32

Compiler output

Implementation: T:asm_esp32
Security model: timingleaks
Compiler: gcc -march=native -mtune=native -O2 -fomit-frame-pointer -fwrapv -fPIC -fPIE
ascon.S: ascon.S:1:10: fatal error: xtensa/coreasm.h: No such file or directory
ascon.S: #include <xtensa/coreasm.h>
ascon.S: ^~~~~~~~~~~~~~~~~~
ascon.S: compilation terminated.

Number of similar (compiler,implementation) pairs: 4, namely:
CompilerImplementations
gcc -march=native -mtune=native -O2 -fomit-frame-pointer -fwrapv -fPIC -fPIE T:asm_esp32
gcc -march=native -mtune=native -O3 -fomit-frame-pointer -fwrapv -fPIC -fPIE T:asm_esp32
gcc -march=native -mtune=native -O -fomit-frame-pointer -fwrapv -fPIC -fPIE T:asm_esp32
gcc -march=native -mtune=native -Os -fomit-frame-pointer -fwrapv -fPIC -fPIE T:asm_esp32

Compiler output

Implementation: T:asm_fsr_rv32b
Security model: timingleaks
Compiler: clang -mcpu=native -O3 -fomit-frame-pointer -fwrapv -Qunused-arguments -fPIC -fPIE
ascon.S: ascon.S:110:5: error: unrecognized instruction mnemonic, did you mean: bl, sli?
ascon.S: li t6, 0x4b
ascon.S: ^
ascon.S: ascon.S:113:5: error: unrecognized instruction mnemonic, did you mean: eor, orn, orr, ror?
ascon.S: xor s5, s5, t1
ascon.S: ^
ascon.S: <instantiation>:1:1: error: unrecognized instruction mnemonic, did you mean: eor, orn, orr, ror?
ascon.S: xor t3, s1, s9
ascon.S: ^
ascon.S: ascon.S:116:5: note: while in macro instantiation
ascon.S: sbox s1, s3, s5, s7, s9, t4, t3, t5
ascon.S: ^
ascon.S: <instantiation>:2:5: error: unrecognized instruction mnemonic, did you mean: eor, orn, orr, ror?
ascon.S: xor t5, s7, s9
ascon.S: ^
ascon.S: ascon.S:116:5: note: while in macro instantiation
ascon.S: sbox s1, s3, s5, s7, s9, t4, t3, t5
ascon.S: ^
ascon.S: <instantiation>:3:5: error: unrecognized instruction mnemonic, did you mean: eor, orn, orr, ror?
ascon.S: xor t4, s3, s5
ascon.S: ^
ascon.S: ascon.S:116:5: note: while in macro instantiation
ascon.S: sbox s1, s3, s5, s7, s9, t4, t3, t5
ascon.S: ^
ascon.S: <instantiation>:4:9: error: invalid operand for instruction
ascon.S: ...

Number of similar (compiler,implementation) pairs: 1, namely:
CompilerImplementations
clang -mcpu=native -O3 -fomit-frame-pointer -fwrapv -Qunused-arguments -fPIC -fPIE T:asm_fsr_rv32b

Compiler output

Implementation: T:asm_fsr_rv32b
Security model: timingleaks
Compiler: gcc -march=native -mtune=native -O2 -fomit-frame-pointer -fwrapv -fPIC -fPIE
ascon.S: ascon.S: Assembler messages:
ascon.S: ascon.S:110: Error: unknown mnemonic `li' -- `li t6,0x4b'
ascon.S: ascon.S:113: Error: unknown mnemonic `xor' -- `xor s5,s5,t1'
ascon.S: ascon.S:116: Error: unknown mnemonic `xor' -- `xor t3,s1,s9'
ascon.S: ascon.S:116: Error: unknown mnemonic `xor' -- `xor t5,s7,s9'
ascon.S: ascon.S:116: Error: unknown mnemonic `xor' -- `xor t4,s3,s5'
ascon.S: ascon.S:116: Error: operand 1 must be an integer register -- `orn s9,s7,s9'
ascon.S: ascon.S:116: Error: unknown mnemonic `xor' -- `xor s9,s9,t4'
ascon.S: ascon.S:116: Error: unknown mnemonic `xor' -- `xor s7,s7,s3'
ascon.S: ascon.S:116: Error: unknown mnemonic `or' -- `or s7,s7,t4'
ascon.S: ascon.S:116: Error: unknown mnemonic `xor' -- `xor s7,s7,t3'
ascon.S: ascon.S:116: Error: unknown mnemonic `xor' -- `xor s5,s5,t3'
ascon.S: ascon.S:116: Error: unknown mnemonic `or' -- `or s5,s5,s3'
ascon.S: ascon.S:116: Error: unknown mnemonic `xor' -- `xor s5,s5,t5'
ascon.S: ascon.S:116: Error: unknown mnemonic `or' -- `or s1,s1,t5'
ascon.S: ascon.S:116: Error: unknown mnemonic `xor' -- `xor t4,t4,s1'
ascon.S: ascon.S:116: Error: unknown mnemonic `andn' -- `andn s3,s3,t3'
ascon.S: ascon.S:116: Error: unknown mnemonic `xor' -- `xor s3,s3,t5'
ascon.S: ascon.S:117: Error: unknown mnemonic `xor' -- `xor s1,s0,s8'
ascon.S: ascon.S:117: Error: unknown mnemonic `xor' -- `xor t5,s6,s8'
ascon.S: ascon.S:117: Error: unknown mnemonic `xor' -- `xor t3,s2,s4'
ascon.S: ascon.S:117: Error: operand 1 must be an integer register -- `orn s8,s6,s8'
ascon.S: ascon.S:117: Error: unknown mnemonic `xor' -- `xor s8,s8,t3'
ascon.S: ascon.S:117: Error: unknown mnemonic `xor' -- `xor s6,s6,s2'
ascon.S: ascon.S:117: Error: unknown mnemonic `or' -- `or s6,s6,t3'
ascon.S: ...

Number of similar (compiler,implementation) pairs: 4, namely:
CompilerImplementations
gcc -march=native -mtune=native -O2 -fomit-frame-pointer -fwrapv -fPIC -fPIE T:asm_fsr_rv32b
gcc -march=native -mtune=native -O3 -fomit-frame-pointer -fwrapv -fPIC -fPIE T:asm_fsr_rv32b
gcc -march=native -mtune=native -O -fomit-frame-pointer -fwrapv -fPIC -fPIE T:asm_fsr_rv32b
gcc -march=native -mtune=native -Os -fomit-frame-pointer -fwrapv -fPIC -fPIE T:asm_fsr_rv32b

Compiler output

Implementation: T:asm_rv32b
Security model: timingleaks
Compiler: clang -mcpu=native -O3 -fomit-frame-pointer -fwrapv -Qunused-arguments -fPIC -fPIE
ascon.S: ascon.S:118:5: error: unrecognized instruction mnemonic, did you mean: bl, sli?
ascon.S: li t6, 0x4b
ascon.S: ^
ascon.S: ascon.S:121:5: error: unrecognized instruction mnemonic, did you mean: eor, orn, orr, ror?
ascon.S: xor s5, s5, t1
ascon.S: ^
ascon.S: <instantiation>:1:1: error: unrecognized instruction mnemonic, did you mean: eor, orn, orr, ror?
ascon.S: xor t3, s1, s9
ascon.S: ^
ascon.S: ascon.S:124:5: note: while in macro instantiation
ascon.S: sbox s1, s3, s5, s7, s9, t4, t3, t5
ascon.S: ^
ascon.S: <instantiation>:2:5: error: unrecognized instruction mnemonic, did you mean: eor, orn, orr, ror?
ascon.S: xor t5, s7, s9
ascon.S: ^
ascon.S: ascon.S:124:5: note: while in macro instantiation
ascon.S: sbox s1, s3, s5, s7, s9, t4, t3, t5
ascon.S: ^
ascon.S: <instantiation>:3:5: error: unrecognized instruction mnemonic, did you mean: eor, orn, orr, ror?
ascon.S: xor t4, s3, s5
ascon.S: ^
ascon.S: ascon.S:124:5: note: while in macro instantiation
ascon.S: sbox s1, s3, s5, s7, s9, t4, t3, t5
ascon.S: ^
ascon.S: <instantiation>:4:9: error: invalid operand for instruction
ascon.S: ...

Number of similar (compiler,implementation) pairs: 1, namely:
CompilerImplementations
clang -mcpu=native -O3 -fomit-frame-pointer -fwrapv -Qunused-arguments -fPIC -fPIE T:asm_rv32b

Compiler output

Implementation: T:asm_rv32b
Security model: timingleaks
Compiler: gcc -march=native -mtune=native -O2 -fomit-frame-pointer -fwrapv -fPIC -fPIE
ascon.S: ascon.S: Assembler messages:
ascon.S: ascon.S:118: Error: unknown mnemonic `li' -- `li t6,0x4b'
ascon.S: ascon.S:121: Error: unknown mnemonic `xor' -- `xor s5,s5,t1'
ascon.S: ascon.S:124: Error: unknown mnemonic `xor' -- `xor t3,s1,s9'
ascon.S: ascon.S:124: Error: unknown mnemonic `xor' -- `xor t5,s7,s9'
ascon.S: ascon.S:124: Error: unknown mnemonic `xor' -- `xor t4,s3,s5'
ascon.S: ascon.S:124: Error: operand 1 must be an integer register -- `orn s9,s7,s9'
ascon.S: ascon.S:124: Error: unknown mnemonic `xor' -- `xor s9,s9,t4'
ascon.S: ascon.S:124: Error: unknown mnemonic `xor' -- `xor s7,s7,s3'
ascon.S: ascon.S:124: Error: unknown mnemonic `or' -- `or s7,s7,t4'
ascon.S: ascon.S:124: Error: unknown mnemonic `xor' -- `xor s7,s7,t3'
ascon.S: ascon.S:124: Error: unknown mnemonic `xor' -- `xor s5,s5,t3'
ascon.S: ascon.S:124: Error: unknown mnemonic `or' -- `or s5,s5,s3'
ascon.S: ascon.S:124: Error: unknown mnemonic `xor' -- `xor s5,s5,t5'
ascon.S: ascon.S:124: Error: unknown mnemonic `or' -- `or s1,s1,t5'
ascon.S: ascon.S:124: Error: unknown mnemonic `xor' -- `xor t4,t4,s1'
ascon.S: ascon.S:124: Error: unknown mnemonic `andn' -- `andn s3,s3,t3'
ascon.S: ascon.S:124: Error: unknown mnemonic `xor' -- `xor s3,s3,t5'
ascon.S: ascon.S:125: Error: unknown mnemonic `xor' -- `xor s1,s0,s8'
ascon.S: ascon.S:125: Error: unknown mnemonic `xor' -- `xor t5,s6,s8'
ascon.S: ascon.S:125: Error: unknown mnemonic `xor' -- `xor t3,s2,s4'
ascon.S: ascon.S:125: Error: operand 1 must be an integer register -- `orn s8,s6,s8'
ascon.S: ascon.S:125: Error: unknown mnemonic `xor' -- `xor s8,s8,t3'
ascon.S: ascon.S:125: Error: unknown mnemonic `xor' -- `xor s6,s6,s2'
ascon.S: ascon.S:125: Error: unknown mnemonic `or' -- `or s6,s6,t3'
ascon.S: ...

Number of similar (compiler,implementation) pairs: 4, namely:
CompilerImplementations
gcc -march=native -mtune=native -O2 -fomit-frame-pointer -fwrapv -fPIC -fPIE T:asm_rv32b
gcc -march=native -mtune=native -O3 -fomit-frame-pointer -fwrapv -fPIC -fPIE T:asm_rv32b
gcc -march=native -mtune=native -O -fomit-frame-pointer -fwrapv -fPIC -fPIE T:asm_rv32b
gcc -march=native -mtune=native -Os -fomit-frame-pointer -fwrapv -fPIC -fPIE T:asm_rv32b

Compiler output

Implementation: T:asm_rv32i
Security model: timingleaks
Compiler: clang -mcpu=native -O3 -fomit-frame-pointer -fwrapv -Qunused-arguments -fPIC -fPIE
ascon.S: ascon.S:120:5: error: unrecognized instruction mnemonic, did you mean: bl, sli?
ascon.S: li t6, 0x4b
ascon.S: ^
ascon.S: ascon.S:123:5: error: unrecognized instruction mnemonic, did you mean: eor, orn, orr, ror?
ascon.S: xor s5, s5, t1
ascon.S: ^
ascon.S: <instantiation>:1:1: error: unrecognized instruction mnemonic, did you mean: eor, orn, orr, ror?
ascon.S: xor t3, s1, s9
ascon.S: ^
ascon.S: ascon.S:126:5: note: while in macro instantiation
ascon.S: sbox s1, s3, s5, s7, s9, t4, t3, t5
ascon.S: ^
ascon.S: <instantiation>:2:5: error: unrecognized instruction mnemonic, did you mean: eor, orn, orr, ror?
ascon.S: xor t5, s7, s9
ascon.S: ^
ascon.S: ascon.S:126:5: note: while in macro instantiation
ascon.S: sbox s1, s3, s5, s7, s9, t4, t3, t5
ascon.S: ^
ascon.S: <instantiation>:3:5: error: unrecognized instruction mnemonic
ascon.S: xori s9, s9, -1
ascon.S: ^
ascon.S: ascon.S:126:5: note: while in macro instantiation
ascon.S: sbox s1, s3, s5, s7, s9, t4, t3, t5
ascon.S: ^
ascon.S: <instantiation>:4:5: error: unrecognized instruction mnemonic, did you mean: eor, orn, orr, ror?
ascon.S: ...

Number of similar (compiler,implementation) pairs: 1, namely:
CompilerImplementations
clang -mcpu=native -O3 -fomit-frame-pointer -fwrapv -Qunused-arguments -fPIC -fPIE T:asm_rv32i

Compiler output

Implementation: T:asm_rv32i
Security model: timingleaks
Compiler: gcc -march=native -mtune=native -O2 -fomit-frame-pointer -fwrapv -fPIC -fPIE
ascon.S: ascon.S: Assembler messages:
ascon.S: ascon.S:120: Error: unknown mnemonic `li' -- `li t6,0x4b'
ascon.S: ascon.S:123: Error: unknown mnemonic `xor' -- `xor s5,s5,t1'
ascon.S: ascon.S:126: Error: unknown mnemonic `xor' -- `xor t3,s1,s9'
ascon.S: ascon.S:126: Error: unknown mnemonic `xor' -- `xor t5,s7,s9'
ascon.S: ascon.S:126: Error: unknown mnemonic `xori' -- `xori s9,s9,-1'
ascon.S: ascon.S:126: Error: unknown mnemonic `xor' -- `xor t4,s3,s5'
ascon.S: ascon.S:126: Error: unknown mnemonic `or' -- `or s9,s9,s7'
ascon.S: ascon.S:126: Error: unknown mnemonic `xor' -- `xor s9,s9,t4'
ascon.S: ascon.S:126: Error: unknown mnemonic `xor' -- `xor s7,s7,s3'
ascon.S: ascon.S:126: Error: unknown mnemonic `or' -- `or s7,s7,t4'
ascon.S: ascon.S:126: Error: unknown mnemonic `xor' -- `xor s7,s7,t3'
ascon.S: ascon.S:126: Error: unknown mnemonic `xor' -- `xor s5,s5,t3'
ascon.S: ascon.S:126: Error: unknown mnemonic `or' -- `or s5,s5,s3'
ascon.S: ascon.S:126: Error: unknown mnemonic `xor' -- `xor s5,s5,t5'
ascon.S: ascon.S:126: Error: unknown mnemonic `or' -- `or s1,s1,t5'
ascon.S: ascon.S:126: Error: unknown mnemonic `xor' -- `xor t4,t4,s1'
ascon.S: ascon.S:126: Error: unknown mnemonic `xori' -- `xori t3,t3,-1'
ascon.S: ascon.S:126: Error: operand 1 must be an integer or stack pointer register -- `and s3,s3,t3'
ascon.S: ascon.S:126: Error: unknown mnemonic `xor' -- `xor s3,s3,t5'
ascon.S: ascon.S:127: Error: unknown mnemonic `xor' -- `xor s1,s0,s8'
ascon.S: ascon.S:127: Error: unknown mnemonic `xor' -- `xor t5,s6,s8'
ascon.S: ascon.S:127: Error: unknown mnemonic `xori' -- `xori s8,s8,-1'
ascon.S: ascon.S:127: Error: unknown mnemonic `xor' -- `xor t3,s2,s4'
ascon.S: ascon.S:127: Error: unknown mnemonic `or' -- `or s8,s8,s6'
ascon.S: ...

Number of similar (compiler,implementation) pairs: 4, namely:
CompilerImplementations
gcc -march=native -mtune=native -O2 -fomit-frame-pointer -fwrapv -fPIC -fPIE T:asm_rv32i
gcc -march=native -mtune=native -O3 -fomit-frame-pointer -fwrapv -fPIC -fPIE T:asm_rv32i
gcc -march=native -mtune=native -O -fomit-frame-pointer -fwrapv -fPIC -fPIE T:asm_rv32i
gcc -march=native -mtune=native -Os -fomit-frame-pointer -fwrapv -fPIC -fPIE T:asm_rv32i

Compiler output

Implementation: avr
Security model: constbranchindex
Compiler: clang -mcpu=native -O3 -fomit-frame-pointer -fwrapv -Qunused-arguments -fPIC -fPIE
permutations.S: permutations.S:29:10: fatal error: 'avr/io.h' file not found
permutations.S: #include "avr/io.h"
permutations.S: ^~~~~~~~~~
permutations.S: 1 error generated.

Number of similar (compiler,implementation) pairs: 2, namely:
CompilerImplementations
clang -mcpu=native -O3 -fomit-frame-pointer -fwrapv -Qunused-arguments -fPIC -fPIE avr avr_lowsize

Compiler output

Implementation: avr
Security model: constbranchindex
Compiler: gcc -march=native -mtune=native -O2 -fomit-frame-pointer -fwrapv -fPIC -fPIE
permutations.S: permutations.S:29:10: fatal error: avr/io.h: No such file or directory
permutations.S: #include "avr/io.h"
permutations.S: ^~~~~~~~~~
permutations.S: compilation terminated.

Number of similar (compiler,implementation) pairs: 8, namely:
CompilerImplementations
gcc -march=native -mtune=native -O2 -fomit-frame-pointer -fwrapv -fPIC -fPIE avr
gcc -march=native -mtune=native -O3 -fomit-frame-pointer -fwrapv -fPIC -fPIE avr
gcc -march=native -mtune=native -O -fomit-frame-pointer -fwrapv -fPIC -fPIE avr
gcc -march=native -mtune=native -Os -fomit-frame-pointer -fwrapv -fPIC -fPIE avr
gcc -march=native -mtune=native -O2 -fomit-frame-pointer -fwrapv -fPIC -fPIE avr_lowsize
gcc -march=native -mtune=native -O3 -fomit-frame-pointer -fwrapv -fPIC -fPIE avr_lowsize
gcc -march=native -mtune=native -O -fomit-frame-pointer -fwrapv -fPIC -fPIE avr_lowsize
gcc -march=native -mtune=native -Os -fomit-frame-pointer -fwrapv -fPIC -fPIE avr_lowsize

Compiler output

Implementation: bi32_armv6
Security model: constbranchindex
Compiler: clang -mcpu=native -O3 -fomit-frame-pointer -fwrapv -Qunused-arguments -fPIC -fPIE
aead.c: In file included from aead.c:4:
aead.c: In file included from ./permutations.h:11:
aead.c: ./round.h:82:19: warning: value size does not match register size specified by the constraint and modifier [-Wasm-operand-widths]
aead.c: [tmp1] "=r"(tmp1)
aead.c: ^
aead.c: ./round.h:15:13: note: use constraint modifier "w"
aead.c: "ldrb %[tmp1], [%[C]], #1\n\t"
aead.c: ^~~~~~~
aead.c: %w[tmp1]
aead.c: ./round.h:78:19: warning: value size does not match register size specified by the constraint and modifier [-Wasm-operand-widths]
aead.c: [x0_l] "+r"(s->w[0][0]), [x0_h] "+r"(s->w[0][1]), [x1_l] "+r"(s->w[1][0]),
aead.c: ^
aead.c: ./round.h:16:12: note: use constraint modifier "w"
aead.c: "eor %[x0_l], %[x0_l], %[x4_l]\n\t"
aead.c: ^~~~~~~
aead.c: %w[x0_l]
aead.c: ./round.h:78:19: warning: value size does not match register size specified by the constraint and modifier [-Wasm-operand-widths]
aead.c: [x0_l] "+r"(s->w[0][0]), [x0_h] "+r"(s->w[0][1]), [x1_l] "+r"(s->w[1][0]),
aead.c: ^
aead.c: ./round.h:16:21: note: use constraint modifier "w"
aead.c: "eor %[x0_l], %[x0_l], %[x4_l]\n\t"
aead.c: ^~~~~~~
aead.c: %w[x0_l]
aead.c: ./round.h:80:69: warning: value size does not match register size specified by the constraint and modifier [-Wasm-operand-widths]
aead.c: [x3_l] "+r"(s->w[3][0]), [x3_h] "+r"(s->w[3][1]), [x4_l] "+r"(s->w[4][0]),
aead.c: ...

Number of similar (compiler,implementation) pairs: 1, namely:
CompilerImplementations
clang -mcpu=native -O3 -fomit-frame-pointer -fwrapv -Qunused-arguments -fPIC -fPIE bi32_armv6

Compiler output

Implementation: bi32_armv6
Security model: constbranchindex
Compiler: gcc -march=native -mtune=native -O2 -fomit-frame-pointer -fwrapv -fPIC -fPIE
permutations.c: /tmp/cc7cIieB.s: Assembler messages:
permutations.c: /tmp/cc7cIieB.s:105: Error: immediate out of range at operand 3 -- `eor x13,x13,9'
permutations.c: /tmp/cc7cIieB.s:201: Error: immediate out of range at operand 3 -- `eor x8,x8,9'
permutations.c: /tmp/cc7cIieB.s:263: Error: immediate out of range at operand 3 -- `eor x13,x13,9'
permutations.c: /tmp/cc7cIieB.s:280: Error: immediate out of range at operand 3 -- `eor x8,x8,9'
permutations.c: /tmp/cc7cIieB.s:517: Error: immediate out of range at operand 3 -- `eor x8,x8,9'
permutations.c: /tmp/cc7cIieB.s:596: Error: immediate out of range at operand 3 -- `eor x8,x8,9'
permutations.c: /tmp/cc7cIieB.s:737: Error: immediate out of range at operand 3 -- `eor x13,x13,9'
permutations.c: /tmp/cc7cIieB.s:895: Error: immediate out of range at operand 3 -- `eor x13,x13,9'
permutations.c: /tmp/cc7cIieB.s:1166: Error: immediate out of range at operand 3 -- `eor x8,x8,9'
permutations.c: /tmp/cc7cIieB.s:1245: Error: immediate out of range at operand 3 -- `eor x8,x8,9'
permutations.c: /tmp/cc7cIieB.s:1386: Error: immediate out of range at operand 3 -- `eor x13,x13,9'
permutations.c: /tmp/cc7cIieB.s:1544: Error: immediate out of range at operand 3 -- `eor x13,x13,9'

Number of similar (compiler,implementation) pairs: 1, namely:
CompilerImplementations
gcc -march=native -mtune=native -O2 -fomit-frame-pointer -fwrapv -fPIC -fPIE bi32_armv6

Compiler output

Implementation: bi32_armv6
Security model: constbranchindex
Compiler: gcc -march=native -mtune=native -O3 -fomit-frame-pointer -fwrapv -fPIC -fPIE
permutations.c: /tmp/ccYErSVm.s: Assembler messages:
permutations.c: /tmp/ccYErSVm.s:105: Error: immediate out of range at operand 3 -- `eor x13,x13,9'
permutations.c: /tmp/ccYErSVm.s:201: Error: immediate out of range at operand 3 -- `eor x8,x8,9'
permutations.c: /tmp/ccYErSVm.s:263: Error: immediate out of range at operand 3 -- `eor x13,x13,9'
permutations.c: /tmp/ccYErSVm.s:280: Error: immediate out of range at operand 3 -- `eor x8,x8,9'
permutations.c: /tmp/ccYErSVm.s:517: Error: immediate out of range at operand 3 -- `eor x8,x8,9'
permutations.c: /tmp/ccYErSVm.s:596: Error: immediate out of range at operand 3 -- `eor x8,x8,9'
permutations.c: /tmp/ccYErSVm.s:737: Error: immediate out of range at operand 3 -- `eor x13,x13,9'
permutations.c: /tmp/ccYErSVm.s:895: Error: immediate out of range at operand 3 -- `eor x13,x13,9'
permutations.c: /tmp/ccYErSVm.s:1166: Error: immediate out of range at operand 3 -- `eor x8,x8,9'
permutations.c: /tmp/ccYErSVm.s:1245: Error: immediate out of range at operand 3 -- `eor x8,x8,9'
permutations.c: /tmp/ccYErSVm.s:1386: Error: immediate out of range at operand 3 -- `eor x13,x13,9'
permutations.c: /tmp/ccYErSVm.s:1544: Error: immediate out of range at operand 3 -- `eor x13,x13,9'

Number of similar (compiler,implementation) pairs: 1, namely:
CompilerImplementations
gcc -march=native -mtune=native -O3 -fomit-frame-pointer -fwrapv -fPIC -fPIE bi32_armv6

Compiler output

Implementation: bi32_armv6
Security model: constbranchindex
Compiler: gcc -march=native -mtune=native -O -fomit-frame-pointer -fwrapv -fPIC -fPIE
permutations.c: /tmp/cc1e6qle.s: Assembler messages:
permutations.c: /tmp/cc1e6qle.s:106: Error: immediate out of range at operand 3 -- `eor x13,x13,9'
permutations.c: /tmp/cc1e6qle.s:202: Error: immediate out of range at operand 3 -- `eor x8,x8,9'
permutations.c: /tmp/cc1e6qle.s:264: Error: immediate out of range at operand 3 -- `eor x13,x13,9'
permutations.c: /tmp/cc1e6qle.s:281: Error: immediate out of range at operand 3 -- `eor x8,x8,9'
permutations.c: /tmp/cc1e6qle.s:518: Error: immediate out of range at operand 3 -- `eor x8,x8,9'
permutations.c: /tmp/cc1e6qle.s:597: Error: immediate out of range at operand 3 -- `eor x8,x8,9'
permutations.c: /tmp/cc1e6qle.s:738: Error: immediate out of range at operand 3 -- `eor x13,x13,9'
permutations.c: /tmp/cc1e6qle.s:896: Error: immediate out of range at operand 3 -- `eor x13,x13,9'
permutations.c: /tmp/cc1e6qle.s:1170: Error: immediate out of range at operand 3 -- `eor x8,x8,9'
permutations.c: /tmp/cc1e6qle.s:1249: Error: immediate out of range at operand 3 -- `eor x8,x8,9'
permutations.c: /tmp/cc1e6qle.s:1390: Error: immediate out of range at operand 3 -- `eor x13,x13,9'
permutations.c: /tmp/cc1e6qle.s:1548: Error: immediate out of range at operand 3 -- `eor x13,x13,9'

Number of similar (compiler,implementation) pairs: 1, namely:
CompilerImplementations
gcc -march=native -mtune=native -O -fomit-frame-pointer -fwrapv -fPIC -fPIE bi32_armv6

Compiler output

Implementation: bi32_armv6
Security model: constbranchindex
Compiler: gcc -march=native -mtune=native -Os -fomit-frame-pointer -fwrapv -fPIC -fPIE
permutations.c: /tmp/cc3b9Xul.s: Assembler messages:
permutations.c: /tmp/cc3b9Xul.s:104: Error: immediate out of range at operand 3 -- `eor x13,x13,9'
permutations.c: /tmp/cc3b9Xul.s:200: Error: immediate out of range at operand 3 -- `eor x8,x8,9'
permutations.c: /tmp/cc3b9Xul.s:262: Error: immediate out of range at operand 3 -- `eor x13,x13,9'
permutations.c: /tmp/cc3b9Xul.s:279: Error: immediate out of range at operand 3 -- `eor x8,x8,9'
permutations.c: /tmp/cc3b9Xul.s:516: Error: immediate out of range at operand 3 -- `eor x8,x8,9'
permutations.c: /tmp/cc3b9Xul.s:595: Error: immediate out of range at operand 3 -- `eor x8,x8,9'
permutations.c: /tmp/cc3b9Xul.s:736: Error: immediate out of range at operand 3 -- `eor x13,x13,9'
permutations.c: /tmp/cc3b9Xul.s:894: Error: immediate out of range at operand 3 -- `eor x13,x13,9'
permutations.c: /tmp/cc3b9Xul.s:1164: Error: immediate out of range at operand 3 -- `eor x8,x8,9'
permutations.c: /tmp/cc3b9Xul.s:1243: Error: immediate out of range at operand 3 -- `eor x8,x8,9'
permutations.c: /tmp/cc3b9Xul.s:1384: Error: immediate out of range at operand 3 -- `eor x13,x13,9'
permutations.c: /tmp/cc3b9Xul.s:1542: Error: immediate out of range at operand 3 -- `eor x13,x13,9'

Number of similar (compiler,implementation) pairs: 1, namely:
CompilerImplementations
gcc -march=native -mtune=native -Os -fomit-frame-pointer -fwrapv -fPIC -fPIE bi32_armv6

Compiler output

Implementation: bi32_armv6m
Security model: constbranchindex
Compiler: clang -mcpu=native -O3 -fomit-frame-pointer -fwrapv -Qunused-arguments -fPIC -fPIE
aead.c: In file included from aead.c:4:
aead.c: In file included from ./permutations.h:11:
aead.c: ./round.h:164:14: error: invalid output constraint '+l' in asm
aead.c: [x0_l] "+l"(s->w[0][0]), [x0_h] "+h"(s->w[0][1]), [x1_l] "+l"(s->w[1][0]),
aead.c: ^
aead.c: ./round.h:314:14: error: invalid output constraint '+l' in asm
aead.c: [x0_l] "+l"(s->w[0][0]), [x0_h] "+h"(s->w[0][1]), [x1_l] "+l"(s->w[1][0]),
aead.c: ^
aead.c: 2 errors generated.

Number of similar (compiler,implementation) pairs: 1, namely:
CompilerImplementations
clang -mcpu=native -O3 -fomit-frame-pointer -fwrapv -Qunused-arguments -fPIC -fPIE bi32_armv6m

Compiler output

Implementation: bi32_armv6m
Security model: constbranchindex
Compiler: gcc -march=native -mtune=native -O2 -fomit-frame-pointer -fwrapv -fPIC -fPIE
aead.c: In file included from permutations.h:11,
aead.c: from aead.c:4:
aead.c: aead.c: In function 'crypto_aead_ascon128av12_bi32_armv6m_constbranchindex_encrypt':
aead.c: round.h:13:3: error: impossible constraint in 'asm'
aead.c: __asm__ __volatile__(
aead.c: ^~~~~~~
aead.c: round.h:13:3: error: impossible constraint in 'asm'
aead.c: __asm__ __volatile__(
aead.c: ^~~~~~~
aead.c: round.h:13:3: error: impossible constraint in 'asm'
aead.c: __asm__ __volatile__(
aead.c: ^~~~~~~
aead.c: round.h:13:3: error: impossible constraint in 'asm'
aead.c: __asm__ __volatile__(
aead.c: ^~~~~~~
aead.c: round.h:13:3: error: impossible constraint in 'asm'
aead.c: __asm__ __volatile__(
aead.c: ^~~~~~~

Number of similar (compiler,implementation) pairs: 4, namely:
CompilerImplementations
gcc -march=native -mtune=native -O2 -fomit-frame-pointer -fwrapv -fPIC -fPIE bi32_armv6m
gcc -march=native -mtune=native -O3 -fomit-frame-pointer -fwrapv -fPIC -fPIE bi32_armv6m
gcc -march=native -mtune=native -O -fomit-frame-pointer -fwrapv -fPIC -fPIE bi32_armv6m
gcc -march=native -mtune=native -Os -fomit-frame-pointer -fwrapv -fPIC -fPIE bi32_armv6m

Compiler output

Implementation: bi32_armv7m
Security model: constbranchindex
Compiler: clang -mcpu=native -O3 -fomit-frame-pointer -fwrapv -Qunused-arguments -fPIC -fPIE
aead.c: In file included from aead.c:4:
aead.c: In file included from ./permutations.h:11:
aead.c: ./round.h:78:19: warning: value size does not match register size specified by the constraint and modifier [-Wasm-operand-widths]
aead.c: [tmp1] "=r"(tmp1)
aead.c: ^
aead.c: ./round.h:15:13: note: use constraint modifier "w"
aead.c: "ldrb %[tmp1], [%[C]], #1\n\t"
aead.c: ^~~~~~~
aead.c: %w[tmp1]
aead.c: ./round.h:74:19: warning: value size does not match register size specified by the constraint and modifier [-Wasm-operand-widths]
aead.c: [x0_l] "+r"(s->w[0][0]), [x0_h] "+r"(s->w[0][1]), [x1_l] "+r"(s->w[1][0]),
aead.c: ^
aead.c: ./round.h:16:12: note: use constraint modifier "w"
aead.c: "eor %[x0_l], %[x0_l], %[x4_l]\n\t"
aead.c: ^~~~~~~
aead.c: %w[x0_l]
aead.c: ./round.h:74:19: warning: value size does not match register size specified by the constraint and modifier [-Wasm-operand-widths]
aead.c: [x0_l] "+r"(s->w[0][0]), [x0_h] "+r"(s->w[0][1]), [x1_l] "+r"(s->w[1][0]),
aead.c: ^
aead.c: ./round.h:16:21: note: use constraint modifier "w"
aead.c: "eor %[x0_l], %[x0_l], %[x4_l]\n\t"
aead.c: ^~~~~~~
aead.c: %w[x0_l]
aead.c: ./round.h:76:69: warning: value size does not match register size specified by the constraint and modifier [-Wasm-operand-widths]
aead.c: [x3_l] "+r"(s->w[3][0]), [x3_h] "+r"(s->w[3][1]), [x4_l] "+r"(s->w[4][0]),
aead.c: ...

Number of similar (compiler,implementation) pairs: 2, namely:
CompilerImplementations
clang -mcpu=native -O3 -fomit-frame-pointer -fwrapv -Qunused-arguments -fPIC -fPIE bi32_armv7m bi32_armv7m_small

Compiler output

Implementation: bi32_armv7m
Security model: constbranchindex
Compiler: gcc -march=native -mtune=native -O2 -fomit-frame-pointer -fwrapv -fPIC -fPIE
aead.c: /tmp/ccZpfgIa.s: Assembler messages:
aead.c: /tmp/ccZpfgIa.s:293: Error: immediate out of range at operand 3 -- `eor x21,x21,9'
aead.c: /tmp/ccZpfgIa.s:386: Error: immediate out of range at operand 3 -- `eor x11,x11,9'
aead.c: /tmp/ccZpfgIa.s:447: Error: immediate out of range at operand 3 -- `eor x21,x21,9'
aead.c: /tmp/ccZpfgIa.s:463: Error: immediate out of range at operand 3 -- `eor x11,x11,9'
aead.c: /tmp/ccZpfgIa.s:694: Error: immediate out of range at operand 3 -- `eor x11,x11,9'
aead.c: /tmp/ccZpfgIa.s:771: Error: immediate out of range at operand 3 -- `eor x11,x11,9'
aead.c: /tmp/ccZpfgIa.s:909: Error: immediate out of range at operand 3 -- `eor x21,x21,9'
aead.c: /tmp/ccZpfgIa.s:1042: Error: immediate out of range at operand 3 -- `eor x7,x7,9'
aead.c: /tmp/ccZpfgIa.s:1473: Error: immediate out of range at operand 3 -- `eor x23,x23,9'
aead.c: /tmp/ccZpfgIa.s:1550: Error: immediate out of range at operand 3 -- `eor x23,x23,9'
aead.c: /tmp/ccZpfgIa.s:1687: Error: immediate out of range at operand 3 -- `eor x8,x8,9'
aead.c: /tmp/ccZpfgIa.s:1801: Error: immediate out of range at operand 3 -- `eor x8,x8,9'
aead.c: /tmp/ccZpfgIa.s:2159: Error: immediate out of range at operand 3 -- `eor x13,x13,9'
aead.c: /tmp/ccZpfgIa.s:2252: Error: immediate out of range at operand 3 -- `eor x8,x8,9'
aead.c: /tmp/ccZpfgIa.s:2313: Error: immediate out of range at operand 3 -- `eor x13,x13,9'
aead.c: /tmp/ccZpfgIa.s:2329: Error: immediate out of range at operand 3 -- `eor x8,x8,9'
aead.c: /tmp/ccZpfgIa.s:2560: Error: immediate out of range at operand 3 -- `eor x8,x8,9'
aead.c: /tmp/ccZpfgIa.s:2637: Error: immediate out of range at operand 3 -- `eor x8,x8,9'
aead.c: /tmp/ccZpfgIa.s:2775: Error: immediate out of range at operand 3 -- `eor x13,x13,9'
aead.c: /tmp/ccZpfgIa.s:2908: Error: immediate out of range at operand 3 -- `eor x5,x5,9'
aead.c: /tmp/ccZpfgIa.s:3354: Error: immediate out of range at operand 3 -- `eor x24,x24,9'
aead.c: /tmp/ccZpfgIa.s:3431: Error: immediate out of range at operand 3 -- `eor x24,x24,9'
aead.c: /tmp/ccZpfgIa.s:3568: Error: immediate out of range at operand 3 -- `eor x7,x7,9'
aead.c: /tmp/ccZpfgIa.s:3682: Error: immediate out of range at operand 3 -- `eor x7,x7,9'
aead.c: ...

Number of similar (compiler,implementation) pairs: 1, namely:
CompilerImplementations
gcc -march=native -mtune=native -O2 -fomit-frame-pointer -fwrapv -fPIC -fPIE bi32_armv7m

Compiler output

Implementation: bi32_armv7m
Security model: constbranchindex
Compiler: gcc -march=native -mtune=native -O3 -fomit-frame-pointer -fwrapv -fPIC -fPIE
aead.c: /tmp/ccUwSlwc.s: Assembler messages:
aead.c: /tmp/ccUwSlwc.s:293: Error: immediate out of range at operand 3 -- `eor x21,x21,9'
aead.c: /tmp/ccUwSlwc.s:386: Error: immediate out of range at operand 3 -- `eor x11,x11,9'
aead.c: /tmp/ccUwSlwc.s:447: Error: immediate out of range at operand 3 -- `eor x21,x21,9'
aead.c: /tmp/ccUwSlwc.s:463: Error: immediate out of range at operand 3 -- `eor x11,x11,9'
aead.c: /tmp/ccUwSlwc.s:694: Error: immediate out of range at operand 3 -- `eor x11,x11,9'
aead.c: /tmp/ccUwSlwc.s:771: Error: immediate out of range at operand 3 -- `eor x11,x11,9'
aead.c: /tmp/ccUwSlwc.s:909: Error: immediate out of range at operand 3 -- `eor x21,x21,9'
aead.c: /tmp/ccUwSlwc.s:1042: Error: immediate out of range at operand 3 -- `eor x7,x7,9'
aead.c: /tmp/ccUwSlwc.s:1473: Error: immediate out of range at operand 3 -- `eor x23,x23,9'
aead.c: /tmp/ccUwSlwc.s:1550: Error: immediate out of range at operand 3 -- `eor x23,x23,9'
aead.c: /tmp/ccUwSlwc.s:1687: Error: immediate out of range at operand 3 -- `eor x8,x8,9'
aead.c: /tmp/ccUwSlwc.s:1801: Error: immediate out of range at operand 3 -- `eor x8,x8,9'
aead.c: /tmp/ccUwSlwc.s:2159: Error: immediate out of range at operand 3 -- `eor x13,x13,9'
aead.c: /tmp/ccUwSlwc.s:2252: Error: immediate out of range at operand 3 -- `eor x8,x8,9'
aead.c: /tmp/ccUwSlwc.s:2313: Error: immediate out of range at operand 3 -- `eor x13,x13,9'
aead.c: /tmp/ccUwSlwc.s:2329: Error: immediate out of range at operand 3 -- `eor x8,x8,9'
aead.c: /tmp/ccUwSlwc.s:2560: Error: immediate out of range at operand 3 -- `eor x8,x8,9'
aead.c: /tmp/ccUwSlwc.s:2637: Error: immediate out of range at operand 3 -- `eor x8,x8,9'
aead.c: /tmp/ccUwSlwc.s:2775: Error: immediate out of range at operand 3 -- `eor x13,x13,9'
aead.c: /tmp/ccUwSlwc.s:2908: Error: immediate out of range at operand 3 -- `eor x5,x5,9'
aead.c: /tmp/ccUwSlwc.s:3354: Error: immediate out of range at operand 3 -- `eor x24,x24,9'
aead.c: /tmp/ccUwSlwc.s:3431: Error: immediate out of range at operand 3 -- `eor x24,x24,9'
aead.c: /tmp/ccUwSlwc.s:3568: Error: immediate out of range at operand 3 -- `eor x7,x7,9'
aead.c: /tmp/ccUwSlwc.s:3682: Error: immediate out of range at operand 3 -- `eor x7,x7,9'
aead.c: ...

Number of similar (compiler,implementation) pairs: 1, namely:
CompilerImplementations
gcc -march=native -mtune=native -O3 -fomit-frame-pointer -fwrapv -fPIC -fPIE bi32_armv7m

Compiler output

Implementation: bi32_armv7m
Security model: constbranchindex
Compiler: gcc -march=native -mtune=native -O -fomit-frame-pointer -fwrapv -fPIC -fPIE
aead.c: /tmp/cch415A5.s: Assembler messages:
aead.c: /tmp/cch415A5.s:367: Error: immediate out of range at operand 3 -- `eor x19,x19,9'
aead.c: /tmp/cch415A5.s:460: Error: immediate out of range at operand 3 -- `eor x12,x12,9'
aead.c: /tmp/cch415A5.s:521: Error: immediate out of range at operand 3 -- `eor x19,x19,9'
aead.c: /tmp/cch415A5.s:537: Error: immediate out of range at operand 3 -- `eor x12,x12,9'
aead.c: /tmp/cch415A5.s:768: Error: immediate out of range at operand 3 -- `eor x12,x12,9'
aead.c: /tmp/cch415A5.s:845: Error: immediate out of range at operand 3 -- `eor x12,x12,9'
aead.c: /tmp/cch415A5.s:983: Error: immediate out of range at operand 3 -- `eor x19,x19,9'
aead.c: /tmp/cch415A5.s:1116: Error: immediate out of range at operand 3 -- `eor x7,x7,9'
aead.c: /tmp/cch415A5.s:1516: Error: immediate out of range at operand 3 -- `eor x12,x12,9'
aead.c: /tmp/cch415A5.s:1593: Error: immediate out of range at operand 3 -- `eor x12,x12,9'
aead.c: /tmp/cch415A5.s:1730: Error: immediate out of range at operand 3 -- `eor x9,x9,9'
aead.c: /tmp/cch415A5.s:1844: Error: immediate out of range at operand 3 -- `eor x9,x9,9'
aead.c: /tmp/cch415A5.s:2261: Error: immediate out of range at operand 3 -- `eor x10,x10,9'
aead.c: /tmp/cch415A5.s:2338: Error: immediate out of range at operand 3 -- `eor x10,x10,9'
aead.c: /tmp/cch415A5.s:2475: Error: immediate out of range at operand 3 -- `eor x5,x5,9'
aead.c: /tmp/cch415A5.s:2589: Error: immediate out of range at operand 3 -- `eor x5,x5,9'
aead.c: /tmp/cch415A5.s:3123: Error: immediate out of range at operand 3 -- `eor x10,x10,9'
aead.c: /tmp/cch415A5.s:3200: Error: immediate out of range at operand 3 -- `eor x10,x10,9'
aead.c: /tmp/cch415A5.s:3337: Error: immediate out of range at operand 3 -- `eor x7,x7,9'
aead.c: /tmp/cch415A5.s:3451: Error: immediate out of range at operand 3 -- `eor x7,x7,9'
aead.c: /tmp/cch415A5.s:3901: Error: immediate out of range at operand 3 -- `eor x16,x16,9'
aead.c: /tmp/cch415A5.s:3994: Error: immediate out of range at operand 3 -- `eor x9,x9,9'
aead.c: /tmp/cch415A5.s:4055: Error: immediate out of range at operand 3 -- `eor x16,x16,9'
aead.c: /tmp/cch415A5.s:4071: Error: immediate out of range at operand 3 -- `eor x9,x9,9'
aead.c: ...

Number of similar (compiler,implementation) pairs: 1, namely:
CompilerImplementations
gcc -march=native -mtune=native -O -fomit-frame-pointer -fwrapv -fPIC -fPIE bi32_armv7m

Compiler output

Implementation: bi32_armv7m
Security model: constbranchindex
Compiler: gcc -march=native -mtune=native -Os -fomit-frame-pointer -fwrapv -fPIC -fPIE
aead.c: /tmp/cc1f28Qn.s: Assembler messages:
aead.c: /tmp/cc1f28Qn.s:289: Error: immediate out of range at operand 3 -- `eor x30,x30,9'
aead.c: /tmp/cc1f28Qn.s:382: Error: immediate out of range at operand 3 -- `eor x16,x16,9'
aead.c: /tmp/cc1f28Qn.s:443: Error: immediate out of range at operand 3 -- `eor x30,x30,9'
aead.c: /tmp/cc1f28Qn.s:459: Error: immediate out of range at operand 3 -- `eor x16,x16,9'
aead.c: /tmp/cc1f28Qn.s:690: Error: immediate out of range at operand 3 -- `eor x16,x16,9'
aead.c: /tmp/cc1f28Qn.s:767: Error: immediate out of range at operand 3 -- `eor x16,x16,9'
aead.c: /tmp/cc1f28Qn.s:905: Error: immediate out of range at operand 3 -- `eor x30,x30,9'
aead.c: /tmp/cc1f28Qn.s:1038: Error: immediate out of range at operand 3 -- `eor x7,x7,9'
aead.c: /tmp/cc1f28Qn.s:1410: Error: immediate out of range at operand 3 -- `eor x13,x13,9'
aead.c: /tmp/cc1f28Qn.s:1487: Error: immediate out of range at operand 3 -- `eor x13,x13,9'
aead.c: /tmp/cc1f28Qn.s:1624: Error: immediate out of range at operand 3 -- `eor x5,x5,9'
aead.c: /tmp/cc1f28Qn.s:1738: Error: immediate out of range at operand 3 -- `eor x5,x5,9'
aead.c: /tmp/cc1f28Qn.s:2107: Error: immediate out of range at operand 3 -- `eor x17,x17,9'
aead.c: /tmp/cc1f28Qn.s:2200: Error: immediate out of range at operand 3 -- `eor x12,x12,9'
aead.c: /tmp/cc1f28Qn.s:2261: Error: immediate out of range at operand 3 -- `eor x17,x17,9'
aead.c: /tmp/cc1f28Qn.s:2277: Error: immediate out of range at operand 3 -- `eor x12,x12,9'
aead.c: /tmp/cc1f28Qn.s:2508: Error: immediate out of range at operand 3 -- `eor x12,x12,9'
aead.c: /tmp/cc1f28Qn.s:2585: Error: immediate out of range at operand 3 -- `eor x12,x12,9'
aead.c: /tmp/cc1f28Qn.s:2723: Error: immediate out of range at operand 3 -- `eor x17,x17,9'
aead.c: /tmp/cc1f28Qn.s:2856: Error: immediate out of range at operand 3 -- `eor x6,x6,9'
aead.c: /tmp/cc1f28Qn.s:3292: Error: immediate out of range at operand 3 -- `eor x15,x15,9'
aead.c: /tmp/cc1f28Qn.s:3369: Error: immediate out of range at operand 3 -- `eor x15,x15,9'
aead.c: /tmp/cc1f28Qn.s:3506: Error: immediate out of range at operand 3 -- `eor x13,x13,9'
aead.c: /tmp/cc1f28Qn.s:3620: Error: immediate out of range at operand 3 -- `eor x13,x13,9'
aead.c: ...

Number of similar (compiler,implementation) pairs: 1, namely:
CompilerImplementations
gcc -march=native -mtune=native -Os -fomit-frame-pointer -fwrapv -fPIC -fPIE bi32_armv7m

Compiler output

Implementation: bi32_armv7m_small
Security model: constbranchindex
Compiler: gcc -march=native -mtune=native -O2 -fomit-frame-pointer -fwrapv -fPIC -fPIE
permutations.c: /tmp/ccNmhXRr.s: Assembler messages:
permutations.c: /tmp/ccNmhXRr.s:26: Error: operand mismatch -- `ldrb x14,[x1],#1'
permutations.c: /tmp/ccNmhXRr.s:26: Info: did you mean this?
permutations.c: /tmp/ccNmhXRr.s:26: Info: ldrb w14, [x1], #1
permutations.c: /tmp/ccNmhXRr.s:41: Error: operand mismatch -- `ldrb x14,[x1],#1'
permutations.c: /tmp/ccNmhXRr.s:41: Info: did you mean this?
permutations.c: /tmp/ccNmhXRr.s:41: Info: ldrb w14, [x1], #1

Number of similar (compiler,implementation) pairs: 1, namely:
CompilerImplementations
gcc -march=native -mtune=native -O2 -fomit-frame-pointer -fwrapv -fPIC -fPIE bi32_armv7m_small

Compiler output

Implementation: bi32_armv7m_small
Security model: constbranchindex
Compiler: gcc -march=native -mtune=native -O3 -fomit-frame-pointer -fwrapv -fPIC -fPIE
permutations.c: /tmp/ccQpytWb.s: Assembler messages:
permutations.c: /tmp/ccQpytWb.s:26: Error: operand mismatch -- `ldrb x14,[x1],#1'
permutations.c: /tmp/ccQpytWb.s:26: Info: did you mean this?
permutations.c: /tmp/ccQpytWb.s:26: Info: ldrb w14, [x1], #1
permutations.c: /tmp/ccQpytWb.s:41: Error: operand mismatch -- `ldrb x14,[x1],#1'
permutations.c: /tmp/ccQpytWb.s:41: Info: did you mean this?
permutations.c: /tmp/ccQpytWb.s:41: Info: ldrb w14, [x1], #1

Number of similar (compiler,implementation) pairs: 1, namely:
CompilerImplementations
gcc -march=native -mtune=native -O3 -fomit-frame-pointer -fwrapv -fPIC -fPIE bi32_armv7m_small

Compiler output

Implementation: bi32_armv7m_small
Security model: constbranchindex
Compiler: gcc -march=native -mtune=native -O -fomit-frame-pointer -fwrapv -fPIC -fPIE
permutations.c: /tmp/ccARe5K8.s: Assembler messages:
permutations.c: /tmp/ccARe5K8.s:30: Error: operand mismatch -- `ldrb x14,[x1],#1'
permutations.c: /tmp/ccARe5K8.s:30: Info: did you mean this?
permutations.c: /tmp/ccARe5K8.s:30: Info: ldrb w14, [x1], #1
permutations.c: /tmp/ccARe5K8.s:45: Error: operand mismatch -- `ldrb x14,[x1],#1'
permutations.c: /tmp/ccARe5K8.s:45: Info: did you mean this?
permutations.c: /tmp/ccARe5K8.s:45: Info: ldrb w14, [x1], #1

Number of similar (compiler,implementation) pairs: 1, namely:
CompilerImplementations
gcc -march=native -mtune=native -O -fomit-frame-pointer -fwrapv -fPIC -fPIE bi32_armv7m_small

Compiler output

Implementation: bi32_armv7m_small
Security model: constbranchindex
Compiler: gcc -march=native -mtune=native -Os -fomit-frame-pointer -fwrapv -fPIC -fPIE
permutations.c: /tmp/ccsSgXru.s: Assembler messages:
permutations.c: /tmp/ccsSgXru.s:25: Error: operand mismatch -- `ldrb x14,[x1],#1'
permutations.c: /tmp/ccsSgXru.s:25: Info: did you mean this?
permutations.c: /tmp/ccsSgXru.s:25: Info: ldrb w14, [x1], #1
permutations.c: /tmp/ccsSgXru.s:40: Error: operand mismatch -- `ldrb x14,[x1],#1'
permutations.c: /tmp/ccsSgXru.s:40: Info: did you mean this?
permutations.c: /tmp/ccsSgXru.s:40: Info: ldrb w14, [x1], #1

Number of similar (compiler,implementation) pairs: 1, namely:
CompilerImplementations
gcc -march=native -mtune=native -Os -fomit-frame-pointer -fwrapv -fPIC -fPIE bi32_armv7m_small

Compiler output

Implementation: T:esp32
Security model: timingleaks
Compiler: clang -mcpu=native -O3 -fomit-frame-pointer -fwrapv -Qunused-arguments -fPIC -fPIE
try.c: /usr/bin/ld: /tmp/try-small-f6f3f2.o: in function `doit':
try.c: try-small.c:(.text+0x...): undefined reference to `crypto_aead_ascon128av12_esp32_timingleaks_encrypt'
try.c: /usr/bin/ld: try-small.c:(.text+0x...): undefined reference to `crypto_aead_ascon128av12_esp32_timingleaks_decrypt'
try.c: /usr/bin/ld: /tmp/try-small-f6f3f2.o: in function `test':
try.c: try-small.c:(.text+0x...): undefined reference to `crypto_aead_ascon128av12_esp32_timingleaks_encrypt'
try.c: /usr/bin/ld: try-small.c:(.text+0x...): undefined reference to `crypto_aead_ascon128av12_esp32_timingleaks_encrypt'
try.c: /usr/bin/ld: try-small.c:(.text+0x...): undefined reference to `crypto_aead_ascon128av12_esp32_timingleaks_decrypt'
try.c: /usr/bin/ld: try-small.c:(.text+0x...): undefined reference to `crypto_aead_ascon128av12_esp32_timingleaks_decrypt'
try.c: /usr/bin/ld: try-small.c:(.text+0x...): undefined reference to `crypto_aead_ascon128av12_esp32_timingleaks_decrypt'
try.c: /usr/bin/ld: try-small.c:(.text+0x...): undefined reference to `crypto_aead_ascon128av12_esp32_timingleaks_decrypt'
try.c: /usr/bin/ld: try-small.c:(.text+0x...): undefined reference to `crypto_aead_ascon128av12_esp32_timingleaks_decrypt'
try.c: clang: error: linker command failed with exit code 1 (use -v to see invocation)

Number of similar (compiler,implementation) pairs: 1, namely:
CompilerImplementations
clang -mcpu=native -O3 -fomit-frame-pointer -fwrapv -Qunused-arguments -fPIC -fPIE T:esp32

Compiler output

Implementation: T:esp32
Security model: timingleaks
Compiler: gcc -march=native -mtune=native -O2 -fomit-frame-pointer -fwrapv -fPIC -fPIE
try.c: /usr/bin/ld: /tmp/ccN3BdDX.o: in function `doit':
try.c: try-small.c:(.text+0x...): undefined reference to `crypto_aead_ascon128av12_esp32_timingleaks_encrypt'
try.c: /usr/bin/ld: try-small.c:(.text+0x...): undefined reference to `crypto_aead_ascon128av12_esp32_timingleaks_decrypt'
try.c: /usr/bin/ld: /tmp/ccN3BdDX.o: in function `test':
try.c: try-small.c:(.text+0x...): undefined reference to `crypto_aead_ascon128av12_esp32_timingleaks_encrypt'
try.c: /usr/bin/ld: try-small.c:(.text+0x...): undefined reference to `crypto_aead_ascon128av12_esp32_timingleaks_decrypt'
try.c: /usr/bin/ld: try-small.c:(.text+0x...): undefined reference to `crypto_aead_ascon128av12_esp32_timingleaks_decrypt'
try.c: /usr/bin/ld: try-small.c:(.text+0x...): undefined reference to `crypto_aead_ascon128av12_esp32_timingleaks_decrypt'
try.c: /usr/bin/ld: try-small.c:(.text+0x...): undefined reference to `crypto_aead_ascon128av12_esp32_timingleaks_decrypt'
try.c: /usr/bin/ld: try-small.c:(.text+0x...): undefined reference to `crypto_aead_ascon128av12_esp32_timingleaks_decrypt'
try.c: /usr/bin/ld: try-small.c:(.text+0x...): undefined reference to `crypto_aead_ascon128av12_esp32_timingleaks_encrypt'
try.c: collect2: error: ld returned 1 exit status

Number of similar (compiler,implementation) pairs: 1, namely:
CompilerImplementations
gcc -march=native -mtune=native -O2 -fomit-frame-pointer -fwrapv -fPIC -fPIE T:esp32

Compiler output

Implementation: T:esp32
Security model: timingleaks
Compiler: gcc -march=native -mtune=native -O3 -fomit-frame-pointer -fwrapv -fPIC -fPIE
try.c: /usr/bin/ld: /tmp/cc5YlqXO.o: in function `doit':
try.c: try-small.c:(.text+0x...): undefined reference to `crypto_aead_ascon128av12_esp32_timingleaks_encrypt'
try.c: /usr/bin/ld: try-small.c:(.text+0x...): undefined reference to `crypto_aead_ascon128av12_esp32_timingleaks_decrypt'
try.c: /usr/bin/ld: /tmp/cc5YlqXO.o: in function `test':
try.c: try-small.c:(.text+0x...): undefined reference to `crypto_aead_ascon128av12_esp32_timingleaks_encrypt'
try.c: /usr/bin/ld: try-small.c:(.text+0x...): undefined reference to `crypto_aead_ascon128av12_esp32_timingleaks_decrypt'
try.c: /usr/bin/ld: try-small.c:(.text+0x...): undefined reference to `crypto_aead_ascon128av12_esp32_timingleaks_decrypt'
try.c: /usr/bin/ld: try-small.c:(.text+0x...): undefined reference to `crypto_aead_ascon128av12_esp32_timingleaks_decrypt'
try.c: /usr/bin/ld: try-small.c:(.text+0x...): undefined reference to `crypto_aead_ascon128av12_esp32_timingleaks_decrypt'
try.c: /usr/bin/ld: try-small.c:(.text+0x...): undefined reference to `crypto_aead_ascon128av12_esp32_timingleaks_decrypt'
try.c: /usr/bin/ld: try-small.c:(.text+0x...): undefined reference to `crypto_aead_ascon128av12_esp32_timingleaks_encrypt'
try.c: collect2: error: ld returned 1 exit status

Number of similar (compiler,implementation) pairs: 1, namely:
CompilerImplementations
gcc -march=native -mtune=native -O3 -fomit-frame-pointer -fwrapv -fPIC -fPIE T:esp32

Compiler output

Implementation: T:esp32
Security model: timingleaks
Compiler: gcc -march=native -mtune=native -O -fomit-frame-pointer -fwrapv -fPIC -fPIE
try.c: /usr/bin/ld: /tmp/ccU23aPi.o: in function `doit':
try.c: try-small.c:(.text+0x...): undefined reference to `crypto_aead_ascon128av12_esp32_timingleaks_encrypt'
try.c: /usr/bin/ld: try-small.c:(.text+0x...): undefined reference to `crypto_aead_ascon128av12_esp32_timingleaks_decrypt'
try.c: /usr/bin/ld: /tmp/ccU23aPi.o: in function `test':
try.c: try-small.c:(.text+0x...): undefined reference to `crypto_aead_ascon128av12_esp32_timingleaks_encrypt'
try.c: /usr/bin/ld: try-small.c:(.text+0x...): undefined reference to `crypto_aead_ascon128av12_esp32_timingleaks_encrypt'
try.c: /usr/bin/ld: try-small.c:(.text+0x...): undefined reference to `crypto_aead_ascon128av12_esp32_timingleaks_decrypt'
try.c: /usr/bin/ld: try-small.c:(.text+0x...): undefined reference to `crypto_aead_ascon128av12_esp32_timingleaks_decrypt'
try.c: /usr/bin/ld: try-small.c:(.text+0x...): undefined reference to `crypto_aead_ascon128av12_esp32_timingleaks_decrypt'
try.c: /usr/bin/ld: try-small.c:(.text+0x...): undefined reference to `crypto_aead_ascon128av12_esp32_timingleaks_decrypt'
try.c: /usr/bin/ld: try-small.c:(.text+0x...): undefined reference to `crypto_aead_ascon128av12_esp32_timingleaks_decrypt'
try.c: collect2: error: ld returned 1 exit status

Number of similar (compiler,implementation) pairs: 1, namely:
CompilerImplementations
gcc -march=native -mtune=native -O -fomit-frame-pointer -fwrapv -fPIC -fPIE T:esp32

Compiler output

Implementation: T:esp32
Security model: timingleaks
Compiler: gcc -march=native -mtune=native -Os -fomit-frame-pointer -fwrapv -fPIC -fPIE
try.c: /usr/bin/ld: /tmp/ccfK1ggC.o: in function `doit':
try.c: try-small.c:(.text+0x...): undefined reference to `crypto_aead_ascon128av12_esp32_timingleaks_encrypt'
try.c: /usr/bin/ld: try-small.c:(.text+0x...): undefined reference to `crypto_aead_ascon128av12_esp32_timingleaks_decrypt'
try.c: /usr/bin/ld: /tmp/ccfK1ggC.o: in function `test':
try.c: try-small.c:(.text+0x...): undefined reference to `crypto_aead_ascon128av12_esp32_timingleaks_encrypt'
try.c: /usr/bin/ld: try-small.c:(.text+0x...): undefined reference to `crypto_aead_ascon128av12_esp32_timingleaks_encrypt'
try.c: /usr/bin/ld: try-small.c:(.text+0x...): undefined reference to `crypto_aead_ascon128av12_esp32_timingleaks_decrypt'
try.c: /usr/bin/ld: try-small.c:(.text+0x...): undefined reference to `crypto_aead_ascon128av12_esp32_timingleaks_decrypt'
try.c: /usr/bin/ld: try-small.c:(.text+0x...): undefined reference to `crypto_aead_ascon128av12_esp32_timingleaks_decrypt'
try.c: /usr/bin/ld: try-small.c:(.text+0x...): undefined reference to `crypto_aead_ascon128av12_esp32_timingleaks_decrypt'
try.c: /usr/bin/ld: try-small.c:(.text+0x...): undefined reference to `crypto_aead_ascon128av12_esp32_timingleaks_decrypt'
try.c: collect2: error: ld returned 1 exit status

Number of similar (compiler,implementation) pairs: 1, namely:
CompilerImplementations
gcc -march=native -mtune=native -Os -fomit-frame-pointer -fwrapv -fPIC -fPIE T:esp32

Compiler output

Implementation: neon
Security model: constbranchindex
Compiler: clang -mcpu=native -O3 -fomit-frame-pointer -fwrapv -Qunused-arguments -fPIC -fPIE
aead.c: aead.c:164:5: warning: value size does not match register size specified by the constraint and modifier [-Wasm-operand-widths]
aead.c: AD(8, 16, "q0", "q8");
aead.c: ^
aead.c: aead.c:32:28: note: expanded from macro 'AD'
aead.c: : [adlen_hi] "+r" (adlen_hi), [adlen_lo] "+r" (adlen_lo), \
aead.c: ^
aead.c: aead.c:164:5: note: use constraint modifier "w"
aead.c: aead.c:14:14: note: expanded from macro 'AD'
aead.c: "cmp %[adlen_hi], #0 \n\t" \
aead.c: ^
aead.c: aead.c:164:5: warning: value size does not match register size specified by the constraint and modifier [-Wasm-operand-widths]
aead.c: AD(8, 16, "q0", "q8");
aead.c: ^
aead.c: aead.c:32:56: note: expanded from macro 'AD'
aead.c: : [adlen_hi] "+r" (adlen_hi), [adlen_lo] "+r" (adlen_lo), \
aead.c: ^
aead.c: aead.c:164:5: note: use constraint modifier "w"
aead.c: aead.c:15:16: note: expanded from macro 'AD'
aead.c: "cmpeq %[adlen_lo], #(%c[R]-1) \n\t" \
aead.c: ^
aead.c: aead.c:164:5: warning: value size does not match register size specified by the constraint and modifier [-Wasm-operand-widths]
aead.c: AD(8, 16, "q0", "q8");
aead.c: ^
aead.c: aead.c:32:56: note: expanded from macro 'AD'
aead.c: : [adlen_hi] "+r" (adlen_hi), [adlen_lo] "+r" (adlen_lo), \
aead.c: ...

Number of similar (compiler,implementation) pairs: 1, namely:
CompilerImplementations
clang -mcpu=native -O3 -fomit-frame-pointer -fwrapv -Qunused-arguments -fPIC -fPIE neon

Compiler output

Implementation: neon
Security model: constbranchindex
Compiler: gcc -march=native -mtune=native -O2 -fomit-frame-pointer -fwrapv -fPIC -fPIE
aead.c: /tmp/ccPm4dzR.s: Assembler messages:
aead.c: /tmp/ccPm4dzR.s:53: Error: unknown pseudo-op: `.arm'
aead.c: /tmp/ccPm4dzR.s:54: Error: unknown pseudo-op: `.fpu'
aead.c: /tmp/ccPm4dzR.s:55: Error: unknown mnemonic `vldm' -- `vldm x0,{d0-d4}'
aead.c: /tmp/ccPm4dzR.s:56: Error: unknown mnemonic `vmvn' -- `vmvn d2,d2'
aead.c: /tmp/ccPm4dzR.s:57: Error: unknown mnemonic `vldr' -- `vldr d31,[x3,#0]'
aead.c: /tmp/ccPm4dzR.s:58: Error: unknown mnemonic `veor' -- `veor d0,d0,d4'
aead.c: /tmp/ccPm4dzR.s:59: Error: unknown mnemonic `veor' -- `veor d4,d4,d3'
aead.c: /tmp/ccPm4dzR.s:60: Error: unknown mnemonic `veor' -- `veor d2,d2,d31'
aead.c: /tmp/ccPm4dzR.s:61: Error: unknown mnemonic `vbic' -- `vbic d13,d0,d4'
aead.c: /tmp/ccPm4dzR.s:62: Error: unknown mnemonic `vbic' -- `vbic d12,d4,d3'
aead.c: /tmp/ccPm4dzR.s:63: Error: unknown mnemonic `veor' -- `veor d2,d2,d1'
aead.c: /tmp/ccPm4dzR.s:64: Error: unknown mnemonic `vbic' -- `vbic d14,d1,d0'
aead.c: /tmp/ccPm4dzR.s:65: Error: unknown mnemonic `vbic' -- `vbic d11,d3,d2'
aead.c: /tmp/ccPm4dzR.s:66: Error: unknown mnemonic `vbic' -- `vbic d10,d2,d1'
aead.c: /tmp/ccPm4dzR.s:67: Error: unknown mnemonic `veor' -- `veor q0,q0,q5'
aead.c: /tmp/ccPm4dzR.s:68: Error: unknown mnemonic `veor' -- `veor q1,q1,q6'
aead.c: /tmp/ccPm4dzR.s:69: Error: unknown mnemonic `veor' -- `veor d4,d4,d14'
aead.c: /tmp/ccPm4dzR.s:70: Error: unknown mnemonic `veor' -- `veor d1,d1,d0'
aead.c: /tmp/ccPm4dzR.s:71: Error: unknown mnemonic `veor' -- `veor d3,d3,d2'
aead.c: /tmp/ccPm4dzR.s:72: Error: unknown mnemonic `veor' -- `veor d0,d0,d4'
aead.c: /tmp/ccPm4dzR.s:73: Error: unknown mnemonic `vsri.64' -- `vsri.64 d14,d4,#7'
aead.c: /tmp/ccPm4dzR.s:74: Error: unknown mnemonic `vsri.64' -- `vsri.64 d24,d4,#41'
aead.c: /tmp/ccPm4dzR.s:75: Error: unknown mnemonic `vsri.64' -- `vsri.64 d11,d1,#39'
aead.c: /tmp/ccPm4dzR.s:76: Error: unknown mnemonic `vsri.64' -- `vsri.64 d21,d1,#61'
aead.c: ...

Number of similar (compiler,implementation) pairs: 1, namely:
CompilerImplementations
gcc -march=native -mtune=native -O2 -fomit-frame-pointer -fwrapv -fPIC -fPIE neon

Compiler output

Implementation: neon
Security model: constbranchindex
Compiler: gcc -march=native -mtune=native -O3 -fomit-frame-pointer -fwrapv -fPIC -fPIE
aead.c: /tmp/ccf1pWlv.s: Assembler messages:
aead.c: /tmp/ccf1pWlv.s:53: Error: unknown pseudo-op: `.arm'
aead.c: /tmp/ccf1pWlv.s:54: Error: unknown pseudo-op: `.fpu'
aead.c: /tmp/ccf1pWlv.s:55: Error: unknown mnemonic `vldm' -- `vldm x0,{d0-d4}'
aead.c: /tmp/ccf1pWlv.s:56: Error: unknown mnemonic `vmvn' -- `vmvn d2,d2'
aead.c: /tmp/ccf1pWlv.s:57: Error: unknown mnemonic `vldr' -- `vldr d31,[x3,#0]'
aead.c: /tmp/ccf1pWlv.s:58: Error: unknown mnemonic `veor' -- `veor d0,d0,d4'
aead.c: /tmp/ccf1pWlv.s:59: Error: unknown mnemonic `veor' -- `veor d4,d4,d3'
aead.c: /tmp/ccf1pWlv.s:60: Error: unknown mnemonic `veor' -- `veor d2,d2,d31'
aead.c: /tmp/ccf1pWlv.s:61: Error: unknown mnemonic `vbic' -- `vbic d13,d0,d4'
aead.c: /tmp/ccf1pWlv.s:62: Error: unknown mnemonic `vbic' -- `vbic d12,d4,d3'
aead.c: /tmp/ccf1pWlv.s:63: Error: unknown mnemonic `veor' -- `veor d2,d2,d1'
aead.c: /tmp/ccf1pWlv.s:64: Error: unknown mnemonic `vbic' -- `vbic d14,d1,d0'
aead.c: /tmp/ccf1pWlv.s:65: Error: unknown mnemonic `vbic' -- `vbic d11,d3,d2'
aead.c: /tmp/ccf1pWlv.s:66: Error: unknown mnemonic `vbic' -- `vbic d10,d2,d1'
aead.c: /tmp/ccf1pWlv.s:67: Error: unknown mnemonic `veor' -- `veor q0,q0,q5'
aead.c: /tmp/ccf1pWlv.s:68: Error: unknown mnemonic `veor' -- `veor q1,q1,q6'
aead.c: /tmp/ccf1pWlv.s:69: Error: unknown mnemonic `veor' -- `veor d4,d4,d14'
aead.c: /tmp/ccf1pWlv.s:70: Error: unknown mnemonic `veor' -- `veor d1,d1,d0'
aead.c: /tmp/ccf1pWlv.s:71: Error: unknown mnemonic `veor' -- `veor d3,d3,d2'
aead.c: /tmp/ccf1pWlv.s:72: Error: unknown mnemonic `veor' -- `veor d0,d0,d4'
aead.c: /tmp/ccf1pWlv.s:73: Error: unknown mnemonic `vsri.64' -- `vsri.64 d14,d4,#7'
aead.c: /tmp/ccf1pWlv.s:74: Error: unknown mnemonic `vsri.64' -- `vsri.64 d24,d4,#41'
aead.c: /tmp/ccf1pWlv.s:75: Error: unknown mnemonic `vsri.64' -- `vsri.64 d11,d1,#39'
aead.c: /tmp/ccf1pWlv.s:76: Error: unknown mnemonic `vsri.64' -- `vsri.64 d21,d1,#61'
aead.c: ...

Number of similar (compiler,implementation) pairs: 1, namely:
CompilerImplementations
gcc -march=native -mtune=native -O3 -fomit-frame-pointer -fwrapv -fPIC -fPIE neon

Compiler output

Implementation: neon
Security model: constbranchindex
Compiler: gcc -march=native -mtune=native -O -fomit-frame-pointer -fwrapv -fPIC -fPIE
aead.c: /tmp/cclWw9re.s: Assembler messages:
aead.c: /tmp/cclWw9re.s:128: Error: unknown pseudo-op: `.arm'
aead.c: /tmp/cclWw9re.s:129: Error: unknown pseudo-op: `.fpu'
aead.c: /tmp/cclWw9re.s:130: Error: unknown mnemonic `vldm' -- `vldm x0,{d0-d4}'
aead.c: /tmp/cclWw9re.s:131: Error: unknown mnemonic `vmvn' -- `vmvn d2,d2'
aead.c: /tmp/cclWw9re.s:132: Error: unknown mnemonic `vldr' -- `vldr d31,[x2,#0]'
aead.c: /tmp/cclWw9re.s:133: Error: unknown mnemonic `veor' -- `veor d0,d0,d4'
aead.c: /tmp/cclWw9re.s:134: Error: unknown mnemonic `veor' -- `veor d4,d4,d3'
aead.c: /tmp/cclWw9re.s:135: Error: unknown mnemonic `veor' -- `veor d2,d2,d31'
aead.c: /tmp/cclWw9re.s:136: Error: unknown mnemonic `vbic' -- `vbic d13,d0,d4'
aead.c: /tmp/cclWw9re.s:137: Error: unknown mnemonic `vbic' -- `vbic d12,d4,d3'
aead.c: /tmp/cclWw9re.s:138: Error: unknown mnemonic `veor' -- `veor d2,d2,d1'
aead.c: /tmp/cclWw9re.s:139: Error: unknown mnemonic `vbic' -- `vbic d14,d1,d0'
aead.c: /tmp/cclWw9re.s:140: Error: unknown mnemonic `vbic' -- `vbic d11,d3,d2'
aead.c: /tmp/cclWw9re.s:141: Error: unknown mnemonic `vbic' -- `vbic d10,d2,d1'
aead.c: /tmp/cclWw9re.s:142: Error: unknown mnemonic `veor' -- `veor q0,q0,q5'
aead.c: /tmp/cclWw9re.s:143: Error: unknown mnemonic `veor' -- `veor q1,q1,q6'
aead.c: /tmp/cclWw9re.s:144: Error: unknown mnemonic `veor' -- `veor d4,d4,d14'
aead.c: /tmp/cclWw9re.s:145: Error: unknown mnemonic `veor' -- `veor d1,d1,d0'
aead.c: /tmp/cclWw9re.s:146: Error: unknown mnemonic `veor' -- `veor d3,d3,d2'
aead.c: /tmp/cclWw9re.s:147: Error: unknown mnemonic `veor' -- `veor d0,d0,d4'
aead.c: /tmp/cclWw9re.s:148: Error: unknown mnemonic `vsri.64' -- `vsri.64 d14,d4,#7'
aead.c: /tmp/cclWw9re.s:149: Error: unknown mnemonic `vsri.64' -- `vsri.64 d24,d4,#41'
aead.c: /tmp/cclWw9re.s:150: Error: unknown mnemonic `vsri.64' -- `vsri.64 d11,d1,#39'
aead.c: /tmp/cclWw9re.s:151: Error: unknown mnemonic `vsri.64' -- `vsri.64 d21,d1,#61'
aead.c: ...

Number of similar (compiler,implementation) pairs: 1, namely:
CompilerImplementations
gcc -march=native -mtune=native -O -fomit-frame-pointer -fwrapv -fPIC -fPIE neon

Compiler output

Implementation: neon
Security model: constbranchindex
Compiler: gcc -march=native -mtune=native -Os -fomit-frame-pointer -fwrapv -fPIC -fPIE
aead.c: /tmp/cclRR6DP.s: Assembler messages:
aead.c: /tmp/cclRR6DP.s:52: Error: unknown pseudo-op: `.arm'
aead.c: /tmp/cclRR6DP.s:53: Error: unknown pseudo-op: `.fpu'
aead.c: /tmp/cclRR6DP.s:54: Error: unknown mnemonic `vldm' -- `vldm x0,{d0-d4}'
aead.c: /tmp/cclRR6DP.s:55: Error: unknown mnemonic `vmvn' -- `vmvn d2,d2'
aead.c: /tmp/cclRR6DP.s:56: Error: unknown mnemonic `vldr' -- `vldr d31,[x2,#0]'
aead.c: /tmp/cclRR6DP.s:57: Error: unknown mnemonic `veor' -- `veor d0,d0,d4'
aead.c: /tmp/cclRR6DP.s:58: Error: unknown mnemonic `veor' -- `veor d4,d4,d3'
aead.c: /tmp/cclRR6DP.s:59: Error: unknown mnemonic `veor' -- `veor d2,d2,d31'
aead.c: /tmp/cclRR6DP.s:60: Error: unknown mnemonic `vbic' -- `vbic d13,d0,d4'
aead.c: /tmp/cclRR6DP.s:61: Error: unknown mnemonic `vbic' -- `vbic d12,d4,d3'
aead.c: /tmp/cclRR6DP.s:62: Error: unknown mnemonic `veor' -- `veor d2,d2,d1'
aead.c: /tmp/cclRR6DP.s:63: Error: unknown mnemonic `vbic' -- `vbic d14,d1,d0'
aead.c: /tmp/cclRR6DP.s:64: Error: unknown mnemonic `vbic' -- `vbic d11,d3,d2'
aead.c: /tmp/cclRR6DP.s:65: Error: unknown mnemonic `vbic' -- `vbic d10,d2,d1'
aead.c: /tmp/cclRR6DP.s:66: Error: unknown mnemonic `veor' -- `veor q0,q0,q5'
aead.c: /tmp/cclRR6DP.s:67: Error: unknown mnemonic `veor' -- `veor q1,q1,q6'
aead.c: /tmp/cclRR6DP.s:68: Error: unknown mnemonic `veor' -- `veor d4,d4,d14'
aead.c: /tmp/cclRR6DP.s:69: Error: unknown mnemonic `veor' -- `veor d1,d1,d0'
aead.c: /tmp/cclRR6DP.s:70: Error: unknown mnemonic `veor' -- `veor d3,d3,d2'
aead.c: /tmp/cclRR6DP.s:71: Error: unknown mnemonic `veor' -- `veor d0,d0,d4'
aead.c: /tmp/cclRR6DP.s:72: Error: unknown mnemonic `vsri.64' -- `vsri.64 d14,d4,#7'
aead.c: /tmp/cclRR6DP.s:73: Error: unknown mnemonic `vsri.64' -- `vsri.64 d24,d4,#41'
aead.c: /tmp/cclRR6DP.s:74: Error: unknown mnemonic `vsri.64' -- `vsri.64 d11,d1,#39'
aead.c: /tmp/cclRR6DP.s:75: Error: unknown mnemonic `vsri.64' -- `vsri.64 d21,d1,#61'
aead.c: ...

Number of similar (compiler,implementation) pairs: 1, namely:
CompilerImplementations
gcc -march=native -mtune=native -Os -fomit-frame-pointer -fwrapv -fPIC -fPIE neon

Namespace violations

Implementation: bi32
Security model: constbranchindex
Compiler: clang -mcpu=native -O3 -fomit-frame-pointer -fwrapv -Qunused-arguments -fPIC -fPIE
constants.o constants R
interleave.o B R
permutations.o P12 T
permutations.o P8 T

Number of similar (compiler,implementation) pairs: 5, namely:
CompilerImplementations
clang -mcpu=native -O3 -fomit-frame-pointer -fwrapv -Qunused-arguments -fPIC -fPIE bi32
gcc -march=native -mtune=native -O2 -fomit-frame-pointer -fwrapv -fPIC -fPIE bi32
gcc -march=native -mtune=native -O3 -fomit-frame-pointer -fwrapv -fPIC -fPIE bi32
gcc -march=native -mtune=native -O -fomit-frame-pointer -fwrapv -fPIC -fPIE bi32
gcc -march=native -mtune=native -Os -fomit-frame-pointer -fwrapv -fPIC -fPIE bi32

Namespace violations

Implementation: bi32_lowreg
Security model: constbranchindex
Compiler: clang -mcpu=native -O3 -fomit-frame-pointer -fwrapv -Qunused-arguments -fPIC -fPIE
aead.o ascon_adata T
aead.o ascon_decrypt T
aead.o ascon_encrypt T
aead.o ascon_final T
aead.o ascon_initaead T
aead.o ascon_loadkey T
constants.o constants R
interleave.o B R

Number of similar (compiler,implementation) pairs: 5, namely:
CompilerImplementations
clang -mcpu=native -O3 -fomit-frame-pointer -fwrapv -Qunused-arguments -fPIC -fPIE bi32_lowreg
gcc -march=native -mtune=native -O2 -fomit-frame-pointer -fwrapv -fPIC -fPIE bi32_lowreg
gcc -march=native -mtune=native -O3 -fomit-frame-pointer -fwrapv -fPIC -fPIE bi32_lowreg
gcc -march=native -mtune=native -O -fomit-frame-pointer -fwrapv -fPIC -fPIE bi32_lowreg
gcc -march=native -mtune=native -Os -fomit-frame-pointer -fwrapv -fPIC -fPIE bi32_lowreg

Namespace violations

Implementation: bi32_lowsize
Security model: constbranchindex
Compiler: clang -mcpu=native -O3 -fomit-frame-pointer -fwrapv -Qunused-arguments -fPIC -fPIE
aead.o ascon_aead T
constants.o constants R
interleave.o B R
interleave.o FROMBI T
interleave.o TOBI T
permutations.o P T
update.o ascon_update T

Number of similar (compiler,implementation) pairs: 5, namely:
CompilerImplementations
clang -mcpu=native -O3 -fomit-frame-pointer -fwrapv -Qunused-arguments -fPIC -fPIE bi32_lowsize
gcc -march=native -mtune=native -O2 -fomit-frame-pointer -fwrapv -fPIC -fPIE bi32_lowsize
gcc -march=native -mtune=native -O3 -fomit-frame-pointer -fwrapv -fPIC -fPIE bi32_lowsize
gcc -march=native -mtune=native -O -fomit-frame-pointer -fwrapv -fPIC -fPIE bi32_lowsize
gcc -march=native -mtune=native -Os -fomit-frame-pointer -fwrapv -fPIC -fPIE bi32_lowsize

Namespace violations

Implementation: bi8
Security model: constbranchindex
Compiler: clang -mcpu=native -O3 -fomit-frame-pointer -fwrapv -Qunused-arguments -fPIC -fPIE
constants.o constants R
interleave.o FROMBI T
interleave.o TOBI T
permutations.o P T

Number of similar (compiler,implementation) pairs: 5, namely:
CompilerImplementations
clang -mcpu=native -O3 -fomit-frame-pointer -fwrapv -Qunused-arguments -fPIC -fPIE bi8
gcc -march=native -mtune=native -O2 -fomit-frame-pointer -fwrapv -fPIC -fPIE bi8
gcc -march=native -mtune=native -O3 -fomit-frame-pointer -fwrapv -fPIC -fPIE bi8
gcc -march=native -mtune=native -O -fomit-frame-pointer -fwrapv -fPIC -fPIE bi8
gcc -march=native -mtune=native -Os -fomit-frame-pointer -fwrapv -fPIC -fPIE bi8

Namespace violations

Implementation: opt32_lowsize
Security model: constbranchindex
Compiler: clang -mcpu=native -O3 -fomit-frame-pointer -fwrapv -Qunused-arguments -fPIC -fPIE
aead.o ascon_aead T
permutations.o P T
update.o ascon_update T

Number of similar (compiler,implementation) pairs: 10, namely:
CompilerImplementations
clang -mcpu=native -O3 -fomit-frame-pointer -fwrapv -Qunused-arguments -fPIC -fPIE opt32_lowsize
gcc -march=native -mtune=native -O2 -fomit-frame-pointer -fwrapv -fPIC -fPIE opt32_lowsize
gcc -march=native -mtune=native -O3 -fomit-frame-pointer -fwrapv -fPIC -fPIE opt32_lowsize
gcc -march=native -mtune=native -O -fomit-frame-pointer -fwrapv -fPIC -fPIE opt32_lowsize
gcc -march=native -mtune=native -Os -fomit-frame-pointer -fwrapv -fPIC -fPIE opt32_lowsize
clang -mcpu=native -O3 -fomit-frame-pointer -fwrapv -Qunused-arguments -fPIC -fPIE opt64_lowsize
gcc -march=native -mtune=native -O2 -fomit-frame-pointer -fwrapv -fPIC -fPIE opt64_lowsize
gcc -march=native -mtune=native -O3 -fomit-frame-pointer -fwrapv -fPIC -fPIE opt64_lowsize
gcc -march=native -mtune=native -O -fomit-frame-pointer -fwrapv -fPIC -fPIE opt64_lowsize
gcc -march=native -mtune=native -Os -fomit-frame-pointer -fwrapv -fPIC -fPIE opt64_lowsize

Namespace violations

Implementation: opt8
Security model: constbranchindex
Compiler: clang -mcpu=native -O3 -fomit-frame-pointer -fwrapv -Qunused-arguments -fPIC -fPIE
aead.o ascon_adata T
aead.o ascon_decrypt T
aead.o ascon_encrypt T
aead.o ascon_final T
aead.o ascon_initaead T
aead.o ascon_loadkey T
permutations.o P T

Number of similar (compiler,implementation) pairs: 5, namely:
CompilerImplementations
clang -mcpu=native -O3 -fomit-frame-pointer -fwrapv -Qunused-arguments -fPIC -fPIE opt8
gcc -march=native -mtune=native -O2 -fomit-frame-pointer -fwrapv -fPIC -fPIE opt8
gcc -march=native -mtune=native -O3 -fomit-frame-pointer -fwrapv -fPIC -fPIE opt8
gcc -march=native -mtune=native -O -fomit-frame-pointer -fwrapv -fPIC -fPIE opt8
gcc -march=native -mtune=native -Os -fomit-frame-pointer -fwrapv -fPIC -fPIE opt8

Namespace violations

Implementation: opt8_lowsize
Security model: constbranchindex
Compiler: clang -mcpu=native -O3 -fomit-frame-pointer -fwrapv -Qunused-arguments -fPIC -fPIE
aead.o ascon_final T
aead.o ascon_initaead T
aead.o ascon_loadkey T
permutations.o P T
update.o ascon_update T

Number of similar (compiler,implementation) pairs: 5, namely:
CompilerImplementations
clang -mcpu=native -O3 -fomit-frame-pointer -fwrapv -Qunused-arguments -fPIC -fPIE opt8_lowsize
gcc -march=native -mtune=native -O2 -fomit-frame-pointer -fwrapv -fPIC -fPIE opt8_lowsize
gcc -march=native -mtune=native -O3 -fomit-frame-pointer -fwrapv -fPIC -fPIE opt8_lowsize
gcc -march=native -mtune=native -O -fomit-frame-pointer -fwrapv -fPIC -fPIE opt8_lowsize
gcc -march=native -mtune=native -Os -fomit-frame-pointer -fwrapv -fPIC -fPIE opt8_lowsize