Implementation notes: aarch64, lepotatoamls905xcc, crypto_kem/ntskem13136

Computer: lepotatoamls905xcc
Architecture: aarch64
CPU ID: 410fd034
SUPERCOP version: 20191221
Operation: crypto_kem
Primitive: ntskem13136
TimeObject sizeTest sizeImplementationCompilerBenchmark dateSUPERCOP version
834352294517 84 16111583 896 1568optclang_-mcpu=native_-O3_-fomit-frame-pointer_-fwrapv_-Qunused-arguments_-fPIC_-fPIE2019121820191017
902286063156 84 1678738 960 1568optgcc_-march=native_-mtune=native_-O2_-fomit-frame-pointer_-fwrapv_-fPIC_-fPIE2019121820191017
1055004686244 84 16103034 968 1584optgcc_-march=native_-mtune=native_-O3_-fomit-frame-pointer_-fwrapv_-fPIC_-fPIE2019121820191017
1116161158777 84 1673401 944 1552optgcc_-march=native_-mtune=native_-Os_-fomit-frame-pointer_-fwrapv_-fPIC_-fPIE2019121820191017
1305601564056 84 1679538 960 1568optgcc_-march=native_-mtune=native_-O_-fomit-frame-pointer_-fwrapv_-fPIC_-fPIE2019121820191017
4625000930389 76 1647567 888 1568refclang_-mcpu=native_-O3_-fomit-frame-pointer_-fwrapv_-Qunused-arguments_-fPIC_-fPIE2019121820191017
4789724134800 76 1651578 952 1584refgcc_-march=native_-mtune=native_-O3_-fomit-frame-pointer_-fwrapv_-fPIC_-fPIE2019121820191017
5199699023840 76 1639386 952 1568refgcc_-march=native_-mtune=native_-O2_-fomit-frame-pointer_-fwrapv_-fPIC_-fPIE2019121820191017
6332877620517 76 1635081 936 1552refgcc_-march=native_-mtune=native_-Os_-fomit-frame-pointer_-fwrapv_-fPIC_-fPIE2019121820191017
6847182823576 76 1639026 952 1568refgcc_-march=native_-mtune=native_-O_-fomit-frame-pointer_-fwrapv_-fPIC_-fPIE2019121820191017

Compiler output

Implementation: crypto_kem/ntskem13136/sse2
Compiler: clang -mcpu=native -O3 -fomit-frame-pointer -fwrapv -Qunused-arguments -fPIC -fPIE
bitslice_bma_128.c: In file included from bitslice_bma_128.c:17:
bitslice_bma_128.c: ./bits.h:47:9: error: unknown type name '__m128i'
bitslice_bma_128.c: typedef __m128i vector;
bitslice_bma_128.c: ^
bitslice_bma_128.c: ./bits.h:98:11: error: unknown type name '__m128i'
bitslice_bma_128.c: const __m128i a_hi = _mm_unpackhi_epi64(a, a);
bitslice_bma_128.c: ^
bitslice_bma_128.c: ./bits.h:98:26: warning: implicit declaration of function '_mm_unpackhi_epi64' is invalid in C99 [-Wimplicit-function-declaration]
bitslice_bma_128.c: const __m128i a_hi = _mm_unpackhi_epi64(a, a);
bitslice_bma_128.c: ^
bitslice_bma_128.c: ./bits.h:99:21: warning: implicit declaration of function '_mm_cvtsi128_si64' is invalid in C99 [-Wimplicit-function-declaration]
bitslice_bma_128.c: return popcount(_mm_cvtsi128_si64(a_hi)) + popcount(_mm_cvtsi128_si64(a));
bitslice_bma_128.c: ^
bitslice_bma_128.c: In file included from bitslice_bma_128.c:18:
bitslice_bma_128.c: In file included from ./bitslice_bma_128.h:18:
bitslice_bma_128.c: In file included from /usr/lib/llvm-7/lib/clang/7.0.1/include/immintrin.h:28:
bitslice_bma_128.c: /usr/lib/llvm-7/lib/clang/7.0.1/include/mmintrin.h:64:12: error: invalid conversion between vector type '__m64' (vector of 1 'long long' value) and integer type 'int' of different size
bitslice_bma_128.c: return (__m64)__builtin_ia32_vec_init_v2si(__i, 0);
bitslice_bma_128.c: ^~~~~~~~~~~~~~~~~~~~~~~~~~~~~~~~~~~~~~~~~~~
bitslice_bma_128.c: /usr/lib/llvm-7/lib/clang/7.0.1/include/mmintrin.h:143:12: error: invalid conversion between vector type '__m64' (vector of 1 'long long' value) and integer type 'int' of different size
bitslice_bma_128.c: return (__m64)__builtin_ia32_packsswb((__v4hi)__m1, (__v4hi)__m2);
bitslice_bma_128.c: ^~~~~~~~~~~~~~~~~~~~~~~~~~~~~~~~~~~~~~~~~~~~~~~~~~~~~~~~~~
bitslice_bma_128.c: /usr/lib/llvm-7/lib/clang/7.0.1/include/mmintrin.h:173:12: error: invalid conversion between vector type '__m64' (vector of 1 'long long' value) and integer type 'int' of different size
bitslice_bma_128.c: return (__m64)__builtin_ia32_packssdw((__v2si)__m1, (__v2si)__m2);
bitslice_bma_128.c: ^~~~~~~~~~~~~~~~~~~~~~~~~~~~~~~~~~~~~~~~~~~~~~~~~~~~~~~~~~
bitslice_bma_128.c: ...

Number of similar (compiler,implementation) pairs: 1, namely:
CompilerImplementations
clang -mcpu=native -O3 -fomit-frame-pointer -fwrapv -Qunused-arguments -fPIC -fPIE sse2

Compiler output

Implementation: crypto_kem/ntskem13136/avx2
Compiler: clang -mcpu=native -O3 -fomit-frame-pointer -fwrapv -Qunused-arguments -fPIC -fPIE
bitslice_bma_128.c: In file included from bitslice_bma_128.c:18:
bitslice_bma_128.c: In file included from ./bitslice_bma_128.h:18:
bitslice_bma_128.c: In file included from /usr/lib/llvm-7/lib/clang/7.0.1/include/immintrin.h:28:
bitslice_bma_128.c: /usr/lib/llvm-7/lib/clang/7.0.1/include/mmintrin.h:64:12: error: invalid conversion between vector type '__m64' (vector of 1 'long long' value) and integer type 'int' of different size
bitslice_bma_128.c: return (__m64)__builtin_ia32_vec_init_v2si(__i, 0);
bitslice_bma_128.c: ^~~~~~~~~~~~~~~~~~~~~~~~~~~~~~~~~~~~~~~~~~~
bitslice_bma_128.c: /usr/lib/llvm-7/lib/clang/7.0.1/include/mmintrin.h:143:12: error: invalid conversion between vector type '__m64' (vector of 1 'long long' value) and integer type 'int' of different size
bitslice_bma_128.c: return (__m64)__builtin_ia32_packsswb((__v4hi)__m1, (__v4hi)__m2);
bitslice_bma_128.c: ^~~~~~~~~~~~~~~~~~~~~~~~~~~~~~~~~~~~~~~~~~~~~~~~~~~~~~~~~~
bitslice_bma_128.c: /usr/lib/llvm-7/lib/clang/7.0.1/include/mmintrin.h:173:12: error: invalid conversion between vector type '__m64' (vector of 1 'long long' value) and integer type 'int' of different size
bitslice_bma_128.c: return (__m64)__builtin_ia32_packssdw((__v2si)__m1, (__v2si)__m2);
bitslice_bma_128.c: ^~~~~~~~~~~~~~~~~~~~~~~~~~~~~~~~~~~~~~~~~~~~~~~~~~~~~~~~~~
bitslice_bma_128.c: /usr/lib/llvm-7/lib/clang/7.0.1/include/mmintrin.h:203:12: error: invalid conversion between vector type '__m64' (vector of 1 'long long' value) and integer type 'int' of different size
bitslice_bma_128.c: return (__m64)__builtin_ia32_packuswb((__v4hi)__m1, (__v4hi)__m2);
bitslice_bma_128.c: ^~~~~~~~~~~~~~~~~~~~~~~~~~~~~~~~~~~~~~~~~~~~~~~~~~~~~~~~~~
bitslice_bma_128.c: /usr/lib/llvm-7/lib/clang/7.0.1/include/mmintrin.h:230:12: error: invalid conversion between vector type '__m64' (vector of 1 'long long' value) and integer type 'int' of different size
bitslice_bma_128.c: return (__m64)__builtin_ia32_punpckhbw((__v8qi)__m1, (__v8qi)__m2);
bitslice_bma_128.c: ^~~~~~~~~~~~~~~~~~~~~~~~~~~~~~~~~~~~~~~~~~~~~~~~~~~~~~~~~~~
bitslice_bma_128.c: /usr/lib/llvm-7/lib/clang/7.0.1/include/mmintrin.h:253:12: error: invalid conversion between vector type '__m64' (vector of 1 'long long' value) and integer type 'int' of different size
bitslice_bma_128.c: return (__m64)__builtin_ia32_punpckhwd((__v4hi)__m1, (__v4hi)__m2);
bitslice_bma_128.c: ^~~~~~~~~~~~~~~~~~~~~~~~~~~~~~~~~~~~~~~~~~~~~~~~~~~~~~~~~~~
bitslice_bma_128.c: /usr/lib/llvm-7/lib/clang/7.0.1/include/mmintrin.h:274:12: error: invalid conversion between vector type '__m64' (vector of 1 'long long' value) and integer type 'int' of different size
bitslice_bma_128.c: return (__m64)__builtin_ia32_punpckhdq((__v2si)__m1, (__v2si)__m2);
bitslice_bma_128.c: ^~~~~~~~~~~~~~~~~~~~~~~~~~~~~~~~~~~~~~~~~~~~~~~~~~~~~~~~~~~
bitslice_bma_128.c: /usr/lib/llvm-7/lib/clang/7.0.1/include/mmintrin.h:301:12: error: invalid conversion between vector type '__m64' (vector of 1 'long long' value) and integer type 'int' of different size
bitslice_bma_128.c: ...

Number of similar (compiler,implementation) pairs: 1, namely:
CompilerImplementations
clang -mcpu=native -O3 -fomit-frame-pointer -fwrapv -Qunused-arguments -fPIC -fPIE avx2

Compiler output

Implementation: crypto_kem/ntskem13136/sse2
Compiler: gcc -march=native -mtune=native -O2 -fomit-frame-pointer -fwrapv -fPIC -fPIE
bitslice_bma_128.c: In file included from bitslice_bma_128.c:17:
bitslice_bma_128.c: bits.h:47:9: error: unknown type name '__m128i'
bitslice_bma_128.c: typedef __m128i vector;
bitslice_bma_128.c: ^~~~~~~
bitslice_bma_128.c: bits.h: In function 'vector_popcount':
bitslice_bma_128.c: bits.h:98:11: error: unknown type name '__m128i'
bitslice_bma_128.c: const __m128i a_hi = _mm_unpackhi_epi64(a, a);
bitslice_bma_128.c: ^~~~~~~
bitslice_bma_128.c: bits.h:98:26: warning: implicit declaration of function '_mm_unpackhi_epi64' [-Wimplicit-function-declaration]
bitslice_bma_128.c: const __m128i a_hi = _mm_unpackhi_epi64(a, a);
bitslice_bma_128.c: ^~~~~~~~~~~~~~~~~~
bitslice_bma_128.c: bits.h:99:21: warning: implicit declaration of function '_mm_cvtsi128_si64' [-Wimplicit-function-declaration]
bitslice_bma_128.c: return popcount(_mm_cvtsi128_si64(a_hi)) + popcount(_mm_cvtsi128_si64(a));
bitslice_bma_128.c: ^~~~~~~~~~~~~~~~~
bitslice_bma_128.c: bits.h:93:42: note: in definition of macro 'popcount'
bitslice_bma_128.c: #define popcount(x) __builtin_popcountll(x)
bitslice_bma_128.c: ^
bitslice_bma_128.c: In file included from bitslice_bma_128.c:18:
bitslice_bma_128.c: bitslice_bma_128.h: At top level:
bitslice_bma_128.c: bitslice_bma_128.h:18:10: fatal error: immintrin.h: No such file or directory
bitslice_bma_128.c: #include <immintrin.h>
bitslice_bma_128.c: ^~~~~~~~~~~~~
bitslice_bma_128.c: compilation terminated.

Number of similar (compiler,implementation) pairs: 4, namely:
CompilerImplementations
gcc -march=native -mtune=native -O2 -fomit-frame-pointer -fwrapv -fPIC -fPIE sse2
gcc -march=native -mtune=native -O3 -fomit-frame-pointer -fwrapv -fPIC -fPIE sse2
gcc -march=native -mtune=native -O -fomit-frame-pointer -fwrapv -fPIC -fPIE sse2
gcc -march=native -mtune=native -Os -fomit-frame-pointer -fwrapv -fPIC -fPIE sse2

Compiler output

Implementation: crypto_kem/ntskem13136/avx2
Compiler: gcc -march=native -mtune=native -O2 -fomit-frame-pointer -fwrapv -fPIC -fPIE
bitslice_bma_128.c: In file included from bitslice_bma_128.c:18:
bitslice_bma_128.c: bitslice_bma_128.h:18:10: fatal error: immintrin.h: No such file or directory
bitslice_bma_128.c: #include <immintrin.h>
bitslice_bma_128.c: ^~~~~~~~~~~~~
bitslice_bma_128.c: compilation terminated.

Number of similar (compiler,implementation) pairs: 4, namely:
CompilerImplementations
gcc -march=native -mtune=native -O2 -fomit-frame-pointer -fwrapv -fPIC -fPIE avx2
gcc -march=native -mtune=native -O3 -fomit-frame-pointer -fwrapv -fPIC -fPIE avx2
gcc -march=native -mtune=native -O -fomit-frame-pointer -fwrapv -fPIC -fPIE avx2
gcc -march=native -mtune=native -Os -fomit-frame-pointer -fwrapv -fPIC -fPIE avx2

Namespace violations

Implementation: crypto_kem/ntskem13136/ref
Compiler: clang -mcpu=native -O3 -fomit-frame-pointer -fwrapv -Qunused-arguments -fPIC -fPIE
additive_fft.o _additive_fft_construct_basis T
additive_fft.o _additive_fft_core T
additive_fft.o _additive_fft_ff_value T
additive_fft.o additive_fft T
additive_fft.o ff_poly_taylor_expansion T
berlekamp_massey.o berlekamp_massey T
ff.o ff_add_m T
ff.o ff_create T
ff.o ff_inv_13 T
ff.o ff_mul_13 T
ff.o ff_reduce_13 T
ff.o ff_release T
ff.o ff_sqr_13 T
keccak.o Keccak T
keccak.o KeccakF1600_StatePermute T
keccak.o LFSR86540 T
keccak.o sha3_256 T
keccak.o sha3_384 T
keccak.o sha3_512 T
keccak.o shake_256 T
m4r.o _gray_codes_lut D
m4r.o _gray_codes_lut2 R
m4r.o _gray_codes_lut3 R
m4r.o _gray_codes_lut4 R
m4r.o _gray_codes_lut5 R
m4r.o _gray_codes_lut6 R
m4r.o _gray_codes_lut7 R
m4r.o _gray_codes_lut8 R
m4r.o _m4ri_gauss_submatrix T
m4r.o _m4ri_make_table_rev T
m4r.o m4r_rref T
matrix_ff2.o alloc_matrix_ff2 T
matrix_ff2.o calloc_matrix_ff2 T
matrix_ff2.o clone_matrix_ff2 T
matrix_ff2.o column_swap_matrix_ff2 T
matrix_ff2.o free_matrix_ff2 T
matrix_ff2.o is_equal_matrix_ff2 T
matrix_ff2.o reduce_row_echelon_matrix_ff2 T
matrix_ff2.o zero_matrix_ff2 T
nts_kem.o compute_syndrome T
nts_kem.o correct_error_and_recover_ke T
nts_kem.o create_matrix_G T
nts_kem.o create_random_goppa_polynomial T
nts_kem.o deserialise_private_key T
nts_kem.o fisher_yates_shuffle T
nts_kem.o is_valid_goppa_polynomial T
nts_kem.o nts_kem_ciphertext_size T
nts_kem.o nts_kem_create T
nts_kem.o nts_kem_decapsulate T
nts_kem.o nts_kem_encapsulate T
nts_kem.o nts_kem_init_from_private_key T
nts_kem.o nts_kem_key_size T
nts_kem.o nts_kem_release T
nts_kem.o pack_buffer T
nts_kem.o random_vector T
nts_kem.o serialise_private_key T
nts_kem.o serialise_public_key T
nts_kem.o unpack_buffer T
polynomial.o clone_poly T
polynomial.o create_random_poly T
polynomial.o evaluate_poly T
polynomial.o formal_derivative_poly T
polynomial.o free_poly T
polynomial.o gcd_poly T
polynomial.o init_poly T
polynomial.o is_equal_poly T
polynomial.o modulo_reduce_poly T
polynomial.o poly_from_roots T
polynomial.o update_poly_degree T
polynomial.o zero_poly T
random.o random_uint16_bounded T
random.o randombit T
stack.o stack_create T
stack.o stack_free T
stack.o stack_pop T
stack.o stack_push T
stack.o stack_size T

Number of similar (compiler,implementation) pairs: 5, namely:
CompilerImplementations
clang -mcpu=native -O3 -fomit-frame-pointer -fwrapv -Qunused-arguments -fPIC -fPIE ref
gcc -march=native -mtune=native -O2 -fomit-frame-pointer -fwrapv -fPIC -fPIE ref
gcc -march=native -mtune=native -O3 -fomit-frame-pointer -fwrapv -fPIC -fPIE ref
gcc -march=native -mtune=native -O -fomit-frame-pointer -fwrapv -fPIC -fPIE ref
gcc -march=native -mtune=native -Os -fomit-frame-pointer -fwrapv -fPIC -fPIE ref

Namespace violations

Implementation: crypto_kem/ntskem13136/opt
Compiler: clang -mcpu=native -O3 -fomit-frame-pointer -fwrapv -Qunused-arguments -fPIC -fPIE
bitslice_bma_64.o bitslice_bma T
bitslice_fft_64.o _twist_factors13_136_64 R
bitslice_fft_64.o bitslice_fft13_64 T
bitslice_fft_64.o twiddle_factors R
bitslice_fft_64.o twist_factors D
ff.o bitslice_mul13_64 T
ff.o ff_add_m T
ff.o ff_create T
ff.o ff_inv_13 T
ff.o ff_mul_13 T
ff.o ff_reduce_13 T
ff.o ff_release T
ff.o ff_sqr_13 T
ff.o vector_ff_inv_13 T
ff.o vector_ff_mul_13 T
ff.o vector_ff_pow16_13 T
ff.o vector_ff_pow4_13 T
ff.o vector_ff_pow8_13 T
ff.o vector_ff_sqr_13 T
ff.o vector_ff_sqr_inv_13 T
ff.o vector_ff_transpose_xor_13 T
keccak.o shake_256 T
m4r.o _gray_codes_lut D
m4r.o _gray_codes_lut2 R
m4r.o _gray_codes_lut3 R
m4r.o _gray_codes_lut4 R
m4r.o _gray_codes_lut5 R
m4r.o _gray_codes_lut6 R
m4r.o _gray_codes_lut7 R
m4r.o _gray_codes_lut8 R
m4r.o _m4ri_gauss_submatrix T
m4r.o _m4ri_make_table_rev T
m4r.o m4r_rref T
matrix_ff2.o alloc_matrix_ff2 T
matrix_ff2.o calloc_matrix_ff2 T
matrix_ff2.o clone_matrix_ff2 T
matrix_ff2.o column_swap_matrix_ff2 T
matrix_ff2.o free_matrix_ff2 T
matrix_ff2.o is_equal_matrix_ff2 T
matrix_ff2.o reduce_row_echelon_matrix_ff2 T
matrix_ff2.o zero_matrix_ff2 T
nts_kem.o compute_syndrome T
nts_kem.o correct_error_and_recover_ke T
nts_kem.o create_matrix_G T
nts_kem.o create_random_goppa_polynomial T
nts_kem.o deserialise_private_key T
nts_kem.o fisher_yates_shuffle T
nts_kem.o is_valid_goppa_polynomial T
nts_kem.o load_input_ciphertext T
nts_kem.o nts_kem_ciphertext_size T
nts_kem.o nts_kem_create T
nts_kem.o nts_kem_decapsulate T
nts_kem.o nts_kem_encapsulate T
nts_kem.o nts_kem_init_from_private_key T
nts_kem.o nts_kem_key_size T
nts_kem.o nts_kem_release T
nts_kem.o pack_buffer T
nts_kem.o random_vector T
nts_kem.o serialise_private_key T
nts_kem.o serialise_public_key T
nts_kem.o unpack_buffer T
polynomial.o clone_poly T
polynomial.o create_random_poly T
polynomial.o evaluate_poly T
polynomial.o formal_derivative_poly T
polynomial.o free_poly T
polynomial.o gcd_poly T
polynomial.o init_poly T
polynomial.o is_equal_poly T
polynomial.o modulo_reduce_poly T
polynomial.o poly_from_roots T
polynomial.o update_poly_degree T
polynomial.o zero_poly T
random.o random_uint16_bounded T
random.o randombit T
vector_utils.o vector_ff_or_64 T
vector_utils.o vector_load_1d_64 T
vector_utils.o vector_load_2d_64 T
vector_utils.o vector_store_1d_64 T
vector_utils.o vector_store_2d_64 T

Number of similar (compiler,implementation) pairs: 5, namely:
CompilerImplementations
clang -mcpu=native -O3 -fomit-frame-pointer -fwrapv -Qunused-arguments -fPIC -fPIE opt
gcc -march=native -mtune=native -O2 -fomit-frame-pointer -fwrapv -fPIC -fPIE opt
gcc -march=native -mtune=native -O3 -fomit-frame-pointer -fwrapv -fPIC -fPIE opt
gcc -march=native -mtune=native -O -fomit-frame-pointer -fwrapv -fPIC -fPIE opt
gcc -march=native -mtune=native -Os -fomit-frame-pointer -fwrapv -fPIC -fPIE opt