Implementation notes: aarch64, jetsontx1, crypto_sign/sphincsf128harakasimple

Computer: jetsontx1
Architecture: aarch64
CPU ID: unknown CPU ID
SUPERCOP version: 20191017
Operation: crypto_sign
Primitive: sphincsf128harakasimple
TimeObject sizeTest sizeImplementationCompilerBenchmark dateSUPERCOP version
52174153119212 0 128036235 776 2856refclang_-mcpu=native_-march=armv8a+crypto_-O3_-fomit-frame-pointer_-fwrapv_-Qunused-arguments_-fPIC_-fPIE2019102020190910
53810206720936 0 128039569 824 2856refarmclang_-march=armv8a+crypto_-mcpu=cortex-a57_-mtune=cortex-a57_-O3_-fPIC_-fPIE2019102020190910
55259416216140 0 128031291 776 2840refclang_-mcpu=native_-march=armv8a+crypto_-O2_-fomit-frame-pointer_-fwrapv_-Qunused-arguments_-fPIC_-fPIE2019102020190910
55330709016140 0 128031291 776 2840refclang_-mcpu=native_-march=armv8a+crypto_-O_-fomit-frame-pointer_-fwrapv_-Qunused-arguments_-fPIC_-fPIE2019102020190910
55338590919296 0 128035869 824 2872refgcc_-march=native_-mtune=native_-O3_-fomit-frame-pointer_-fwrapv_-fPIC_-fPIE2019102020190910
57634602511324 0 128024561 768 2840refclang_-mcpu=native_-march=armv8a+crypto_-Os_-fomit-frame-pointer_-fwrapv_-Qunused-arguments_-fPIC_-fPIE2019102020190910
57952742818188 0 128034977 824 2840refarmclang_-march=armv8a+crypto_-mcpu=cortex-a57_-mtune=cortex-a57_-O2_-fPIC_-fPIE2019102020190910
65559106314676 0 128030045 824 2856refgcc_-march=native_-mtune=native_-O2_-fomit-frame-pointer_-fwrapv_-fPIC_-fPIE2019102020190910
70426122314800 0 128030125 824 2856refgcc_-march=native_-mtune=native_-O_-fomit-frame-pointer_-fwrapv_-fPIC_-fPIE2019102020190910
73408503313848 0 128028177 808 2840refgcc_-march=native_-mtune=native_-Os_-fomit-frame-pointer_-fwrapv_-fPIC_-fPIE2019102020190910

Compiler output

Implementation: crypto_sign/sphincsf128harakasimple/aesni
Compiler: armclang -march=armv8a+crypto -mcpu=cortex-a57 -mtune=cortex-a57 -O2 -fPIC -fPIE
haraka.c: In file included from haraka.c:11:
haraka.c: In file included from /opt/arm/arm-hpc-compiler-19.3_Generic-AArch64_Ubuntu-16.04_aarch64-linux/lib/clang/7.1.0/include/immintrin.h:28:
haraka.c: /opt/arm/arm-hpc-compiler-19.3_Generic-AArch64_Ubuntu-16.04_aarch64-linux/lib/clang/7.1.0/include/mmintrin.h:64:12: error: invalid conversion between vector type '__m64' (vector of 1 'long long' value) and integer type 'int' of different size
haraka.c: return (__m64)__builtin_ia32_vec_init_v2si(__i, 0);
haraka.c: ^~~~~~~~~~~~~~~~~~~~~~~~~~~~~~~~~~~~~~~~~~~
haraka.c: /opt/arm/arm-hpc-compiler-19.3_Generic-AArch64_Ubuntu-16.04_aarch64-linux/lib/clang/7.1.0/include/mmintrin.h:143:12: error: invalid conversion between vector type '__m64' (vector of 1 'long long' value) and integer type 'int' of different size
haraka.c: return (__m64)__builtin_ia32_packsswb((__v4hi)__m1, (__v4hi)__m2);
haraka.c: ^~~~~~~~~~~~~~~~~~~~~~~~~~~~~~~~~~~~~~~~~~~~~~~~~~~~~~~~~~
haraka.c: /opt/arm/arm-hpc-compiler-19.3_Generic-AArch64_Ubuntu-16.04_aarch64-linux/lib/clang/7.1.0/include/mmintrin.h:173:12: error: invalid conversion between vector type '__m64' (vector of 1 'long long' value) and integer type 'int' of different size
haraka.c: return (__m64)__builtin_ia32_packssdw((__v2si)__m1, (__v2si)__m2);
haraka.c: ^~~~~~~~~~~~~~~~~~~~~~~~~~~~~~~~~~~~~~~~~~~~~~~~~~~~~~~~~~
haraka.c: /opt/arm/arm-hpc-compiler-19.3_Generic-AArch64_Ubuntu-16.04_aarch64-linux/lib/clang/7.1.0/include/mmintrin.h:203:12: error: invalid conversion between vector type '__m64' (vector of 1 'long long' value) and integer type 'int' of different size
haraka.c: return (__m64)__builtin_ia32_packuswb((__v4hi)__m1, (__v4hi)__m2);
haraka.c: ^~~~~~~~~~~~~~~~~~~~~~~~~~~~~~~~~~~~~~~~~~~~~~~~~~~~~~~~~~
haraka.c: /opt/arm/arm-hpc-compiler-19.3_Generic-AArch64_Ubuntu-16.04_aarch64-linux/lib/clang/7.1.0/include/mmintrin.h:230:12: error: invalid conversion between vector type '__m64' (vector of 1 'long long' value) and integer type 'int' of different size
haraka.c: return (__m64)__builtin_ia32_punpckhbw((__v8qi)__m1, (__v8qi)__m2);
haraka.c: ^~~~~~~~~~~~~~~~~~~~~~~~~~~~~~~~~~~~~~~~~~~~~~~~~~~~~~~~~~~
haraka.c: /opt/arm/arm-hpc-compiler-19.3_Generic-AArch64_Ubuntu-16.04_aarch64-linux/lib/clang/7.1.0/include/mmintrin.h:253:12: error: invalid conversion between vector type '__m64' (vector of 1 'long long' value) and integer type 'int' of different size
haraka.c: return (__m64)__builtin_ia32_punpckhwd((__v4hi)__m1, (__v4hi)__m2);
haraka.c: ^~~~~~~~~~~~~~~~~~~~~~~~~~~~~~~~~~~~~~~~~~~~~~~~~~~~~~~~~~~
haraka.c: /opt/arm/arm-hpc-compiler-19.3_Generic-AArch64_Ubuntu-16.04_aarch64-linux/lib/clang/7.1.0/include/mmintrin.h:274:12: error: invalid conversion between vector type '__m64' (vector of 1 'long long' value) and integer type 'int' of different size
haraka.c: return (__m64)__builtin_ia32_punpckhdq((__v2si)__m1, (__v2si)__m2);
haraka.c: ^~~~~~~~~~~~~~~~~~~~~~~~~~~~~~~~~~~~~~~~~~~~~~~~~~~~~~~~~~~
haraka.c: /opt/arm/arm-hpc-compiler-19.3_Generic-AArch64_Ubuntu-16.04_aarch64-linux/lib/clang/7.1.0/include/mmintrin.h:301:12: error: invalid conversion between vector type '__m64' (vector of 1 'long long' value) and integer type 'int' of different size
haraka.c: return (__m64)__builtin_ia32_punpcklbw((__v8qi)__m1, (__v8qi)__m2);
haraka.c: ...

Number of similar (compiler,implementation) pairs: 2, namely:
CompilerImplementations
armclang -march=armv8a+crypto -mcpu=cortex-a57 -mtune=cortex-a57 -O2 -fPIC -fPIE aesni
armclang -march=armv8a+crypto -mcpu=cortex-a57 -mtune=cortex-a57 -O3 -fPIC -fPIE aesni

Compiler output

Implementation: crypto_sign/sphincsf128harakasimple/aesni
Compiler: clang -mcpu=native -march=armv8a+crypto -O2 -fomit-frame-pointer -fwrapv -Qunused-arguments -fPIC -fPIE
haraka.c: In file included from haraka.c:11:
haraka.c: In file included from /usr/local/llvm-8.0.1/lib/clang/8.0.1/include/immintrin.h:28:
haraka.c: /usr/local/llvm-8.0.1/lib/clang/8.0.1/include/mmintrin.h:64:12: error: invalid conversion between vector type '__m64' (vector of 1 'long long' value) and integer type 'int' of different size
haraka.c: return (__m64)__builtin_ia32_vec_init_v2si(__i, 0);
haraka.c: ^~~~~~~~~~~~~~~~~~~~~~~~~~~~~~~~~~~~~~~~~~~
haraka.c: /usr/local/llvm-8.0.1/lib/clang/8.0.1/include/mmintrin.h:143:12: error: invalid conversion between vector type '__m64' (vector of 1 'long long' value) and integer type 'int' of different size
haraka.c: return (__m64)__builtin_ia32_packsswb((__v4hi)__m1, (__v4hi)__m2);
haraka.c: ^~~~~~~~~~~~~~~~~~~~~~~~~~~~~~~~~~~~~~~~~~~~~~~~~~~~~~~~~~
haraka.c: /usr/local/llvm-8.0.1/lib/clang/8.0.1/include/mmintrin.h:173:12: error: invalid conversion between vector type '__m64' (vector of 1 'long long' value) and integer type 'int' of different size
haraka.c: return (__m64)__builtin_ia32_packssdw((__v2si)__m1, (__v2si)__m2);
haraka.c: ^~~~~~~~~~~~~~~~~~~~~~~~~~~~~~~~~~~~~~~~~~~~~~~~~~~~~~~~~~
haraka.c: /usr/local/llvm-8.0.1/lib/clang/8.0.1/include/mmintrin.h:203:12: error: invalid conversion between vector type '__m64' (vector of 1 'long long' value) and integer type 'int' of different size
haraka.c: return (__m64)__builtin_ia32_packuswb((__v4hi)__m1, (__v4hi)__m2);
haraka.c: ^~~~~~~~~~~~~~~~~~~~~~~~~~~~~~~~~~~~~~~~~~~~~~~~~~~~~~~~~~
haraka.c: /usr/local/llvm-8.0.1/lib/clang/8.0.1/include/mmintrin.h:230:12: error: invalid conversion between vector type '__m64' (vector of 1 'long long' value) and integer type 'int' of different size
haraka.c: return (__m64)__builtin_ia32_punpckhbw((__v8qi)__m1, (__v8qi)__m2);
haraka.c: ^~~~~~~~~~~~~~~~~~~~~~~~~~~~~~~~~~~~~~~~~~~~~~~~~~~~~~~~~~~
haraka.c: /usr/local/llvm-8.0.1/lib/clang/8.0.1/include/mmintrin.h:253:12: error: invalid conversion between vector type '__m64' (vector of 1 'long long' value) and integer type 'int' of different size
haraka.c: return (__m64)__builtin_ia32_punpckhwd((__v4hi)__m1, (__v4hi)__m2);
haraka.c: ^~~~~~~~~~~~~~~~~~~~~~~~~~~~~~~~~~~~~~~~~~~~~~~~~~~~~~~~~~~
haraka.c: /usr/local/llvm-8.0.1/lib/clang/8.0.1/include/mmintrin.h:274:12: error: invalid conversion between vector type '__m64' (vector of 1 'long long' value) and integer type 'int' of different size
haraka.c: return (__m64)__builtin_ia32_punpckhdq((__v2si)__m1, (__v2si)__m2);
haraka.c: ^~~~~~~~~~~~~~~~~~~~~~~~~~~~~~~~~~~~~~~~~~~~~~~~~~~~~~~~~~~
haraka.c: /usr/local/llvm-8.0.1/lib/clang/8.0.1/include/mmintrin.h:301:12: error: invalid conversion between vector type '__m64' (vector of 1 'long long' value) and integer type 'int' of different size
haraka.c: return (__m64)__builtin_ia32_punpcklbw((__v8qi)__m1, (__v8qi)__m2);
haraka.c: ...

Number of similar (compiler,implementation) pairs: 4, namely:
CompilerImplementations
clang -mcpu=native -march=armv8a+crypto -O2 -fomit-frame-pointer -fwrapv -Qunused-arguments -fPIC -fPIE aesni
clang -mcpu=native -march=armv8a+crypto -O3 -fomit-frame-pointer -fwrapv -Qunused-arguments -fPIC -fPIE aesni
clang -mcpu=native -march=armv8a+crypto -O -fomit-frame-pointer -fwrapv -Qunused-arguments -fPIC -fPIE aesni
clang -mcpu=native -march=armv8a+crypto -Os -fomit-frame-pointer -fwrapv -Qunused-arguments -fPIC -fPIE aesni

Compiler output

Implementation: crypto_sign/sphincsf128harakasimple/aesni
Compiler: gcc -march=native -mtune=native -O2 -fomit-frame-pointer -fwrapv -fPIC -fPIE
haraka.c: haraka.c:11:10: fatal error: immintrin.h: No such file or directory
haraka.c: #include "immintrin.h"
haraka.c: ^~~~~~~~~~~~~
haraka.c: compilation terminated.

Number of similar (compiler,implementation) pairs: 4, namely:
CompilerImplementations
gcc -march=native -mtune=native -O2 -fomit-frame-pointer -fwrapv -fPIC -fPIE aesni
gcc -march=native -mtune=native -O3 -fomit-frame-pointer -fwrapv -fPIC -fPIE aesni
gcc -march=native -mtune=native -O -fomit-frame-pointer -fwrapv -fPIC -fPIE aesni
gcc -march=native -mtune=native -Os -fomit-frame-pointer -fwrapv -fPIC -fPIE aesni

Namespace violations

Implementation: crypto_sign/sphincsf128harakasimple/ref
Compiler: armclang -march=armv8a+crypto -mcpu=cortex-a57 -mtune=cortex-a57 -O2 -fPIC -fPIE
address.o addr_to_bytes T
address.o copy_keypair_addr T
address.o copy_subtree_addr T
address.o set_chain_addr T
address.o set_hash_addr T
address.o set_keypair_addr T
address.o set_layer_addr T
address.o set_tree_addr T
address.o set_tree_height T
address.o set_tree_index T
address.o set_type T
fors.o fors_pk_from_sig T
fors.o fors_sign T
haraka.o br_aes_ct_bitslice_Sbox T
haraka.o br_aes_ct_ortho T
haraka.o haraka256 T
haraka.o haraka256_sk T
haraka.o haraka512 T
haraka.o haraka512_perm T
haraka.o haraka_S T
haraka.o haraka_S_inc_absorb T
haraka.o haraka_S_inc_finalize T
haraka.o haraka_S_inc_init T
haraka.o haraka_S_inc_squeeze T
haraka.o interleave_constant T
haraka.o interleave_constant32 T
haraka.o tweak_constants T
hash_haraka.o gen_message_random T
hash_haraka.o hash_message T
hash_haraka.o initialize_hash_function T
hash_haraka.o prf_addr T
sign.o crypto_sign_bytes T
sign.o crypto_sign_publickeybytes T
sign.o crypto_sign_secretkeybytes T
sign.o crypto_sign_seed_keypair T
sign.o crypto_sign_seedbytes T
sign.o crypto_sign_signature T
sign.o crypto_sign_verify T
thash_haraka_simple.o thash T
utils.o bytes_to_ull T
utils.o compute_root T
utils.o treehash T
utils.o ull_to_bytes T
wots.o wots_gen_pk T
wots.o wots_pk_from_sig T
wots.o wots_sign T

Number of similar (compiler,implementation) pairs: 10, namely:
CompilerImplementations
armclang -march=armv8a+crypto -mcpu=cortex-a57 -mtune=cortex-a57 -O2 -fPIC -fPIE ref
armclang -march=armv8a+crypto -mcpu=cortex-a57 -mtune=cortex-a57 -O3 -fPIC -fPIE ref
clang -mcpu=native -march=armv8a+crypto -O2 -fomit-frame-pointer -fwrapv -Qunused-arguments -fPIC -fPIE ref
clang -mcpu=native -march=armv8a+crypto -O3 -fomit-frame-pointer -fwrapv -Qunused-arguments -fPIC -fPIE ref
clang -mcpu=native -march=armv8a+crypto -O -fomit-frame-pointer -fwrapv -Qunused-arguments -fPIC -fPIE ref
clang -mcpu=native -march=armv8a+crypto -Os -fomit-frame-pointer -fwrapv -Qunused-arguments -fPIC -fPIE ref
gcc -march=native -mtune=native -O2 -fomit-frame-pointer -fwrapv -fPIC -fPIE ref
gcc -march=native -mtune=native -O3 -fomit-frame-pointer -fwrapv -fPIC -fPIE ref
gcc -march=native -mtune=native -O -fomit-frame-pointer -fwrapv -fPIC -fPIE ref
gcc -march=native -mtune=native -Os -fomit-frame-pointer -fwrapv -fPIC -fPIE ref