Implementation notes: aarch64, jetsontx1, crypto_kem/lightsaber2

Computer: jetsontx1
Architecture: aarch64
CPU ID: unknown CPU ID
SUPERCOP version: 20191017
Operation: crypto_kem
Primitive: lightsaber2
TimeObject sizeTest sizeImplementationCompilerBenchmark dateSUPERCOP version
31578139971 0 053128 776 1584refclang_-mcpu=native_-march=armv8a+crypto_-O2_-fomit-frame-pointer_-fwrapv_-Qunused-arguments_-fPIC_-fPIE2019102120190910
31685742771 0 057278 824 1584refarmclang_-march=armv8a+crypto_-mcpu=cortex-a57_-mtune=cortex-a57_-O2_-fPIC_-fPIE2019102120190910
31844739971 0 053128 776 1584refclang_-mcpu=native_-march=armv8a+crypto_-O_-fomit-frame-pointer_-fwrapv_-Qunused-arguments_-fPIC_-fPIE2019102120190910
32070658543 0 074886 824 1600refarmclang_-march=armv8a+crypto_-mcpu=cortex-a57_-mtune=cortex-a57_-O3_-fPIC_-fPIE2019102120190910
32304057939 0 072888 776 1600refclang_-mcpu=native_-march=armv8a+crypto_-O3_-fomit-frame-pointer_-fwrapv_-Qunused-arguments_-fPIC_-fPIE2019102120190910
34165238905 0 054362 800 1616refgcc_-march=native_-mtune=native_-O3_-fomit-frame-pointer_-fwrapv_-fPIC_-fPIE2019102120190910
10866129763 0 022110 768 1584refclang_-mcpu=native_-march=armv8a+crypto_-Os_-fomit-frame-pointer_-fwrapv_-Qunused-arguments_-fPIC_-fPIE2019102120190910
117647911551 0 024726 784 1584refgcc_-march=native_-mtune=native_-Os_-fomit-frame-pointer_-fwrapv_-fPIC_-fPIE2019102120190910
118642612009 0 026106 800 1600refgcc_-march=native_-mtune=native_-O_-fomit-frame-pointer_-fwrapv_-fPIC_-fPIE2019102120190910
121194812609 0 026882 800 1600refgcc_-march=native_-mtune=native_-O2_-fomit-frame-pointer_-fwrapv_-fPIC_-fPIE2019102120190910

Compiler output

Implementation: crypto_kem/lightsaber2/avx2
Compiler: armclang -march=armv8a+crypto -mcpu=cortex-a57 -mtune=cortex-a57 -O2 -fPIC -fPIE
SABER_indcpa.c: In file included from SABER_indcpa.c:4:
SABER_indcpa.c: In file included from ./SABER_indcpa.h:4:
SABER_indcpa.c: In file included from /opt/arm/arm-hpc-compiler-19.3_Generic-AArch64_Ubuntu-16.04_aarch64-linux/lib/clang/7.1.0/include/immintrin.h:28:
SABER_indcpa.c: /opt/arm/arm-hpc-compiler-19.3_Generic-AArch64_Ubuntu-16.04_aarch64-linux/lib/clang/7.1.0/include/mmintrin.h:64:12: error: invalid conversion between vector type '__m64' (vector of 1 'long long' value) and integer type 'int' of different size
SABER_indcpa.c: return (__m64)__builtin_ia32_vec_init_v2si(__i, 0);
SABER_indcpa.c: ^~~~~~~~~~~~~~~~~~~~~~~~~~~~~~~~~~~~~~~~~~~
SABER_indcpa.c: /opt/arm/arm-hpc-compiler-19.3_Generic-AArch64_Ubuntu-16.04_aarch64-linux/lib/clang/7.1.0/include/mmintrin.h:143:12: error: invalid conversion between vector type '__m64' (vector of 1 'long long' value) and integer type 'int' of different size
SABER_indcpa.c: return (__m64)__builtin_ia32_packsswb((__v4hi)__m1, (__v4hi)__m2);
SABER_indcpa.c: ^~~~~~~~~~~~~~~~~~~~~~~~~~~~~~~~~~~~~~~~~~~~~~~~~~~~~~~~~~
SABER_indcpa.c: /opt/arm/arm-hpc-compiler-19.3_Generic-AArch64_Ubuntu-16.04_aarch64-linux/lib/clang/7.1.0/include/mmintrin.h:173:12: error: invalid conversion between vector type '__m64' (vector of 1 'long long' value) and integer type 'int' of different size
SABER_indcpa.c: return (__m64)__builtin_ia32_packssdw((__v2si)__m1, (__v2si)__m2);
SABER_indcpa.c: ^~~~~~~~~~~~~~~~~~~~~~~~~~~~~~~~~~~~~~~~~~~~~~~~~~~~~~~~~~
SABER_indcpa.c: /opt/arm/arm-hpc-compiler-19.3_Generic-AArch64_Ubuntu-16.04_aarch64-linux/lib/clang/7.1.0/include/mmintrin.h:203:12: error: invalid conversion between vector type '__m64' (vector of 1 'long long' value) and integer type 'int' of different size
SABER_indcpa.c: return (__m64)__builtin_ia32_packuswb((__v4hi)__m1, (__v4hi)__m2);
SABER_indcpa.c: ^~~~~~~~~~~~~~~~~~~~~~~~~~~~~~~~~~~~~~~~~~~~~~~~~~~~~~~~~~
SABER_indcpa.c: /opt/arm/arm-hpc-compiler-19.3_Generic-AArch64_Ubuntu-16.04_aarch64-linux/lib/clang/7.1.0/include/mmintrin.h:230:12: error: invalid conversion between vector type '__m64' (vector of 1 'long long' value) and integer type 'int' of different size
SABER_indcpa.c: return (__m64)__builtin_ia32_punpckhbw((__v8qi)__m1, (__v8qi)__m2);
SABER_indcpa.c: ^~~~~~~~~~~~~~~~~~~~~~~~~~~~~~~~~~~~~~~~~~~~~~~~~~~~~~~~~~~
SABER_indcpa.c: /opt/arm/arm-hpc-compiler-19.3_Generic-AArch64_Ubuntu-16.04_aarch64-linux/lib/clang/7.1.0/include/mmintrin.h:253:12: error: invalid conversion between vector type '__m64' (vector of 1 'long long' value) and integer type 'int' of different size
SABER_indcpa.c: return (__m64)__builtin_ia32_punpckhwd((__v4hi)__m1, (__v4hi)__m2);
SABER_indcpa.c: ^~~~~~~~~~~~~~~~~~~~~~~~~~~~~~~~~~~~~~~~~~~~~~~~~~~~~~~~~~~
SABER_indcpa.c: /opt/arm/arm-hpc-compiler-19.3_Generic-AArch64_Ubuntu-16.04_aarch64-linux/lib/clang/7.1.0/include/mmintrin.h:274:12: error: invalid conversion between vector type '__m64' (vector of 1 'long long' value) and integer type 'int' of different size
SABER_indcpa.c: return (__m64)__builtin_ia32_punpckhdq((__v2si)__m1, (__v2si)__m2);
SABER_indcpa.c: ^~~~~~~~~~~~~~~~~~~~~~~~~~~~~~~~~~~~~~~~~~~~~~~~~~~~~~~~~~~
SABER_indcpa.c: /opt/arm/arm-hpc-compiler-19.3_Generic-AArch64_Ubuntu-16.04_aarch64-linux/lib/clang/7.1.0/include/mmintrin.h:301:12: error: invalid conversion between vector type '__m64' (vector of 1 'long long' value) and integer type 'int' of different size
SABER_indcpa.c: ...

Number of similar (compiler,implementation) pairs: 2, namely:
CompilerImplementations
armclang -march=armv8a+crypto -mcpu=cortex-a57 -mtune=cortex-a57 -O2 -fPIC -fPIE avx2
armclang -march=armv8a+crypto -mcpu=cortex-a57 -mtune=cortex-a57 -O3 -fPIC -fPIE avx2

Compiler output

Implementation: crypto_kem/lightsaber2/avx2
Compiler: clang -mcpu=native -march=armv8a+crypto -O2 -fomit-frame-pointer -fwrapv -Qunused-arguments -fPIC -fPIE
SABER_indcpa.c: In file included from SABER_indcpa.c:4:
SABER_indcpa.c: In file included from ./SABER_indcpa.h:4:
SABER_indcpa.c: In file included from /usr/local/llvm-8.0.1/lib/clang/8.0.1/include/immintrin.h:28:
SABER_indcpa.c: /usr/local/llvm-8.0.1/lib/clang/8.0.1/include/mmintrin.h:64:12: error: invalid conversion between vector type '__m64' (vector of 1 'long long' value) and integer type 'int' of different size
SABER_indcpa.c: return (__m64)__builtin_ia32_vec_init_v2si(__i, 0);
SABER_indcpa.c: ^~~~~~~~~~~~~~~~~~~~~~~~~~~~~~~~~~~~~~~~~~~
SABER_indcpa.c: /usr/local/llvm-8.0.1/lib/clang/8.0.1/include/mmintrin.h:143:12: error: invalid conversion between vector type '__m64' (vector of 1 'long long' value) and integer type 'int' of different size
SABER_indcpa.c: return (__m64)__builtin_ia32_packsswb((__v4hi)__m1, (__v4hi)__m2);
SABER_indcpa.c: ^~~~~~~~~~~~~~~~~~~~~~~~~~~~~~~~~~~~~~~~~~~~~~~~~~~~~~~~~~
SABER_indcpa.c: /usr/local/llvm-8.0.1/lib/clang/8.0.1/include/mmintrin.h:173:12: error: invalid conversion between vector type '__m64' (vector of 1 'long long' value) and integer type 'int' of different size
SABER_indcpa.c: return (__m64)__builtin_ia32_packssdw((__v2si)__m1, (__v2si)__m2);
SABER_indcpa.c: ^~~~~~~~~~~~~~~~~~~~~~~~~~~~~~~~~~~~~~~~~~~~~~~~~~~~~~~~~~
SABER_indcpa.c: /usr/local/llvm-8.0.1/lib/clang/8.0.1/include/mmintrin.h:203:12: error: invalid conversion between vector type '__m64' (vector of 1 'long long' value) and integer type 'int' of different size
SABER_indcpa.c: return (__m64)__builtin_ia32_packuswb((__v4hi)__m1, (__v4hi)__m2);
SABER_indcpa.c: ^~~~~~~~~~~~~~~~~~~~~~~~~~~~~~~~~~~~~~~~~~~~~~~~~~~~~~~~~~
SABER_indcpa.c: /usr/local/llvm-8.0.1/lib/clang/8.0.1/include/mmintrin.h:230:12: error: invalid conversion between vector type '__m64' (vector of 1 'long long' value) and integer type 'int' of different size
SABER_indcpa.c: return (__m64)__builtin_ia32_punpckhbw((__v8qi)__m1, (__v8qi)__m2);
SABER_indcpa.c: ^~~~~~~~~~~~~~~~~~~~~~~~~~~~~~~~~~~~~~~~~~~~~~~~~~~~~~~~~~~
SABER_indcpa.c: /usr/local/llvm-8.0.1/lib/clang/8.0.1/include/mmintrin.h:253:12: error: invalid conversion between vector type '__m64' (vector of 1 'long long' value) and integer type 'int' of different size
SABER_indcpa.c: return (__m64)__builtin_ia32_punpckhwd((__v4hi)__m1, (__v4hi)__m2);
SABER_indcpa.c: ^~~~~~~~~~~~~~~~~~~~~~~~~~~~~~~~~~~~~~~~~~~~~~~~~~~~~~~~~~~
SABER_indcpa.c: /usr/local/llvm-8.0.1/lib/clang/8.0.1/include/mmintrin.h:274:12: error: invalid conversion between vector type '__m64' (vector of 1 'long long' value) and integer type 'int' of different size
SABER_indcpa.c: return (__m64)__builtin_ia32_punpckhdq((__v2si)__m1, (__v2si)__m2);
SABER_indcpa.c: ^~~~~~~~~~~~~~~~~~~~~~~~~~~~~~~~~~~~~~~~~~~~~~~~~~~~~~~~~~~
SABER_indcpa.c: /usr/local/llvm-8.0.1/lib/clang/8.0.1/include/mmintrin.h:301:12: error: invalid conversion between vector type '__m64' (vector of 1 'long long' value) and integer type 'int' of different size
SABER_indcpa.c: ...

Number of similar (compiler,implementation) pairs: 4, namely:
CompilerImplementations
clang -mcpu=native -march=armv8a+crypto -O2 -fomit-frame-pointer -fwrapv -Qunused-arguments -fPIC -fPIE avx2
clang -mcpu=native -march=armv8a+crypto -O3 -fomit-frame-pointer -fwrapv -Qunused-arguments -fPIC -fPIE avx2
clang -mcpu=native -march=armv8a+crypto -O -fomit-frame-pointer -fwrapv -Qunused-arguments -fPIC -fPIE avx2
clang -mcpu=native -march=armv8a+crypto -Os -fomit-frame-pointer -fwrapv -Qunused-arguments -fPIC -fPIE avx2

Compiler output

Implementation: crypto_kem/lightsaber2/avx2
Compiler: gcc -march=native -mtune=native -O2 -fomit-frame-pointer -fwrapv -fPIC -fPIE
SABER_indcpa.c: In file included from SABER_indcpa.c:4:
SABER_indcpa.c: SABER_indcpa.h:4:10: fatal error: immintrin.h: No such file or directory
SABER_indcpa.c: #include <immintrin.h>
SABER_indcpa.c: ^~~~~~~~~~~~~
SABER_indcpa.c: compilation terminated.

Number of similar (compiler,implementation) pairs: 4, namely:
CompilerImplementations
gcc -march=native -mtune=native -O2 -fomit-frame-pointer -fwrapv -fPIC -fPIE avx2
gcc -march=native -mtune=native -O3 -fomit-frame-pointer -fwrapv -fPIC -fPIE avx2
gcc -march=native -mtune=native -O -fomit-frame-pointer -fwrapv -fPIC -fPIE avx2
gcc -march=native -mtune=native -Os -fomit-frame-pointer -fwrapv -fPIC -fPIE avx2