Implementation notes: aarch64, jetsontx1, crypto_aead/schwaemm256256v1

Computer: jetsontx1
Architecture: aarch64
CPU ID: unknown CPU ID
SUPERCOP version: 20191017
Operation: crypto_aead
Primitive: schwaemm256256v1
TimeObject sizeTest sizeImplementationCompilerBenchmark dateSUPERCOP version
22515511373 0 023414 832 864refgcc_-march=native_-mtune=native_-O3_-fomit-frame-pointer_-fwrapv_-fPIC_-fPIE2019101720190910
2394675029 0 016978 824 864optgcc_-march=native_-mtune=native_-O3_-fomit-frame-pointer_-fwrapv_-fPIC_-fPIE2019101720190910
2566484357 0 015106 824 848optgcc_-march=native_-mtune=native_-O2_-fomit-frame-pointer_-fwrapv_-fPIC_-fPIE2019101720190910
2773364525 0 015258 824 848optgcc_-march=native_-mtune=native_-O_-fomit-frame-pointer_-fwrapv_-fPIC_-fPIE2019101720190910
2976614897 0 015742 832 848refgcc_-march=native_-mtune=native_-O2_-fomit-frame-pointer_-fwrapv_-fPIC_-fPIE2019101720190910
3241355129 0 015950 832 848refgcc_-march=native_-mtune=native_-O_-fomit-frame-pointer_-fwrapv_-fPIC_-fPIE2019101720190910

Compiler output

Implementation: crypto_aead/schwaemm256256v1/opt
Compiler: armclang -march=armv8a+crypto -mcpu=cortex-a57 -mtune=cortex-a57 -O2 -fPIC -fPIE
try.c: /opt/arm/gcc-8.2.0_Generic-AArch64_Ubuntu-16.04_aarch64-linux/lib/gcc/aarch64-linux-gnu/8.2.0/../../../../aarch64-linux-gnu/bin/ld: crypto_aead_schwaemm256256v1.a(encrypt.o): in function `crypto_aead_schwaemm256256v1_opt_encrypt':
try.c: encrypt.c:(.text+0x...): undefined reference to `initialize'
try.c: /opt/arm/gcc-8.2.0_Generic-AArch64_Ubuntu-16.04_aarch64-linux/lib/gcc/aarch64-linux-gnu/8.2.0/../../../../aarch64-linux-gnu/bin/ld: encrypt.c:(.text+0x...): undefined reference to `encryptPT'
try.c: /opt/arm/gcc-8.2.0_Generic-AArch64_Ubuntu-16.04_aarch64-linux/lib/gcc/aarch64-linux-gnu/8.2.0/../../../../aarch64-linux-gnu/bin/ld: crypto_aead_schwaemm256256v1.a(encrypt.o): in function `crypto_aead_schwaemm256256v1_opt_decrypt':
try.c: encrypt.c:(.text+0x...): undefined reference to `initialize'
try.c: /opt/arm/gcc-8.2.0_Generic-AArch64_Ubuntu-16.04_aarch64-linux/lib/gcc/aarch64-linux-gnu/8.2.0/../../../../aarch64-linux-gnu/bin/ld: encrypt.c:(.text+0x...): undefined reference to `decryptCT'
try.c: clang-7: error: linker command failed with exit code 1 (use -v to see invocation)

Number of similar (compiler,implementation) pairs: 2, namely:
CompilerImplementations
armclang -march=armv8a+crypto -mcpu=cortex-a57 -mtune=cortex-a57 -O2 -fPIC -fPIE opt
armclang -march=armv8a+crypto -mcpu=cortex-a57 -mtune=cortex-a57 -O3 -fPIC -fPIE opt

Compiler output

Implementation: crypto_aead/schwaemm256256v1/ref
Compiler: armclang -march=armv8a+crypto -mcpu=cortex-a57 -mtune=cortex-a57 -O2 -fPIC -fPIE
try.c: /opt/arm/gcc-8.2.0_Generic-AArch64_Ubuntu-16.04_aarch64-linux/lib/gcc/aarch64-linux-gnu/8.2.0/../../../../aarch64-linux-gnu/bin/ld: crypto_aead_schwaemm256256v1.a(encrypt.o): in function `crypto_aead_schwaemm256256v1_ref_encrypt':
try.c: encrypt.c:(.text+0x...): undefined reference to `initialize'
try.c: /opt/arm/gcc-8.2.0_Generic-AArch64_Ubuntu-16.04_aarch64-linux/lib/gcc/aarch64-linux-gnu/8.2.0/../../../../aarch64-linux-gnu/bin/ld: encrypt.c:(.text+0x...): undefined reference to `encryptPT'
try.c: /opt/arm/gcc-8.2.0_Generic-AArch64_Ubuntu-16.04_aarch64-linux/lib/gcc/aarch64-linux-gnu/8.2.0/../../../../aarch64-linux-gnu/bin/ld: crypto_aead_schwaemm256256v1.a(encrypt.o): in function `crypto_aead_schwaemm256256v1_ref_decrypt':
try.c: encrypt.c:(.text+0x...): undefined reference to `initialize'
try.c: /opt/arm/gcc-8.2.0_Generic-AArch64_Ubuntu-16.04_aarch64-linux/lib/gcc/aarch64-linux-gnu/8.2.0/../../../../aarch64-linux-gnu/bin/ld: encrypt.c:(.text+0x...): undefined reference to `decryptCT'
try.c: clang-7: error: linker command failed with exit code 1 (use -v to see invocation)

Number of similar (compiler,implementation) pairs: 2, namely:
CompilerImplementations
armclang -march=armv8a+crypto -mcpu=cortex-a57 -mtune=cortex-a57 -O2 -fPIC -fPIE ref
armclang -march=armv8a+crypto -mcpu=cortex-a57 -mtune=cortex-a57 -O3 -fPIC -fPIE ref

Compiler output

Implementation: crypto_aead/schwaemm256256v1/opt
Compiler: clang -mcpu=native -march=armv8a+crypto -O2 -fomit-frame-pointer -fwrapv -Qunused-arguments -fPIC -fPIE
try.c: /opt/arm/gcc-8.2.0_Generic-AArch64_Ubuntu-16.04_aarch64-linux/lib/gcc/aarch64-linux-gnu/8.2.0/../../../../aarch64-linux-gnu/bin/ld: crypto_aead_schwaemm256256v1.a(encrypt.o): in function `crypto_aead_schwaemm256256v1_opt_encrypt':
try.c: encrypt.c:(.text+0x...): undefined reference to `initialize'
try.c: /opt/arm/gcc-8.2.0_Generic-AArch64_Ubuntu-16.04_aarch64-linux/lib/gcc/aarch64-linux-gnu/8.2.0/../../../../aarch64-linux-gnu/bin/ld: encrypt.c:(.text+0x...): undefined reference to `processAD'
try.c: /opt/arm/gcc-8.2.0_Generic-AArch64_Ubuntu-16.04_aarch64-linux/lib/gcc/aarch64-linux-gnu/8.2.0/../../../../aarch64-linux-gnu/bin/ld: encrypt.c:(.text+0x...): undefined reference to `encryptPT'
try.c: /opt/arm/gcc-8.2.0_Generic-AArch64_Ubuntu-16.04_aarch64-linux/lib/gcc/aarch64-linux-gnu/8.2.0/../../../../aarch64-linux-gnu/bin/ld: crypto_aead_schwaemm256256v1.a(encrypt.o): in function `crypto_aead_schwaemm256256v1_opt_decrypt':
try.c: encrypt.c:(.text+0x...): undefined reference to `initialize'
try.c: /opt/arm/gcc-8.2.0_Generic-AArch64_Ubuntu-16.04_aarch64-linux/lib/gcc/aarch64-linux-gnu/8.2.0/../../../../aarch64-linux-gnu/bin/ld: encrypt.c:(.text+0x...): undefined reference to `processAD'
try.c: /opt/arm/gcc-8.2.0_Generic-AArch64_Ubuntu-16.04_aarch64-linux/lib/gcc/aarch64-linux-gnu/8.2.0/../../../../aarch64-linux-gnu/bin/ld: encrypt.c:(.text+0x...): undefined reference to `decryptCT'
try.c: clang-8: error: linker command failed with exit code 1 (use -v to see invocation)

Number of similar (compiler,implementation) pairs: 3, namely:
CompilerImplementations
clang -mcpu=native -march=armv8a+crypto -O2 -fomit-frame-pointer -fwrapv -Qunused-arguments -fPIC -fPIE opt
clang -mcpu=native -march=armv8a+crypto -O3 -fomit-frame-pointer -fwrapv -Qunused-arguments -fPIC -fPIE opt
clang -mcpu=native -march=armv8a+crypto -O -fomit-frame-pointer -fwrapv -Qunused-arguments -fPIC -fPIE opt

Compiler output

Implementation: crypto_aead/schwaemm256256v1/ref
Compiler: clang -mcpu=native -march=armv8a+crypto -O2 -fomit-frame-pointer -fwrapv -Qunused-arguments -fPIC -fPIE
try.c: /opt/arm/gcc-8.2.0_Generic-AArch64_Ubuntu-16.04_aarch64-linux/lib/gcc/aarch64-linux-gnu/8.2.0/../../../../aarch64-linux-gnu/bin/ld: crypto_aead_schwaemm256256v1.a(encrypt.o): in function `crypto_aead_schwaemm256256v1_ref_encrypt':
try.c: encrypt.c:(.text+0x...): undefined reference to `initialize'
try.c: /opt/arm/gcc-8.2.0_Generic-AArch64_Ubuntu-16.04_aarch64-linux/lib/gcc/aarch64-linux-gnu/8.2.0/../../../../aarch64-linux-gnu/bin/ld: encrypt.c:(.text+0x...): undefined reference to `processAD'
try.c: /opt/arm/gcc-8.2.0_Generic-AArch64_Ubuntu-16.04_aarch64-linux/lib/gcc/aarch64-linux-gnu/8.2.0/../../../../aarch64-linux-gnu/bin/ld: encrypt.c:(.text+0x...): undefined reference to `encryptPT'
try.c: /opt/arm/gcc-8.2.0_Generic-AArch64_Ubuntu-16.04_aarch64-linux/lib/gcc/aarch64-linux-gnu/8.2.0/../../../../aarch64-linux-gnu/bin/ld: crypto_aead_schwaemm256256v1.a(encrypt.o): in function `crypto_aead_schwaemm256256v1_ref_decrypt':
try.c: encrypt.c:(.text+0x...): undefined reference to `initialize'
try.c: /opt/arm/gcc-8.2.0_Generic-AArch64_Ubuntu-16.04_aarch64-linux/lib/gcc/aarch64-linux-gnu/8.2.0/../../../../aarch64-linux-gnu/bin/ld: encrypt.c:(.text+0x...): undefined reference to `processAD'
try.c: /opt/arm/gcc-8.2.0_Generic-AArch64_Ubuntu-16.04_aarch64-linux/lib/gcc/aarch64-linux-gnu/8.2.0/../../../../aarch64-linux-gnu/bin/ld: encrypt.c:(.text+0x...): undefined reference to `decryptCT'
try.c: clang-8: error: linker command failed with exit code 1 (use -v to see invocation)

Number of similar (compiler,implementation) pairs: 3, namely:
CompilerImplementations
clang -mcpu=native -march=armv8a+crypto -O2 -fomit-frame-pointer -fwrapv -Qunused-arguments -fPIC -fPIE ref
clang -mcpu=native -march=armv8a+crypto -O3 -fomit-frame-pointer -fwrapv -Qunused-arguments -fPIC -fPIE ref
clang -mcpu=native -march=armv8a+crypto -O -fomit-frame-pointer -fwrapv -Qunused-arguments -fPIC -fPIE ref

Compiler output

Implementation: crypto_aead/schwaemm256256v1/opt
Compiler: clang -mcpu=native -march=armv8a+crypto -Os -fomit-frame-pointer -fwrapv -Qunused-arguments -fPIC -fPIE
try.c: /opt/arm/gcc-8.2.0_Generic-AArch64_Ubuntu-16.04_aarch64-linux/lib/gcc/aarch64-linux-gnu/8.2.0/../../../../aarch64-linux-gnu/bin/ld: crypto_aead_schwaemm256256v1.a(encrypt.o): in function `crypto_aead_schwaemm256256v1_opt_encrypt':
try.c: encrypt.c:(.text+0x...): undefined reference to `processAD'
try.c: /opt/arm/gcc-8.2.0_Generic-AArch64_Ubuntu-16.04_aarch64-linux/lib/gcc/aarch64-linux-gnu/8.2.0/../../../../aarch64-linux-gnu/bin/ld: encrypt.c:(.text+0x...): undefined reference to `encryptPT'
try.c: /opt/arm/gcc-8.2.0_Generic-AArch64_Ubuntu-16.04_aarch64-linux/lib/gcc/aarch64-linux-gnu/8.2.0/../../../../aarch64-linux-gnu/bin/ld: crypto_aead_schwaemm256256v1.a(encrypt.o): in function `crypto_aead_schwaemm256256v1_opt_decrypt':
try.c: encrypt.c:(.text+0x...): undefined reference to `processAD'
try.c: /opt/arm/gcc-8.2.0_Generic-AArch64_Ubuntu-16.04_aarch64-linux/lib/gcc/aarch64-linux-gnu/8.2.0/../../../../aarch64-linux-gnu/bin/ld: encrypt.c:(.text+0x...): undefined reference to `decryptCT'
try.c: clang-8: error: linker command failed with exit code 1 (use -v to see invocation)

Number of similar (compiler,implementation) pairs: 1, namely:
CompilerImplementations
clang -mcpu=native -march=armv8a+crypto -Os -fomit-frame-pointer -fwrapv -Qunused-arguments -fPIC -fPIE opt

Compiler output

Implementation: crypto_aead/schwaemm256256v1/ref
Compiler: clang -mcpu=native -march=armv8a+crypto -Os -fomit-frame-pointer -fwrapv -Qunused-arguments -fPIC -fPIE
try.c: /opt/arm/gcc-8.2.0_Generic-AArch64_Ubuntu-16.04_aarch64-linux/lib/gcc/aarch64-linux-gnu/8.2.0/../../../../aarch64-linux-gnu/bin/ld: crypto_aead_schwaemm256256v1.a(encrypt.o): in function `crypto_aead_schwaemm256256v1_ref_encrypt':
try.c: encrypt.c:(.text+0x...): undefined reference to `processAD'
try.c: /opt/arm/gcc-8.2.0_Generic-AArch64_Ubuntu-16.04_aarch64-linux/lib/gcc/aarch64-linux-gnu/8.2.0/../../../../aarch64-linux-gnu/bin/ld: encrypt.c:(.text+0x...): undefined reference to `encryptPT'
try.c: /opt/arm/gcc-8.2.0_Generic-AArch64_Ubuntu-16.04_aarch64-linux/lib/gcc/aarch64-linux-gnu/8.2.0/../../../../aarch64-linux-gnu/bin/ld: crypto_aead_schwaemm256256v1.a(encrypt.o): in function `crypto_aead_schwaemm256256v1_ref_decrypt':
try.c: encrypt.c:(.text+0x...): undefined reference to `processAD'
try.c: /opt/arm/gcc-8.2.0_Generic-AArch64_Ubuntu-16.04_aarch64-linux/lib/gcc/aarch64-linux-gnu/8.2.0/../../../../aarch64-linux-gnu/bin/ld: encrypt.c:(.text+0x...): undefined reference to `decryptCT'
try.c: clang-8: error: linker command failed with exit code 1 (use -v to see invocation)

Number of similar (compiler,implementation) pairs: 1, namely:
CompilerImplementations
clang -mcpu=native -march=armv8a+crypto -Os -fomit-frame-pointer -fwrapv -Qunused-arguments -fPIC -fPIE ref

Compiler output

Implementation: crypto_aead/schwaemm256256v1/opt
Compiler: gcc -march=native -mtune=native -Os -fomit-frame-pointer -fwrapv -fPIC -fPIE
try.c: /opt/arm/gcc-8.2.0_Generic-AArch64_Ubuntu-16.04_aarch64-linux/bin/../lib/gcc/aarch64-linux-gnu/8.2.0/../../../../aarch64-linux-gnu/bin/ld: crypto_aead_schwaemm256256v1.a(encrypt.o): in function `crypto_aead_schwaemm256256v1_opt_encrypt':
try.c: encrypt.c:(.text+0x...): undefined reference to `initialize'
try.c: /opt/arm/gcc-8.2.0_Generic-AArch64_Ubuntu-16.04_aarch64-linux/bin/../lib/gcc/aarch64-linux-gnu/8.2.0/../../../../aarch64-linux-gnu/bin/ld: encrypt.c:(.text+0x...): undefined reference to `processAD'
try.c: /opt/arm/gcc-8.2.0_Generic-AArch64_Ubuntu-16.04_aarch64-linux/bin/../lib/gcc/aarch64-linux-gnu/8.2.0/../../../../aarch64-linux-gnu/bin/ld: encrypt.c:(.text+0x...): undefined reference to `encryptPT'
try.c: /opt/arm/gcc-8.2.0_Generic-AArch64_Ubuntu-16.04_aarch64-linux/bin/../lib/gcc/aarch64-linux-gnu/8.2.0/../../../../aarch64-linux-gnu/bin/ld: crypto_aead_schwaemm256256v1.a(encrypt.o): in function `crypto_aead_schwaemm256256v1_opt_decrypt':
try.c: encrypt.c:(.text+0x...): undefined reference to `initialize'
try.c: /opt/arm/gcc-8.2.0_Generic-AArch64_Ubuntu-16.04_aarch64-linux/bin/../lib/gcc/aarch64-linux-gnu/8.2.0/../../../../aarch64-linux-gnu/bin/ld: encrypt.c:(.text+0x...): undefined reference to `processAD'
try.c: /opt/arm/gcc-8.2.0_Generic-AArch64_Ubuntu-16.04_aarch64-linux/bin/../lib/gcc/aarch64-linux-gnu/8.2.0/../../../../aarch64-linux-gnu/bin/ld: encrypt.c:(.text+0x...): undefined reference to `decryptCT'
try.c: collect2: error: ld returned 1 exit status

Number of similar (compiler,implementation) pairs: 1, namely:
CompilerImplementations
gcc -march=native -mtune=native -Os -fomit-frame-pointer -fwrapv -fPIC -fPIE opt

Compiler output

Implementation: crypto_aead/schwaemm256256v1/ref
Compiler: gcc -march=native -mtune=native -Os -fomit-frame-pointer -fwrapv -fPIC -fPIE
try.c: /opt/arm/gcc-8.2.0_Generic-AArch64_Ubuntu-16.04_aarch64-linux/bin/../lib/gcc/aarch64-linux-gnu/8.2.0/../../../../aarch64-linux-gnu/bin/ld: crypto_aead_schwaemm256256v1.a(encrypt.o): in function `crypto_aead_schwaemm256256v1_ref_encrypt':
try.c: encrypt.c:(.text+0x...): undefined reference to `initialize'
try.c: /opt/arm/gcc-8.2.0_Generic-AArch64_Ubuntu-16.04_aarch64-linux/bin/../lib/gcc/aarch64-linux-gnu/8.2.0/../../../../aarch64-linux-gnu/bin/ld: encrypt.c:(.text+0x...): undefined reference to `processAD'
try.c: /opt/arm/gcc-8.2.0_Generic-AArch64_Ubuntu-16.04_aarch64-linux/bin/../lib/gcc/aarch64-linux-gnu/8.2.0/../../../../aarch64-linux-gnu/bin/ld: encrypt.c:(.text+0x...): undefined reference to `encryptPT'
try.c: /opt/arm/gcc-8.2.0_Generic-AArch64_Ubuntu-16.04_aarch64-linux/bin/../lib/gcc/aarch64-linux-gnu/8.2.0/../../../../aarch64-linux-gnu/bin/ld: crypto_aead_schwaemm256256v1.a(encrypt.o): in function `crypto_aead_schwaemm256256v1_ref_decrypt':
try.c: encrypt.c:(.text+0x...): undefined reference to `initialize'
try.c: /opt/arm/gcc-8.2.0_Generic-AArch64_Ubuntu-16.04_aarch64-linux/bin/../lib/gcc/aarch64-linux-gnu/8.2.0/../../../../aarch64-linux-gnu/bin/ld: encrypt.c:(.text+0x...): undefined reference to `processAD'
try.c: /opt/arm/gcc-8.2.0_Generic-AArch64_Ubuntu-16.04_aarch64-linux/bin/../lib/gcc/aarch64-linux-gnu/8.2.0/../../../../aarch64-linux-gnu/bin/ld: encrypt.c:(.text+0x...): undefined reference to `decryptCT'
try.c: collect2: error: ld returned 1 exit status

Number of similar (compiler,implementation) pairs: 1, namely:
CompilerImplementations
gcc -march=native -mtune=native -Os -fomit-frame-pointer -fwrapv -fPIC -fPIE ref

Namespace violations

Implementation: crypto_aead/schwaemm256256v1/opt
Compiler: gcc -march=native -mtune=native -O2 -fomit-frame-pointer -fwrapv -fPIC -fPIE
sparkle_opt.o print_state_opt T
sparkle_opt.o sparkle_inv_opt T
sparkle_opt.o sparkle_opt T
sparkle_opt.o test_sparkle_opt T
util.o C_SEED R
util.o feistelSwap T
util.o load32 T
util.o pad T
util.o rho1 T
util.o rho2 T
util.o rhop1 T
util.o sparklePermutation T
util.o store32 T

Number of similar (compiler,implementation) pairs: 3, namely:
CompilerImplementations
gcc -march=native -mtune=native -O2 -fomit-frame-pointer -fwrapv -fPIC -fPIE opt
gcc -march=native -mtune=native -O3 -fomit-frame-pointer -fwrapv -fPIC -fPIE opt
gcc -march=native -mtune=native -O -fomit-frame-pointer -fwrapv -fPIC -fPIE opt

Namespace violations

Implementation: crypto_aead/schwaemm256256v1/ref
Compiler: gcc -march=native -mtune=native -O2 -fomit-frame-pointer -fwrapv -fPIC -fPIE
sparkle_ref.o linear_layer T
sparkle_ref.o linear_layer_inv T
sparkle_ref.o print_state_ref T
sparkle_ref.o sparkle_inv_ref T
sparkle_ref.o sparkle_ref T
sparkle_ref.o test_sparkle_ref T
util.o C_SEED R
util.o feistelSwap T
util.o load32 T
util.o pad T
util.o rho1 T
util.o rho2 T
util.o rhop1 T
util.o sparklePermutation T
util.o store32 T

Number of similar (compiler,implementation) pairs: 3, namely:
CompilerImplementations
gcc -march=native -mtune=native -O2 -fomit-frame-pointer -fwrapv -fPIC -fPIE ref
gcc -march=native -mtune=native -O3 -fomit-frame-pointer -fwrapv -fPIC -fPIE ref
gcc -march=native -mtune=native -O -fomit-frame-pointer -fwrapv -fPIC -fPIE ref