Implementation notes: aarch64, googlecoraldev, crypto_sign/sphincss128harakarobust

Computer: googlecoraldev
Architecture: aarch64
CPU ID: 410fd034
SUPERCOP version: 20191221
Operation: crypto_sign
Primitive: sphincss128harakarobust
TimeObject sizeTest sizeImplementationCompilerBenchmark dateSUPERCOP version
1466662734019496 0 128039169 928 2888refgcc_-march=native_-mtune=native_-O3_-fomit-frame-pointer_-fwrapv_-fPIC_-fPIE2020010520191221
1544828742021564 0 128041566 840 2872refclang_-mcpu=native_-O3_-fomit-frame-pointer_-fwrapv_-Qunused-arguments_-fPIC_-fPIE2020010520191221
2101430214014760 0 128033193 928 2872refgcc_-march=native_-mtune=native_-O2_-fomit-frame-pointer_-fwrapv_-fPIC_-fPIE2020010520191221
2383185474013968 0 128031417 912 2856refgcc_-march=native_-mtune=native_-Os_-fomit-frame-pointer_-fwrapv_-fPIC_-fPIE2020010520191221
2725186536014840 0 128033289 928 2872refgcc_-march=native_-mtune=native_-O_-fomit-frame-pointer_-fwrapv_-fPIC_-fPIE2020010520191221

Compiler output

Implementation: crypto_sign/sphincss128harakarobust/aesni
Compiler: clang -mcpu=native -O3 -fomit-frame-pointer -fwrapv -Qunused-arguments -fPIC -fPIE
haraka.c: In file included from haraka.c:11:
haraka.c: In file included from /usr/lib/llvm-7/lib/clang/7.0.1/include/immintrin.h:28:
haraka.c: /usr/lib/llvm-7/lib/clang/7.0.1/include/mmintrin.h:64:12: error: invalid conversion between vector type '__m64' (vector of 1 'long long' value) and integer type 'int' of different size
haraka.c: return (__m64)__builtin_ia32_vec_init_v2si(__i, 0);
haraka.c: ^~~~~~~~~~~~~~~~~~~~~~~~~~~~~~~~~~~~~~~~~~~
haraka.c: /usr/lib/llvm-7/lib/clang/7.0.1/include/mmintrin.h:143:12: error: invalid conversion between vector type '__m64' (vector of 1 'long long' value) and integer type 'int' of different size
haraka.c: return (__m64)__builtin_ia32_packsswb((__v4hi)__m1, (__v4hi)__m2);
haraka.c: ^~~~~~~~~~~~~~~~~~~~~~~~~~~~~~~~~~~~~~~~~~~~~~~~~~~~~~~~~~
haraka.c: /usr/lib/llvm-7/lib/clang/7.0.1/include/mmintrin.h:173:12: error: invalid conversion between vector type '__m64' (vector of 1 'long long' value) and integer type 'int' of different size
haraka.c: return (__m64)__builtin_ia32_packssdw((__v2si)__m1, (__v2si)__m2);
haraka.c: ^~~~~~~~~~~~~~~~~~~~~~~~~~~~~~~~~~~~~~~~~~~~~~~~~~~~~~~~~~
haraka.c: /usr/lib/llvm-7/lib/clang/7.0.1/include/mmintrin.h:203:12: error: invalid conversion between vector type '__m64' (vector of 1 'long long' value) and integer type 'int' of different size
haraka.c: return (__m64)__builtin_ia32_packuswb((__v4hi)__m1, (__v4hi)__m2);
haraka.c: ^~~~~~~~~~~~~~~~~~~~~~~~~~~~~~~~~~~~~~~~~~~~~~~~~~~~~~~~~~
haraka.c: /usr/lib/llvm-7/lib/clang/7.0.1/include/mmintrin.h:230:12: error: invalid conversion between vector type '__m64' (vector of 1 'long long' value) and integer type 'int' of different size
haraka.c: return (__m64)__builtin_ia32_punpckhbw((__v8qi)__m1, (__v8qi)__m2);
haraka.c: ^~~~~~~~~~~~~~~~~~~~~~~~~~~~~~~~~~~~~~~~~~~~~~~~~~~~~~~~~~~
haraka.c: /usr/lib/llvm-7/lib/clang/7.0.1/include/mmintrin.h:253:12: error: invalid conversion between vector type '__m64' (vector of 1 'long long' value) and integer type 'int' of different size
haraka.c: return (__m64)__builtin_ia32_punpckhwd((__v4hi)__m1, (__v4hi)__m2);
haraka.c: ^~~~~~~~~~~~~~~~~~~~~~~~~~~~~~~~~~~~~~~~~~~~~~~~~~~~~~~~~~~
haraka.c: /usr/lib/llvm-7/lib/clang/7.0.1/include/mmintrin.h:274:12: error: invalid conversion between vector type '__m64' (vector of 1 'long long' value) and integer type 'int' of different size
haraka.c: return (__m64)__builtin_ia32_punpckhdq((__v2si)__m1, (__v2si)__m2);
haraka.c: ^~~~~~~~~~~~~~~~~~~~~~~~~~~~~~~~~~~~~~~~~~~~~~~~~~~~~~~~~~~
haraka.c: /usr/lib/llvm-7/lib/clang/7.0.1/include/mmintrin.h:301:12: error: invalid conversion between vector type '__m64' (vector of 1 'long long' value) and integer type 'int' of different size
haraka.c: return (__m64)__builtin_ia32_punpcklbw((__v8qi)__m1, (__v8qi)__m2);
haraka.c: ...

Number of similar (compiler,implementation) pairs: 1, namely:
CompilerImplementations
clang -mcpu=native -O3 -fomit-frame-pointer -fwrapv -Qunused-arguments -fPIC -fPIE aesni

Compiler output

Implementation: crypto_sign/sphincss128harakarobust/aesni
Compiler: gcc -march=native -mtune=native -O2 -fomit-frame-pointer -fwrapv -fPIC -fPIE
haraka.c: haraka.c:11:10: fatal error: immintrin.h: No such file or directory
haraka.c: #include "immintrin.h"
haraka.c: ^~~~~~~~~~~~~
haraka.c: compilation terminated.

Number of similar (compiler,implementation) pairs: 4, namely:
CompilerImplementations
gcc -march=native -mtune=native -O2 -fomit-frame-pointer -fwrapv -fPIC -fPIE aesni
gcc -march=native -mtune=native -O3 -fomit-frame-pointer -fwrapv -fPIC -fPIE aesni
gcc -march=native -mtune=native -O -fomit-frame-pointer -fwrapv -fPIC -fPIE aesni
gcc -march=native -mtune=native -Os -fomit-frame-pointer -fwrapv -fPIC -fPIE aesni

Namespace violations

Implementation: crypto_sign/sphincss128harakarobust/ref
Compiler: clang -mcpu=native -O3 -fomit-frame-pointer -fwrapv -Qunused-arguments -fPIC -fPIE
address.o addr_to_bytes T
address.o copy_keypair_addr T
address.o copy_subtree_addr T
address.o set_chain_addr T
address.o set_hash_addr T
address.o set_keypair_addr T
address.o set_layer_addr T
address.o set_tree_addr T
address.o set_tree_height T
address.o set_tree_index T
address.o set_type T
fors.o fors_pk_from_sig T
fors.o fors_sign T
haraka.o br_aes_ct_bitslice_Sbox T
haraka.o br_aes_ct_ortho T
haraka.o haraka256 T
haraka.o haraka256_sk T
haraka.o haraka512 T
haraka.o haraka512_perm T
haraka.o haraka_S T
haraka.o haraka_S_inc_absorb T
haraka.o haraka_S_inc_finalize T
haraka.o haraka_S_inc_init T
haraka.o haraka_S_inc_squeeze T
haraka.o interleave_constant T
haraka.o interleave_constant32 T
haraka.o tweak_constants T
hash_haraka.o gen_message_random T
hash_haraka.o hash_message T
hash_haraka.o initialize_hash_function T
hash_haraka.o prf_addr T
sign.o crypto_sign_bytes T
sign.o crypto_sign_publickeybytes T
sign.o crypto_sign_secretkeybytes T
sign.o crypto_sign_seed_keypair T
sign.o crypto_sign_seedbytes T
sign.o crypto_sign_signature T
sign.o crypto_sign_verify T
thash_haraka_robust.o thash T
utils.o bytes_to_ull T
utils.o compute_root T
utils.o treehash T
utils.o ull_to_bytes T
wots.o wots_gen_pk T
wots.o wots_pk_from_sig T
wots.o wots_sign T

Number of similar (compiler,implementation) pairs: 5, namely:
CompilerImplementations
clang -mcpu=native -O3 -fomit-frame-pointer -fwrapv -Qunused-arguments -fPIC -fPIE ref
gcc -march=native -mtune=native -O2 -fomit-frame-pointer -fwrapv -fPIC -fPIE ref
gcc -march=native -mtune=native -O3 -fomit-frame-pointer -fwrapv -fPIC -fPIE ref
gcc -march=native -mtune=native -O -fomit-frame-pointer -fwrapv -fPIC -fPIE ref
gcc -march=native -mtune=native -Os -fomit-frame-pointer -fwrapv -fPIC -fPIE ref