Implementation notes: aarch64, googlecoraldev, crypto_kem/lotus128

Computer: googlecoraldev
Architecture: aarch64
CPU ID: 410fd034
SUPERCOP version: 20191221
Operation: crypto_kem
Primitive: lotus128
TimeObject sizeTest sizeImplementationCompilerBenchmark dateSUPERCOP version
270360034365 0 853358 952 1584optgcc_-march=native_-mtune=native_-O3_-fomit-frame-pointer_-fwrapv_-fPIC_-fPIE2020010620191221
308250027293 0 846230 952 1584refgcc_-march=native_-mtune=native_-O3_-fomit-frame-pointer_-fwrapv_-fPIC_-fPIE2020010620191221
477936031920 0 851707 888 1584optclang_-mcpu=native_-O3_-fomit-frame-pointer_-fwrapv_-Qunused-arguments_-fPIC_-fPIE2020010620191221
529938021480 0 841259 888 1584refclang_-mcpu=native_-O3_-fomit-frame-pointer_-fwrapv_-Qunused-arguments_-fPIC_-fPIE2020010620191221
1475532011125 0 828918 952 1568optgcc_-march=native_-mtune=native_-O2_-fomit-frame-pointer_-fwrapv_-fPIC_-fPIE2020010620191221
147564009897 0 826830 936 1568optgcc_-march=native_-mtune=native_-Os_-fomit-frame-pointer_-fwrapv_-fPIC_-fPIE2020010620191221
150544808625 0 826334 952 1568refgcc_-march=native_-mtune=native_-O2_-fomit-frame-pointer_-fwrapv_-fPIC_-fPIE2020010620191221
1561914010461 0 828270 952 1568optgcc_-march=native_-mtune=native_-O_-fomit-frame-pointer_-fwrapv_-fPIC_-fPIE2020010620191221
156468607829 0 824686 936 1568refgcc_-march=native_-mtune=native_-Os_-fomit-frame-pointer_-fwrapv_-fPIC_-fPIE2020010620191221
167718608365 0 826102 952 1568refgcc_-march=native_-mtune=native_-O_-fomit-frame-pointer_-fwrapv_-fPIC_-fPIE2020010620191221

Compiler output

Implementation: crypto_kem/lotus128/avx2
Compiler: clang -mcpu=native -O3 -fomit-frame-pointer -fwrapv -Qunused-arguments -fPIC -fPIE
lwe-arithmetics_avx2.c: In file included from lwe-arithmetics_avx2.c:10:
lwe-arithmetics_avx2.c: In file included from /usr/lib/llvm-7/lib/clang/7.0.1/include/immintrin.h:28:
lwe-arithmetics_avx2.c: /usr/lib/llvm-7/lib/clang/7.0.1/include/mmintrin.h:64:12: error: invalid conversion between vector type '__m64' (vector of 1 'long long' value) and integer type 'int' of different size
lwe-arithmetics_avx2.c: return (__m64)__builtin_ia32_vec_init_v2si(__i, 0);
lwe-arithmetics_avx2.c: ^~~~~~~~~~~~~~~~~~~~~~~~~~~~~~~~~~~~~~~~~~~
lwe-arithmetics_avx2.c: /usr/lib/llvm-7/lib/clang/7.0.1/include/mmintrin.h:143:12: error: invalid conversion between vector type '__m64' (vector of 1 'long long' value) and integer type 'int' of different size
lwe-arithmetics_avx2.c: return (__m64)__builtin_ia32_packsswb((__v4hi)__m1, (__v4hi)__m2);
lwe-arithmetics_avx2.c: ^~~~~~~~~~~~~~~~~~~~~~~~~~~~~~~~~~~~~~~~~~~~~~~~~~~~~~~~~~
lwe-arithmetics_avx2.c: /usr/lib/llvm-7/lib/clang/7.0.1/include/mmintrin.h:173:12: error: invalid conversion between vector type '__m64' (vector of 1 'long long' value) and integer type 'int' of different size
lwe-arithmetics_avx2.c: return (__m64)__builtin_ia32_packssdw((__v2si)__m1, (__v2si)__m2);
lwe-arithmetics_avx2.c: ^~~~~~~~~~~~~~~~~~~~~~~~~~~~~~~~~~~~~~~~~~~~~~~~~~~~~~~~~~
lwe-arithmetics_avx2.c: /usr/lib/llvm-7/lib/clang/7.0.1/include/mmintrin.h:203:12: error: invalid conversion between vector type '__m64' (vector of 1 'long long' value) and integer type 'int' of different size
lwe-arithmetics_avx2.c: return (__m64)__builtin_ia32_packuswb((__v4hi)__m1, (__v4hi)__m2);
lwe-arithmetics_avx2.c: ^~~~~~~~~~~~~~~~~~~~~~~~~~~~~~~~~~~~~~~~~~~~~~~~~~~~~~~~~~
lwe-arithmetics_avx2.c: /usr/lib/llvm-7/lib/clang/7.0.1/include/mmintrin.h:230:12: error: invalid conversion between vector type '__m64' (vector of 1 'long long' value) and integer type 'int' of different size
lwe-arithmetics_avx2.c: return (__m64)__builtin_ia32_punpckhbw((__v8qi)__m1, (__v8qi)__m2);
lwe-arithmetics_avx2.c: ^~~~~~~~~~~~~~~~~~~~~~~~~~~~~~~~~~~~~~~~~~~~~~~~~~~~~~~~~~~
lwe-arithmetics_avx2.c: /usr/lib/llvm-7/lib/clang/7.0.1/include/mmintrin.h:253:12: error: invalid conversion between vector type '__m64' (vector of 1 'long long' value) and integer type 'int' of different size
lwe-arithmetics_avx2.c: return (__m64)__builtin_ia32_punpckhwd((__v4hi)__m1, (__v4hi)__m2);
lwe-arithmetics_avx2.c: ^~~~~~~~~~~~~~~~~~~~~~~~~~~~~~~~~~~~~~~~~~~~~~~~~~~~~~~~~~~
lwe-arithmetics_avx2.c: /usr/lib/llvm-7/lib/clang/7.0.1/include/mmintrin.h:274:12: error: invalid conversion between vector type '__m64' (vector of 1 'long long' value) and integer type 'int' of different size
lwe-arithmetics_avx2.c: return (__m64)__builtin_ia32_punpckhdq((__v2si)__m1, (__v2si)__m2);
lwe-arithmetics_avx2.c: ^~~~~~~~~~~~~~~~~~~~~~~~~~~~~~~~~~~~~~~~~~~~~~~~~~~~~~~~~~~
lwe-arithmetics_avx2.c: /usr/lib/llvm-7/lib/clang/7.0.1/include/mmintrin.h:301:12: error: invalid conversion between vector type '__m64' (vector of 1 'long long' value) and integer type 'int' of different size
lwe-arithmetics_avx2.c: return (__m64)__builtin_ia32_punpcklbw((__v8qi)__m1, (__v8qi)__m2);
lwe-arithmetics_avx2.c: ...

Number of similar (compiler,implementation) pairs: 1, namely:
CompilerImplementations
clang -mcpu=native -O3 -fomit-frame-pointer -fwrapv -Qunused-arguments -fPIC -fPIE avx2

Compiler output

Implementation: crypto_kem/lotus128/avx2
Compiler: gcc -march=native -mtune=native -O2 -fomit-frame-pointer -fwrapv -fPIC -fPIE
lwe-arithmetics_avx2.c: lwe-arithmetics_avx2.c:10:10: fatal error: immintrin.h: No such file or directory
lwe-arithmetics_avx2.c: #include <immintrin.h>
lwe-arithmetics_avx2.c: ^~~~~~~~~~~~~
lwe-arithmetics_avx2.c: compilation terminated.

Number of similar (compiler,implementation) pairs: 4, namely:
CompilerImplementations
gcc -march=native -mtune=native -O2 -fomit-frame-pointer -fwrapv -fPIC -fPIE avx2
gcc -march=native -mtune=native -O3 -fomit-frame-pointer -fwrapv -fPIC -fPIE avx2
gcc -march=native -mtune=native -O -fomit-frame-pointer -fwrapv -fPIC -fPIE avx2
gcc -march=native -mtune=native -Os -fomit-frame-pointer -fwrapv -fPIC -fPIE avx2

Namespace violations

Implementation: crypto_kem/lotus128/ref
Compiler: clang -mcpu=native -O3 -fomit-frame-pointer -fwrapv -Qunused-arguments -fPIC -fPIE
cpa-pke.o lotus_cpa_pke_dec T
cpa-pke.o lotus_cpa_pke_enc T
cpa-pke.o lotus_cpa_pke_keypair T
crypto.o crypto_symenc_keysetup T
crypto.o crypto_symenc_keystream T
kem.o util_cmp_const T
kem.o xor_ss T
lwe-arithmetics.o add_sigma T
lwe-arithmetics.o addmul T
lwe-arithmetics.o addmul_concat T
lwe-arithmetics.o reconstruct T
lwe-arithmetics.o redc T
lwe-arithmetics.o submul T
pack.o pack_128dg T
pack.o pack_128elems T
pack.o pack_64elems T
pack.o pack_ct T
pack.o pack_pk T
pack.o pack_sk T
pack.o unpack_128dg T
pack.o unpack_128elems T
pack.o unpack_64elems T
pack.o unpack_ct T
pack.o unpack_pk T
pack.o unpack_sk T
sampler.o _LOTUS_KYDG_SAMPLER_L1_pMat R
sampler.o _LOTUS_KYDG_SAMPLER_L1_weight R
sampler.o _LOTUS_KYDG_SAMPLER_LUT R
sampler.o csprng_sample_bit T
sampler.o csprng_sample_byte T
sampler.o extend_sign_with_random_bit T
sampler.o sample_discrete_gaussian T
sampler.o sample_uniform T
sampler.o sample_unit_discrete_gaussian T
sampler.o sampler_init T
sampler.o sampler_set_seed T
sampler.o scan_bit_and_output T

Number of similar (compiler,implementation) pairs: 5, namely:
CompilerImplementations
clang -mcpu=native -O3 -fomit-frame-pointer -fwrapv -Qunused-arguments -fPIC -fPIE ref
gcc -march=native -mtune=native -O2 -fomit-frame-pointer -fwrapv -fPIC -fPIE ref
gcc -march=native -mtune=native -O3 -fomit-frame-pointer -fwrapv -fPIC -fPIE ref
gcc -march=native -mtune=native -O -fomit-frame-pointer -fwrapv -fPIC -fPIE ref
gcc -march=native -mtune=native -Os -fomit-frame-pointer -fwrapv -fPIC -fPIE ref

Namespace violations

Implementation: crypto_kem/lotus128/opt
Compiler: clang -mcpu=native -O3 -fomit-frame-pointer -fwrapv -Qunused-arguments -fPIC -fPIE
cpa-pke_opt.o lotus_cpa_pke_dec_packed T
cpa-pke_opt.o lotus_cpa_pke_enc_packed T
cpa-pke_opt.o lotus_cpa_pke_keypair T
crypto.o crypto_symenc_keysetup T
crypto.o crypto_symenc_keystream T
crypto.o crypto_symenc_keystream_13block T
crypto.o crypto_symenc_keystream_32block T
kem.o util_cmp_const T
kem.o xor_ss T
lwe-arithmetics_opt.o add_sigma T
lwe-arithmetics_opt.o distribute_2x2_nl T
lwe-arithmetics_opt.o distribute_2x2_nn T
lwe-arithmetics_opt.o merge_2x2_nl T
lwe-arithmetics_opt.o reconstruct T
lwe-arithmetics_opt.o redc T
lwe-arithmetics_opt.o submat_add_nl T
lwe-arithmetics_opt.o submat_add_nn T
lwe-arithmetics_opt.o submat_negmul T
lwe-arithmetics_opt.o submat_negsubmul T
lwe-arithmetics_opt.o submat_sub_nl T
lwe-arithmetics_opt.o submat_sub_nn T
lwe-arithmetics_opt.o submat_submul T
lwe-arithmetics_opt.o submul T
pack.o pack_128dg T
pack.o pack_128elems T
pack.o pack_64elems T
pack.o pack_ct T
pack.o pack_pk T
pack.o pack_sk T
pack.o unpack_128dg T
pack.o unpack_128elems T
pack.o unpack_64elems T
pack.o unpack_ct T
pack.o unpack_pk T
pack.o unpack_sk T
sampler.o _LOTUS_KYDG_SAMPLER_L1_pMat R
sampler.o _LOTUS_KYDG_SAMPLER_L1_weight R
sampler.o _LOTUS_KYDG_SAMPLER_LUT R
sampler.o csprng_sample_bit T
sampler.o csprng_sample_byte T
sampler.o extend_sign_with_random_bit T
sampler.o sample_discrete_gaussian T
sampler.o sample_uniform T
sampler.o sample_unit_discrete_gaussian T
sampler.o sampler_init T
sampler.o sampler_set_seed T
sampler.o scan_bit_and_output T

Number of similar (compiler,implementation) pairs: 5, namely:
CompilerImplementations
clang -mcpu=native -O3 -fomit-frame-pointer -fwrapv -Qunused-arguments -fPIC -fPIE opt
gcc -march=native -mtune=native -O2 -fomit-frame-pointer -fwrapv -fPIC -fPIE opt
gcc -march=native -mtune=native -O3 -fomit-frame-pointer -fwrapv -fPIC -fPIE opt
gcc -march=native -mtune=native -O -fomit-frame-pointer -fwrapv -fPIC -fPIE opt
gcc -march=native -mtune=native -Os -fomit-frame-pointer -fwrapv -fPIC -fPIE opt