Implementation notes: aarch64, googlecoraldev, crypto_kem/firesaber2

Computer: googlecoraldev
Architecture: aarch64
CPU ID: 410fd034
SUPERCOP version: 20191221
Operation: crypto_kem
Primitive: firesaber2
TimeObject sizeTest sizeImplementationCompilerBenchmark dateSUPERCOP version
154494073763 0 091755 840 1616refclang_-mcpu=native_-O3_-fomit-frame-pointer_-fwrapv_-Qunused-arguments_-fPIC_-fPIE2020010620191221
170892039341 0 057766 904 1632refgcc_-march=native_-mtune=native_-O3_-fomit-frame-pointer_-fwrapv_-fPIC_-fPIE2020010620191221
536706012329 0 029582 904 1616refgcc_-march=native_-mtune=native_-O2_-fomit-frame-pointer_-fwrapv_-fPIC_-fPIE2020010620191221
596916011411 0 027622 888 1600refgcc_-march=native_-mtune=native_-Os_-fomit-frame-pointer_-fwrapv_-fPIC_-fPIE2020010620191221
741924011773 0 028926 904 1616refgcc_-march=native_-mtune=native_-O_-fomit-frame-pointer_-fwrapv_-fPIC_-fPIE2020010620191221

Compiler output

Implementation: crypto_kem/firesaber2/avx2
Compiler: clang -mcpu=native -O3 -fomit-frame-pointer -fwrapv -Qunused-arguments -fPIC -fPIE
SABER_indcpa.c: In file included from SABER_indcpa.c:4:
SABER_indcpa.c: In file included from ./SABER_indcpa.h:4:
SABER_indcpa.c: In file included from /usr/lib/llvm-7/lib/clang/7.0.1/include/immintrin.h:28:
SABER_indcpa.c: /usr/lib/llvm-7/lib/clang/7.0.1/include/mmintrin.h:64:12: error: invalid conversion between vector type '__m64' (vector of 1 'long long' value) and integer type 'int' of different size
SABER_indcpa.c: return (__m64)__builtin_ia32_vec_init_v2si(__i, 0);
SABER_indcpa.c: ^~~~~~~~~~~~~~~~~~~~~~~~~~~~~~~~~~~~~~~~~~~
SABER_indcpa.c: /usr/lib/llvm-7/lib/clang/7.0.1/include/mmintrin.h:143:12: error: invalid conversion between vector type '__m64' (vector of 1 'long long' value) and integer type 'int' of different size
SABER_indcpa.c: return (__m64)__builtin_ia32_packsswb((__v4hi)__m1, (__v4hi)__m2);
SABER_indcpa.c: ^~~~~~~~~~~~~~~~~~~~~~~~~~~~~~~~~~~~~~~~~~~~~~~~~~~~~~~~~~
SABER_indcpa.c: /usr/lib/llvm-7/lib/clang/7.0.1/include/mmintrin.h:173:12: error: invalid conversion between vector type '__m64' (vector of 1 'long long' value) and integer type 'int' of different size
SABER_indcpa.c: return (__m64)__builtin_ia32_packssdw((__v2si)__m1, (__v2si)__m2);
SABER_indcpa.c: ^~~~~~~~~~~~~~~~~~~~~~~~~~~~~~~~~~~~~~~~~~~~~~~~~~~~~~~~~~
SABER_indcpa.c: /usr/lib/llvm-7/lib/clang/7.0.1/include/mmintrin.h:203:12: error: invalid conversion between vector type '__m64' (vector of 1 'long long' value) and integer type 'int' of different size
SABER_indcpa.c: return (__m64)__builtin_ia32_packuswb((__v4hi)__m1, (__v4hi)__m2);
SABER_indcpa.c: ^~~~~~~~~~~~~~~~~~~~~~~~~~~~~~~~~~~~~~~~~~~~~~~~~~~~~~~~~~
SABER_indcpa.c: /usr/lib/llvm-7/lib/clang/7.0.1/include/mmintrin.h:230:12: error: invalid conversion between vector type '__m64' (vector of 1 'long long' value) and integer type 'int' of different size
SABER_indcpa.c: return (__m64)__builtin_ia32_punpckhbw((__v8qi)__m1, (__v8qi)__m2);
SABER_indcpa.c: ^~~~~~~~~~~~~~~~~~~~~~~~~~~~~~~~~~~~~~~~~~~~~~~~~~~~~~~~~~~
SABER_indcpa.c: /usr/lib/llvm-7/lib/clang/7.0.1/include/mmintrin.h:253:12: error: invalid conversion between vector type '__m64' (vector of 1 'long long' value) and integer type 'int' of different size
SABER_indcpa.c: return (__m64)__builtin_ia32_punpckhwd((__v4hi)__m1, (__v4hi)__m2);
SABER_indcpa.c: ^~~~~~~~~~~~~~~~~~~~~~~~~~~~~~~~~~~~~~~~~~~~~~~~~~~~~~~~~~~
SABER_indcpa.c: /usr/lib/llvm-7/lib/clang/7.0.1/include/mmintrin.h:274:12: error: invalid conversion between vector type '__m64' (vector of 1 'long long' value) and integer type 'int' of different size
SABER_indcpa.c: return (__m64)__builtin_ia32_punpckhdq((__v2si)__m1, (__v2si)__m2);
SABER_indcpa.c: ^~~~~~~~~~~~~~~~~~~~~~~~~~~~~~~~~~~~~~~~~~~~~~~~~~~~~~~~~~~
SABER_indcpa.c: /usr/lib/llvm-7/lib/clang/7.0.1/include/mmintrin.h:301:12: error: invalid conversion between vector type '__m64' (vector of 1 'long long' value) and integer type 'int' of different size
SABER_indcpa.c: ...

Number of similar (compiler,implementation) pairs: 1, namely:
CompilerImplementations
clang -mcpu=native -O3 -fomit-frame-pointer -fwrapv -Qunused-arguments -fPIC -fPIE avx2

Compiler output

Implementation: crypto_kem/firesaber2/avx2
Compiler: gcc -march=native -mtune=native -O2 -fomit-frame-pointer -fwrapv -fPIC -fPIE
SABER_indcpa.c: In file included from SABER_indcpa.c:4:
SABER_indcpa.c: SABER_indcpa.h:4:10: fatal error: immintrin.h: No such file or directory
SABER_indcpa.c: #include <immintrin.h>
SABER_indcpa.c: ^~~~~~~~~~~~~
SABER_indcpa.c: compilation terminated.

Number of similar (compiler,implementation) pairs: 4, namely:
CompilerImplementations
gcc -march=native -mtune=native -O2 -fomit-frame-pointer -fwrapv -fPIC -fPIE avx2
gcc -march=native -mtune=native -O3 -fomit-frame-pointer -fwrapv -fPIC -fPIE avx2
gcc -march=native -mtune=native -O -fomit-frame-pointer -fwrapv -fPIC -fPIE avx2
gcc -march=native -mtune=native -Os -fomit-frame-pointer -fwrapv -fPIC -fPIE avx2

Namespace violations

Implementation: crypto_kem/firesaber2/ref
Compiler: clang -mcpu=native -O3 -fomit-frame-pointer -fwrapv -Qunused-arguments -fPIC -fPIE
SABER_indcpa.o GenMatrix T
SABER_indcpa.o InnerProd T
SABER_indcpa.o MatrixVectorMul T
SABER_indcpa.o POL2MSG T
SABER_indcpa.o clock1 C
SABER_indcpa.o clock2 C
SABER_indcpa.o clock_cl_mv C
SABER_indcpa.o clock_cl_sm C
SABER_indcpa.o clock_kp_mv C
SABER_indcpa.o clock_kp_sm C
SABER_indcpa.o indcpa_kem_dec T
SABER_indcpa.o indcpa_kem_enc T
SABER_indcpa.o indcpa_kem_keypair T
SABER_indcpa.o karatsuba_simple T
SABER_indcpa.o pol_mul T
SABER_indcpa.o print_poly2 T
SABER_indcpa.o reduce T
SABER_indcpa.o toom_cook_4way T
cbd.o cbd T
fips202.o KeccakF1600_StatePermute T
fips202.o cshake128_simple T
fips202.o cshake128_simple_absorb T
fips202.o cshake128_simple_squeezeblocks T
fips202.o sha3_256 T
fips202.o sha3_512 T
fips202.o shake128 T
kem.o clock1 C
kem.o clock2 C
kem.o clock_cl_mv C
kem.o clock_cl_sm C
kem.o clock_kp_mv C
kem.o clock_kp_sm C
pack_unpack.o BS2POL T
pack_unpack.o BS2POLVEC T
pack_unpack.o BS2POLVECp T
pack_unpack.o BS2POLVECq T
pack_unpack.o POLVEC2BS T
pack_unpack.o POLVECp2BS T
pack_unpack.o POLVECq2BS T
pack_unpack.o SABER_pack_3bit T
pack_unpack.o SABER_pack_4bit T
pack_unpack.o SABER_pack_6bit T
pack_unpack.o SABER_un_pack3bit T
pack_unpack.o SABER_un_pack4bit T
pack_unpack.o SABER_un_pack6bit T
poly.o GenSecret T
verify.o cmov T
verify.o verify T

Number of similar (compiler,implementation) pairs: 5, namely:
CompilerImplementations
clang -mcpu=native -O3 -fomit-frame-pointer -fwrapv -Qunused-arguments -fPIC -fPIE ref
gcc -march=native -mtune=native -O2 -fomit-frame-pointer -fwrapv -fPIC -fPIE ref
gcc -march=native -mtune=native -O3 -fomit-frame-pointer -fwrapv -fPIC -fPIE ref
gcc -march=native -mtune=native -O -fomit-frame-pointer -fwrapv -fPIC -fPIE ref
gcc -march=native -mtune=native -Os -fomit-frame-pointer -fwrapv -fPIC -fPIE ref