Implementation notes: aarch64, googlecoraldev, crypto_kem/bike2l1sc

Computer: googlecoraldev
Architecture: aarch64
CPU ID: 410fd034
SUPERCOP version: 20191221
Operation: crypto_kem
Primitive: bike2l1sc

Compiler output

Implementation: crypto_kem/bike2l1sc/ref_ossl
Compiler: clang -mcpu=native -O3 -fomit-frame-pointer -fwrapv -Qunused-arguments -fPIC -fPIE
aes_ctr_prf.c: In file included from aes_ctr_prf.c:14:
aes_ctr_prf.c: ./utilities.h:93:28: error: unknown register name 'rdx' in asm
aes_ctr_prf.c: : "rdx");
aes_ctr_prf.c: ^
aes_ctr_prf.c: ./utilities.h:108:28: error: unknown register name 'rdx' in asm
aes_ctr_prf.c: : "rdx");
aes_ctr_prf.c: ^
aes_ctr_prf.c: ./utilities.h:125:28: error: unknown register name 'rdx' in asm
aes_ctr_prf.c: : "rdx");
aes_ctr_prf.c: ^
aes_ctr_prf.c: 3 errors generated.

Number of similar (compiler,implementation) pairs: 1, namely:
CompilerImplementations
clang -mcpu=native -O3 -fomit-frame-pointer -fwrapv -Qunused-arguments -fPIC -fPIE ref_ossl

Compiler output

Implementation: crypto_kem/bike2l1sc/avx2_ntl
Compiler: g++ -march=native -mtune=native -O2 -fomit-frame-pointer -fwrapv -fPIC -fPIE
aes.c: In file included from aes.c:12:
aes.c: aes.h:21:12: fatal error: wmmintrin.h: No such file or directory
aes.c: #include <wmmintrin.h>
aes.c: ^~~~~~~~~~~~~
aes.c: compilation terminated.

Number of similar (compiler,implementation) pairs: 8, namely:
CompilerImplementations
g++ -march=native -mtune=native -O2 -fomit-frame-pointer -fwrapv -fPIC -fPIE avx2_ntl ref_ntl
g++ -march=native -mtune=native -O3 -fomit-frame-pointer -fwrapv -fPIC -fPIE avx2_ntl ref_ntl
g++ -march=native -mtune=native -O -fomit-frame-pointer -fwrapv -fPIC -fPIE avx2_ntl ref_ntl
g++ -march=native -mtune=native -Os -fomit-frame-pointer -fwrapv -fPIC -fPIE avx2_ntl ref_ntl

Compiler output

Implementation: crypto_kem/bike2l1sc/ref_ossl
Compiler: gcc -march=native -mtune=native -O2 -fomit-frame-pointer -fwrapv -fPIC -fPIE
sampling.c: In file included from sampling.h:16,
sampling.c: from sampling.c:12:
sampling.c: utilities.h: In function 'generate_sparse_fake_rep':
sampling.c: utilities.h:87:5: error: unknown register name 'rdx' in 'asm'
sampling.c: __asm__ __volatile__("xor %%edx, %%edx; \n"
sampling.c: ^~~~~~~

Number of similar (compiler,implementation) pairs: 4, namely:
CompilerImplementations
gcc -march=native -mtune=native -O2 -fomit-frame-pointer -fwrapv -fPIC -fPIE ref_ossl
gcc -march=native -mtune=native -O3 -fomit-frame-pointer -fwrapv -fPIC -fPIE ref_ossl
gcc -march=native -mtune=native -O -fomit-frame-pointer -fwrapv -fPIC -fPIE ref_ossl
gcc -march=native -mtune=native -Os -fomit-frame-pointer -fwrapv -fPIC -fPIE ref_ossl