Implementation notes: aarch64, gcc185, crypto_aead/spook128su512v2

Computer: gcc185
Microarchitecture: aarch64; Skylark (503f0002)
Architecture: aarch64
CPU ID: 503f0002
SUPERCOP version: 20221122
Operation: crypto_aead
Primitive: spook128su512v2
TimeObject sizeTest sizeImplementationCompilerBenchmark dateSUPERCOP version
6552757088 0 022938 816 872T:refclang_-mcpu=native_-O3_-fomit-frame-pointer_-fwrapv_-Qunused-arguments_-fPIC_-fPIE2022101020221005
7776006020 0 021246 840 880T:refgcc_-march=native_-mtune=native_-O3_-fomit-frame-pointer_-fwrapv_-fPIC_-fPIE2022112420221122
8497504996 0 019150 840 864T:refgcc_-march=native_-mtune=native_-O2_-fomit-frame-pointer_-fwrapv_-fPIC_-fPIE2022112420221122
8721004796 0 019006 840 864T:refgcc_-march=native_-mtune=native_-O_-fomit-frame-pointer_-fwrapv_-fPIC_-fPIE2022112420221122
8957254652 0 017894 824 856T:refgcc_-march=native_-mtune=native_-Os_-fomit-frame-pointer_-fwrapv_-fPIC_-fPIE2022112420221122

Compiler output

Implementation: T:hes128c32
Security model: timingleaks
Compiler: clang -mcpu=native -O3 -fomit-frame-pointer -fwrapv -Qunused-arguments -fPIC -fPIE
shadow_128bit.c: In file included from shadow_128bit.c:34:
shadow_128bit.c: /usr/lib64/clang/14.0.6/include/xmmintrin.h:14:2: error: "This header is only meant to be used on x86 and x64 architecture"
shadow_128bit.c: #error "This header is only meant to be used on x86 and x64 architecture"
shadow_128bit.c: ^
shadow_128bit.c: In file included from shadow_128bit.c:34:
shadow_128bit.c: In file included from /usr/lib64/clang/14.0.6/include/xmmintrin.h:17:
shadow_128bit.c: /usr/lib64/clang/14.0.6/include/mmintrin.h:14:2: error: "This header is only meant to be used on x86 and x64 architecture"
shadow_128bit.c: #error "This header is only meant to be used on x86 and x64 architecture"
shadow_128bit.c: ^
shadow_128bit.c: /usr/lib64/clang/14.0.6/include/mmintrin.h:54:12: error: invalid conversion between vector type '__m64' (vector of 1 'long long' value) and integer type 'int' of different size
shadow_128bit.c: return (__m64)__builtin_ia32_vec_init_v2si(__i, 0);
shadow_128bit.c: ^~~~~~~~~~~~~~~~~~~~~~~~~~~~~~~~~~~~~~~~~~~
shadow_128bit.c: /usr/lib64/clang/14.0.6/include/mmintrin.h:133:12: error: invalid conversion between vector type '__m64' (vector of 1 'long long' value) and integer type 'int' of different size
shadow_128bit.c: return (__m64)__builtin_ia32_packsswb((__v4hi)__m1, (__v4hi)__m2);
shadow_128bit.c: ^~~~~~~~~~~~~~~~~~~~~~~~~~~~~~~~~~~~~~~~~~~~~~~~~~~~~~~~~~
shadow_128bit.c: /usr/lib64/clang/14.0.6/include/mmintrin.h:163:12: error: invalid conversion between vector type '__m64' (vector of 1 'long long' value) and integer type 'int' of different size
shadow_128bit.c: return (__m64)__builtin_ia32_packssdw((__v2si)__m1, (__v2si)__m2);
shadow_128bit.c: ^~~~~~~~~~~~~~~~~~~~~~~~~~~~~~~~~~~~~~~~~~~~~~~~~~~~~~~~~~
shadow_128bit.c: /usr/lib64/clang/14.0.6/include/mmintrin.h:193:12: error: invalid conversion between vector type '__m64' (vector of 1 'long long' value) and integer type 'int' of different size
shadow_128bit.c: return (__m64)__builtin_ia32_packuswb((__v4hi)__m1, (__v4hi)__m2);
shadow_128bit.c: ^~~~~~~~~~~~~~~~~~~~~~~~~~~~~~~~~~~~~~~~~~~~~~~~~~~~~~~~~~
shadow_128bit.c: /usr/lib64/clang/14.0.6/include/mmintrin.h:220:12: error: invalid conversion between vector type '__m64' (vector of 1 'long long' value) and integer type 'int' of different size
shadow_128bit.c: return (__m64)__builtin_ia32_punpckhbw((__v8qi)__m1, (__v8qi)__m2);
shadow_128bit.c: ^~~~~~~~~~~~~~~~~~~~~~~~~~~~~~~~~~~~~~~~~~~~~~~~~~~~~~~~~~~
shadow_128bit.c: /usr/lib64/clang/14.0.6/include/mmintrin.h:243:12: error: invalid conversion between vector type '__m64' (vector of 1 'long long' value) and integer type 'int' of different size
shadow_128bit.c: ...

Number of similar (compiler,implementation) pairs: 2, namely:
CompilerImplementations
clang -mcpu=native -O3 -fomit-frame-pointer -fwrapv -Qunused-arguments -fPIC -fPIE T:hes128c32 T:hes128c64

Compiler output

Implementation: T:hes128c32
Security model: timingleaks
Compiler: gcc -march=native -mtune=native -O2 -fomit-frame-pointer -fwrapv -fPIC -fPIE
shadow_128bit.c: shadow_128bit.c:34:10: fatal error: xmmintrin.h: No such file or directory
shadow_128bit.c: #include <xmmintrin.h>
shadow_128bit.c: ^~~~~~~~~~~~~
shadow_128bit.c: compilation terminated.

Number of similar (compiler,implementation) pairs: 8, namely:
CompilerImplementations
gcc -march=native -mtune=native -O2 -fomit-frame-pointer -fwrapv -fPIC -fPIE T:hes128c32
gcc -march=native -mtune=native -O3 -fomit-frame-pointer -fwrapv -fPIC -fPIE T:hes128c32
gcc -march=native -mtune=native -O -fomit-frame-pointer -fwrapv -fPIC -fPIE T:hes128c32
gcc -march=native -mtune=native -Os -fomit-frame-pointer -fwrapv -fPIC -fPIE T:hes128c32
gcc -march=native -mtune=native -O2 -fomit-frame-pointer -fwrapv -fPIC -fPIE T:hes128c64
gcc -march=native -mtune=native -O3 -fomit-frame-pointer -fwrapv -fPIC -fPIE T:hes128c64
gcc -march=native -mtune=native -O -fomit-frame-pointer -fwrapv -fPIC -fPIE T:hes128c64
gcc -march=native -mtune=native -Os -fomit-frame-pointer -fwrapv -fPIC -fPIE T:hes128c64