Implementation notes: aarch64, gcc185, crypto_aead/schwaemm256128v1

Computer: gcc185
Microarchitecture: aarch64; Skylark (503f0002)
Architecture: aarch64
CPU ID: 503f0002
SUPERCOP version: 20221122
Operation: crypto_aead
Primitive: schwaemm256128v1
TimeObject sizeTest sizeImplementationCompilerBenchmark dateSUPERCOP version
2618255201 0 019525 856 864T:refgcc_-march=native_-mtune=native_-O2_-fomit-frame-pointer_-fwrapv_-fPIC_-fPIE2022112420221122
2758505177 0 019541 856 864T:refgcc_-march=native_-mtune=native_-O_-fomit-frame-pointer_-fwrapv_-fPIC_-fPIE2022112420221122
29580014065 0 029493 856 880T:refgcc_-march=native_-mtune=native_-O3_-fomit-frame-pointer_-fwrapv_-fPIC_-fPIE2022112420221122
3509255749 0 021101 848 880T:optgcc_-march=native_-mtune=native_-O3_-fomit-frame-pointer_-fwrapv_-fPIC_-fPIE2022112420221122
3590254813 0 019037 848 864T:optgcc_-march=native_-mtune=native_-O2_-fomit-frame-pointer_-fwrapv_-fPIC_-fPIE2022112420221122
4032004721 0 018981 848 864T:optgcc_-march=native_-mtune=native_-O_-fomit-frame-pointer_-fwrapv_-fPIC_-fPIE2022112420221122

Compiler output

Implementation: T:opt
Security model: timingleaks
Compiler: clang -mcpu=native -O3 -fomit-frame-pointer -fwrapv -Qunused-arguments -fPIC -fPIE
try.c: libcrypto_aead_schwaemm256128v1.a(encrypt.o): In function `crypto_aead_schwaemm256128v1_opt_timingleaks_encrypt':
try.c: encrypt.c:(.text+0x...): undefined reference to `processAD'
try.c: encrypt.c:(.text+0x...): undefined reference to `encryptPT'
try.c: libcrypto_aead_schwaemm256128v1.a(encrypt.o): In function `crypto_aead_schwaemm256128v1_opt_timingleaks_decrypt':
try.c: encrypt.c:(.text+0x...): undefined reference to `processAD'
try.c: encrypt.c:(.text+0x...): undefined reference to `decryptCT'
try.c: clang-14: error: linker command failed with exit code 1 (use -v to see invocation)

Number of similar (compiler,implementation) pairs: 1, namely:
CompilerImplementations
clang -mcpu=native -O3 -fomit-frame-pointer -fwrapv -Qunused-arguments -fPIC -fPIE T:opt

Compiler output

Implementation: T:opt
Security model: timingleaks
Compiler: gcc -march=native -mtune=native -Os -fomit-frame-pointer -fwrapv -fPIC -fPIE
try.c: libcrypto_aead_schwaemm256128v1.a(encrypt.o): In function `crypto_aead_schwaemm256128v1_opt_timingleaks_encrypt':
try.c: encrypt.c:(.text+0x...): undefined reference to `initialize'
try.c: encrypt.c:(.text+0x...): undefined reference to `processAD'
try.c: encrypt.c:(.text+0x...): undefined reference to `encryptPT'
try.c: libcrypto_aead_schwaemm256128v1.a(encrypt.o): In function `crypto_aead_schwaemm256128v1_opt_timingleaks_decrypt':
try.c: encrypt.c:(.text+0x...): undefined reference to `initialize'
try.c: encrypt.c:(.text+0x...): undefined reference to `processAD'
try.c: encrypt.c:(.text+0x...): undefined reference to `decryptCT'
try.c: collect2: error: ld returned 1 exit status

Number of similar (compiler,implementation) pairs: 1, namely:
CompilerImplementations
gcc -march=native -mtune=native -Os -fomit-frame-pointer -fwrapv -fPIC -fPIE T:opt

Compiler output

Implementation: T:ref
Security model: timingleaks
Compiler: clang -mcpu=native -O3 -fomit-frame-pointer -fwrapv -Qunused-arguments -fPIC -fPIE
try.c: libcrypto_aead_schwaemm256128v1.a(encrypt.o): In function `crypto_aead_schwaemm256128v1_ref_timingleaks_encrypt':
try.c: encrypt.c:(.text+0x...): undefined reference to `processAD'
try.c: encrypt.c:(.text+0x...): undefined reference to `encryptPT'
try.c: libcrypto_aead_schwaemm256128v1.a(encrypt.o): In function `crypto_aead_schwaemm256128v1_ref_timingleaks_decrypt':
try.c: encrypt.c:(.text+0x...): undefined reference to `processAD'
try.c: encrypt.c:(.text+0x...): undefined reference to `decryptCT'
try.c: clang-14: error: linker command failed with exit code 1 (use -v to see invocation)

Number of similar (compiler,implementation) pairs: 1, namely:
CompilerImplementations
clang -mcpu=native -O3 -fomit-frame-pointer -fwrapv -Qunused-arguments -fPIC -fPIE T:ref

Compiler output

Implementation: T:ref
Security model: timingleaks
Compiler: gcc -march=native -mtune=native -Os -fomit-frame-pointer -fwrapv -fPIC -fPIE
try.c: libcrypto_aead_schwaemm256128v1.a(encrypt.o): In function `crypto_aead_schwaemm256128v1_ref_timingleaks_encrypt':
try.c: encrypt.c:(.text+0x...): undefined reference to `initialize'
try.c: encrypt.c:(.text+0x...): undefined reference to `processAD'
try.c: encrypt.c:(.text+0x...): undefined reference to `encryptPT'
try.c: libcrypto_aead_schwaemm256128v1.a(encrypt.o): In function `crypto_aead_schwaemm256128v1_ref_timingleaks_decrypt':
try.c: encrypt.c:(.text+0x...): undefined reference to `initialize'
try.c: encrypt.c:(.text+0x...): undefined reference to `processAD'
try.c: encrypt.c:(.text+0x...): undefined reference to `decryptCT'
try.c: collect2: error: ld returned 1 exit status

Number of similar (compiler,implementation) pairs: 1, namely:
CompilerImplementations
gcc -march=native -mtune=native -Os -fomit-frame-pointer -fwrapv -fPIC -fPIE T:ref