Test results for aarch64, cfarm425, crypto_aead/deoxysii256v141

[Page version: 20261005 22:53:57]

Measurements for aarch64, cfarm425, crypto_aead Test results for aarch64, cfarm425, crypto_aead Test results for crypto_aead/deoxysii256v141
Computer: cfarm425
Microarchitecture: aarch64; Cortex-A76 (413fd0c1)
Architecture: aarch64
CPU ID: 413fd0c1
SUPERCOP version: 20261004
Operation: crypto_aead
Primitive: deoxysii256v141
TimeObject sizeTest sizeImplementationCompilerBenchmark dateSUPERCOP version
62166136765 0 59258916 1200 2144T:tablegcc -march=native -mtune=native -O3 -fwrapv -fPIC -fPIE -gdwarf-4 -Wall2026100520261004
80982827197 0 049356 1200 1544T:refgcc -march=native -mtune=native -O3 -fwrapv -fPIC -fPIE -gdwarf-4 -Wall2026100520261004

Compiler output


deoxys.c: deoxys.c:28:10: fatal error: xmmintrin.h: No such file or directory
deoxys.c:    28 | #include <xmmintrin.h>              /* SSE instructions and _mm_malloc */
deoxys.c:       |          ^~~~~~~~~~~~~
deoxys.c: compilation terminated.

Number of similar (implementation,compiler) pairs: 1, namely:
ImplementationCompiler
T:aesnigcc -march=native -mtune=native -O3 -fwrapv -fPIC -fPIE -gdwarf-4 -Wall (16.2.0)

Compiler output


deoxys.c: deoxys.c:26:10: fatal error: xmmintrin.h: No such file or directory
deoxys.c:    26 | #include <xmmintrin.h>              /* SSE instructions and _mm_malloc */
deoxys.c:       |          ^~~~~~~~~~~~~
deoxys.c: compilation terminated.

Number of similar (implementation,compiler) pairs: 1, namely:
ImplementationCompiler
T:aesnisgcc -march=native -mtune=native -O3 -fwrapv -fPIC -fPIE -gdwarf-4 -Wall (16.2.0)

Compiler output


deoxysBCii256.c: deoxysBCii256.c:29:10: fatal error: tmmintrin.h: No such file or directory
deoxysBCii256.c:    29 | #include <tmmintrin.h>
deoxysBCii256.c:       |          ^~~~~~~~~~~~~
deoxysBCii256.c: compilation terminated.

Number of similar (implementation,compiler) pairs: 1, namely:
ImplementationCompiler
T:bitslicegcc -march=native -mtune=native -O3 -fwrapv -fPIC -fPIE -gdwarf-4 -Wall (16.2.0)

Namespace violations


deoxys.o deoxys_aead_decrypt T
deoxys.o deoxys_aead_encrypt T
tweakableBC.o G T
tweakableBC.o H T
tweakableBC.o aesTweakDecrypt T
tweakableBC.o aesTweakEncrypt T
tweakableBC.o choose_lfsr T
tweakableBC.o deoxysKeySetupDec256 T
tweakableBC.o deoxysKeySetupEnc256 T

Number of similar (implementation,compiler) pairs: 1, namely:
ImplementationCompiler
T:refgcc -march=native -mtune=native -O3 -fwrapv -fPIC -fPIE -gdwarf-4 -Wall (16.2.0)

Namespace violations


deoxys.o deoxys_aead_decrypt T
deoxys.o deoxys_aead_encrypt T
tweakableBC.o RCON_ROW R
tweakableBC.o aesTweakDecrypt T
tweakableBC.o aesTweakEncrypt T
tweakableBC.o prepare_subkeys T

Number of similar (implementation,compiler) pairs: 1, namely:
ImplementationCompiler
T:tablegcc -march=native -mtune=native -O3 -fwrapv -fPIC -fPIE -gdwarf-4 -Wall (16.2.0)