Test results for aarch64, cfarm425, crypto_aead/ascon80pqv12

[Page version: 20261005 22:53:57]

Measurements for aarch64, cfarm425, crypto_aead Test results for aarch64, cfarm425, crypto_aead Test results for crypto_aead/ascon80pqv12
Computer: cfarm425
Microarchitecture: aarch64; Cortex-A76 (413fd0c1)
Architecture: aarch64
CPU ID: 413fd0c1
SUPERCOP version: 20261004
Operation: crypto_aead
Primitive: ascon80pqv12
TimeObject sizeTest sizeImplementationCompilerBenchmark dateSUPERCOP version
4693610740 0 032796 1200 1544opt64gcc -march=native -mtune=native -O3 -fwrapv -fPIC -fPIE -gdwarf-4 -Wall2026100520261004
5410814148 0 036220 1200 1544refgcc -march=native -mtune=native -O3 -fwrapv -fPIC -fPIE -gdwarf-4 -Wall2026100520261004
596811804 0 023876 1200 1544opt64_lowsizegcc -march=native -mtune=native -O3 -fwrapv -fPIC -fPIE -gdwarf-4 -Wall2026100520261004
6618214996 0 037044 1200 1544opt32gcc -march=native -mtune=native -O3 -fwrapv -fPIC -fPIE -gdwarf-4 -Wall2026100520261004
743991844 0 023908 1200 1544opt32_lowsizegcc -march=native -mtune=native -O3 -fwrapv -fPIC -fPIE -gdwarf-4 -Wall2026100520261004
17808512516 0 034580 1208 1544bi32gcc -march=native -mtune=native -O3 -fwrapv -fPIC -fPIE -gdwarf-4 -Wall2026100520261004
1811527452 0 029636 1216 1544bi32_lowreggcc -march=native -mtune=native -O3 -fwrapv -fPIC -fPIE -gdwarf-4 -Wall2026100520261004
1872972592 0 024724 1208 1544bi32_lowsizegcc -march=native -mtune=native -O3 -fwrapv -fPIC -fPIE -gdwarf-4 -Wall2026100520261004
3661606100 0 027844 1208 1544bi8gcc -march=native -mtune=native -O3 -fwrapv -fPIC -fPIE -gdwarf-4 -Wall2026100520261004
5757834000 0 026076 1200 1544opt8_lowsizegcc -march=native -mtune=native -O3 -fwrapv -fPIC -fPIE -gdwarf-4 -Wall2026100520261004
5832794876 0 026988 1200 1544opt8gcc -march=native -mtune=native -O3 -fwrapv -fPIC -fPIE -gdwarf-4 -Wall2026100520261004

Compiler output


permutations.c: /tmp/ccQhCPxa.s: Assembler messages:
permutations.c: /tmp/ccQhCPxa.s:181: Error: immediate out of range at operand 3 -- `eor x13,x13,225'
permutations.c: /tmp/ccQhCPxa.s:287: Error: immediate out of range at operand 3 -- `eor x13,x13,210'
permutations.c: /tmp/ccQhCPxa.s:393: Error: immediate out of range at operand 3 -- `eor x13,x13,195'
permutations.c: /tmp/ccQhCPxa.s:499: Error: immediate out of range at operand 3 -- `eor x13,x13,180'
permutations.c: /tmp/ccQhCPxa.s:605: Error: immediate out of range at operand 3 -- `eor x13,x13,165'
permutations.c: /tmp/ccQhCPxa.s:711: Error: immediate out of range at operand 3 -- `eor x13,x13,150'
permutations.c: /tmp/ccQhCPxa.s:817: Error: immediate out of range at operand 3 -- `eor x13,x13,135'
permutations.c: /tmp/ccQhCPxa.s:1029: Error: immediate out of range at operand 3 -- `eor x13,x13,105'
permutations.c: /tmp/ccQhCPxa.s:1135: Error: immediate out of range at operand 3 -- `eor x13,x13,90'
permutations.c: /tmp/ccQhCPxa.s:1241: Error: immediate out of range at operand 3 -- `eor x13,x13,75'
permutations.c: /tmp/ccQhCPxa.s:1410: Error: immediate out of range at operand 3 -- `eor x13,x13,150'
permutations.c: /tmp/ccQhCPxa.s:1524: Error: immediate out of range at operand 3 -- `eor x13,x13,135'
permutations.c: /tmp/ccQhCPxa.s:1736: Error: immediate out of range at operand 3 -- `eor x13,x13,105'
permutations.c: /tmp/ccQhCPxa.s:1842: Error: immediate out of range at operand 3 -- `eor x13,x13,90'
permutations.c: /tmp/ccQhCPxa.s:1948: Error: immediate out of range at operand 3 -- `eor x13,x13,75'

Number of similar (implementation,compiler) pairs: 1, namely:
ImplementationCompiler
armv6gcc -march=native -mtune=native -O3 -fwrapv -fPIC -fPIE -gdwarf-4 -Wall (16.2.0)

Compiler output


permutations.c: /tmp/ccwAguXP.s: Assembler messages:
permutations.c: /tmp/ccwAguXP.s:126: Error: expected a register at operand 2 -- `sub x1,#15'

Number of similar (implementation,compiler) pairs: 1, namely:
ImplementationCompiler
armv6_lowsizegcc -march=native -mtune=native -O3 -fwrapv -fPIC -fPIE -gdwarf-4 -Wall (16.2.0)

Compiler output


aead.c: In file included from permutations.h:11,
aead.c:                  from aead.c:4:
aead.c: In function 'ROUND_LOOP',
aead.c:     inlined from 'PROUNDS' at round.h:348:54,
aead.c:     inlined from 'P' at permutations.h:70:48,
aead.c:     inlined from 'ascon_initaead' at aead.c:40:3,
aead.c:     inlined from 'crypto_aead_ascon80pqv12_armv6m_constbranchindex_encrypt' at aead.c:199:3:
aead.c: round.h:12:3: error: impossible constraint in 'asm'
aead.c:    12 |   __asm__ __volatile__(
aead.c:       |   ^~~~~~~
aead.c: In function 'ROUND_LOOP',
aead.c:     inlined from 'PROUNDS' at round.h:348:54,
aead.c:     inlined from 'P' at permutations.h:70:48,
aead.c:     inlined from 'ascon_adata' at aead.c:61:7,
aead.c:     inlined from 'crypto_aead_ascon80pqv12_armv6m_constbranchindex_encrypt' at aead.c:200:3:
aead.c: round.h:12:3: error: impossible constraint in 'asm'
aead.c:    12 |   __asm__ __volatile__(
aead.c:       |   ^~~~~~~
aead.c: In function 'ROUND_LOOP',
aead.c:     inlined from 'PROUNDS' at round.h:348:54,
aead.c:     inlined from 'P' at permutations.h:70:48,
aead.c:     inlined from 'ascon_adata' at aead.c:76:5,
aead.c:     inlined from 'crypto_aead_ascon80pqv12_armv6m_constbranchindex_encrypt' at aead.c:200:3:
aead.c: round.h:12:3: error: impossible constraint in 'asm'
aead.c:    12 |   __asm__ __volatile__(
aead.c: ...

Number of similar (implementation,compiler) pairs: 1, namely:
ImplementationCompiler
armv6mgcc -march=native -mtune=native -O3 -fwrapv -fPIC -fPIE -gdwarf-4 -Wall (16.2.0)

Compiler output


permutations.c: In file included from permutations.h:11,
permutations.c:                  from permutations.c:1:
permutations.c: In function 'ROUND_LOOP',
permutations.c:     inlined from 'PROUNDS' at round.h:348:54,
permutations.c:     inlined from 'P' at permutations.c:27:36:
permutations.c: round.h:12:3: error: impossible constraint in 'asm'
permutations.c:    12 |   __asm__ __volatile__(
permutations.c:       |   ^~~~~~~

Number of similar (implementation,compiler) pairs: 1, namely:
ImplementationCompiler
armv6m_lowsizegcc -march=native -mtune=native -O3 -fwrapv -fPIC -fPIE -gdwarf-4 -Wall (16.2.0)

Compiler output


permutations.c: /tmp/ccInF1TQ.s: Assembler messages:
permutations.c: /tmp/ccInF1TQ.s:179: Error: immediate out of range at operand 3 -- `eor x13,x13,225'
permutations.c: /tmp/ccInF1TQ.s:283: Error: immediate out of range at operand 3 -- `eor x13,x13,210'
permutations.c: /tmp/ccInF1TQ.s:387: Error: immediate out of range at operand 3 -- `eor x13,x13,195'
permutations.c: /tmp/ccInF1TQ.s:491: Error: immediate out of range at operand 3 -- `eor x13,x13,180'
permutations.c: /tmp/ccInF1TQ.s:595: Error: immediate out of range at operand 3 -- `eor x13,x13,165'
permutations.c: /tmp/ccInF1TQ.s:699: Error: immediate out of range at operand 3 -- `eor x13,x13,150'
permutations.c: /tmp/ccInF1TQ.s:803: Error: immediate out of range at operand 3 -- `eor x13,x13,135'
permutations.c: /tmp/ccInF1TQ.s:1011: Error: immediate out of range at operand 3 -- `eor x13,x13,105'
permutations.c: /tmp/ccInF1TQ.s:1115: Error: immediate out of range at operand 3 -- `eor x13,x13,90'
permutations.c: /tmp/ccInF1TQ.s:1219: Error: immediate out of range at operand 3 -- `eor x13,x13,75'
permutations.c: /tmp/ccInF1TQ.s:1386: Error: immediate out of range at operand 3 -- `eor x13,x13,150'
permutations.c: /tmp/ccInF1TQ.s:1498: Error: immediate out of range at operand 3 -- `eor x13,x13,135'
permutations.c: /tmp/ccInF1TQ.s:1706: Error: immediate out of range at operand 3 -- `eor x13,x13,105'
permutations.c: /tmp/ccInF1TQ.s:1810: Error: immediate out of range at operand 3 -- `eor x13,x13,90'
permutations.c: /tmp/ccInF1TQ.s:1914: Error: immediate out of range at operand 3 -- `eor x13,x13,75'

Number of similar (implementation,compiler) pairs: 1, namely:
ImplementationCompiler
armv7mgcc -march=native -mtune=native -O3 -fwrapv -fPIC -fPIE -gdwarf-4 -Wall (16.2.0)

Compiler output


permutations.c: /tmp/cczPMqCF.s: Assembler messages:
permutations.c: /tmp/cczPMqCF.s:122: Error: expected a register at operand 2 -- `sub x1,#15'

Number of similar (implementation,compiler) pairs: 1, namely:
ImplementationCompiler
armv7m_lowsizegcc -march=native -mtune=native -O3 -fwrapv -fPIC -fPIE -gdwarf-4 -Wall (16.2.0)

Compiler output


permutations.c: /tmp/cc0JchMT.s: Assembler messages:
permutations.c: /tmp/cc0JchMT.s:122: Error: expected a register at operand 2 -- `sub x1,#15'

Number of similar (implementation,compiler) pairs: 1, namely:
ImplementationCompiler
armv7m_smallgcc -march=native -mtune=native -O3 -fwrapv -fPIC -fPIE -gdwarf-4 -Wall (16.2.0)

Compiler output


ascon.S: ascon.S:1:10: fatal error: xtensa/coreasm.h: No such file or directory
ascon.S:     1 | #include <xtensa/coreasm.h>
ascon.S:       |          ^~~~~~~~~~~~~~~~~~
ascon.S: compilation terminated.

Number of similar (implementation,compiler) pairs: 1, namely:
ImplementationCompiler
T:asm_esp32gcc -march=native -mtune=native -O3 -fwrapv -fPIC -fPIE -gdwarf-4 -Wall (16.2.0)

Compiler output


permutations.c: /tmp/cctVTRTF.s: Assembler messages:
permutations.c: /tmp/cctVTRTF.s:162: Error: immediate out of range at operand 3 -- `eor x13,x13,9'
permutations.c: /tmp/cctVTRTF.s:266: Error: immediate out of range at operand 3 -- `eor x8,x8,9'
permutations.c: /tmp/cctVTRTF.s:336: Error: immediate out of range at operand 3 -- `eor x13,x13,9'
permutations.c: /tmp/cctVTRTF.s:353: Error: immediate out of range at operand 3 -- `eor x8,x8,9'
permutations.c: /tmp/cctVTRTF.s:614: Error: immediate out of range at operand 3 -- `eor x8,x8,9'
permutations.c: /tmp/cctVTRTF.s:701: Error: immediate out of range at operand 3 -- `eor x8,x8,9'
permutations.c: /tmp/cctVTRTF.s:858: Error: immediate out of range at operand 3 -- `eor x13,x13,9'
permutations.c: /tmp/cctVTRTF.s:1032: Error: immediate out of range at operand 3 -- `eor x13,x13,9'
permutations.c: /tmp/cctVTRTF.s:1199: Error: immediate out of range at operand 3 -- `eor x8,x8,9'
permutations.c: /tmp/cctVTRTF.s:1294: Error: immediate out of range at operand 3 -- `eor x8,x8,9'
permutations.c: /tmp/cctVTRTF.s:1451: Error: immediate out of range at operand 3 -- `eor x13,x13,9'
permutations.c: /tmp/cctVTRTF.s:1625: Error: immediate out of range at operand 3 -- `eor x13,x13,9'

Number of similar (implementation,compiler) pairs: 1, namely:
ImplementationCompiler
bi32_armv6gcc -march=native -mtune=native -O3 -fwrapv -fPIC -fPIE -gdwarf-4 -Wall (16.2.0)

Compiler output


aead.c: In file included from permutations.h:11,
aead.c:                  from aead.c:4:
aead.c: round.h: In function 'ROUND_LOOP':
aead.c: round.h:12:12: warning: unused variable 'tmp0' [-Wunused-variable]
aead.c:    12 |   uint32_t tmp0, tmp1;
aead.c:       |            ^~~~
aead.c: In function 'ROUND_LOOP',
aead.c:     inlined from 'PROUNDS' at round.h:325:3,
aead.c:     inlined from 'P' at permutations.h:70:48,
aead.c:     inlined from 'ascon_initaead' at aead.c:40:3,
aead.c:     inlined from 'crypto_aead_ascon80pqv12_bi32_armv6m_constbranchindex_encrypt' at aead.c:199:3:
aead.c: round.h:13:3: error: impossible constraint in 'asm'
aead.c:    13 |   __asm__ __volatile__(
aead.c:       |   ^~~~~~~
aead.c: In function 'ROUND_LOOP',
aead.c:     inlined from 'PROUNDS' at round.h:325:3,
aead.c:     inlined from 'P' at permutations.h:70:48,
aead.c:     inlined from 'ascon_adata' at aead.c:61:7,
aead.c:     inlined from 'crypto_aead_ascon80pqv12_bi32_armv6m_constbranchindex_encrypt' at aead.c:200:3:
aead.c: round.h:13:3: error: impossible constraint in 'asm'
aead.c:    13 |   __asm__ __volatile__(
aead.c:       |   ^~~~~~~
aead.c: In function 'ROUND_LOOP',
aead.c:     inlined from 'PROUNDS' at round.h:325:3,
aead.c:     inlined from 'P' at permutations.h:70:48,
aead.c: ...

Number of similar (implementation,compiler) pairs: 1, namely:
ImplementationCompiler
bi32_armv6mgcc -march=native -mtune=native -O3 -fwrapv -fPIC -fPIE -gdwarf-4 -Wall (16.2.0)

Compiler output


aead.c: /tmp/cc5L2vif.s: Assembler messages:
aead.c: /tmp/cc5L2vif.s:2677: Error: immediate out of range at operand 3 -- `eor x20,x20,9'
aead.c: /tmp/cc5L2vif.s:2778: Error: immediate out of range at operand 3 -- `eor x13,x13,9'
aead.c: /tmp/cc5L2vif.s:2847: Error: immediate out of range at operand 3 -- `eor x20,x20,9'
aead.c: /tmp/cc5L2vif.s:2863: Error: immediate out of range at operand 3 -- `eor x13,x13,9'
aead.c: /tmp/cc5L2vif.s:3118: Error: immediate out of range at operand 3 -- `eor x13,x13,9'
aead.c: /tmp/cc5L2vif.s:3203: Error: immediate out of range at operand 3 -- `eor x13,x13,9'
aead.c: /tmp/cc5L2vif.s:3357: Error: immediate out of range at operand 3 -- `eor x20,x20,9'
aead.c: /tmp/cc5L2vif.s:3522: Error: immediate out of range at operand 3 -- `eor x8,x8,9'
aead.c: /tmp/cc5L2vif.s:4094: Error: immediate out of range at operand 3 -- `eor x20,x20,9'
aead.c: /tmp/cc5L2vif.s:4189: Error: immediate out of range at operand 3 -- `eor x24,x24,9'
aead.c: /tmp/cc5L2vif.s:4343: Error: immediate out of range at operand 3 -- `eor x21,x21,9'
aead.c: /tmp/cc5L2vif.s:4530: Error: immediate out of range at operand 3 -- `eor x4,x4,9'
aead.c: /tmp/cc5L2vif.s:4736: Error: immediate out of range at operand 3 -- `eor x10,x10,9'
aead.c: /tmp/cc5L2vif.s:4829: Error: immediate out of range at operand 3 -- `eor x10,x10,9'
aead.c: /tmp/cc5L2vif.s:4983: Error: immediate out of range at operand 3 -- `eor x16,x16,9'
aead.c: /tmp/cc5L2vif.s:5162: Error: immediate out of range at operand 3 -- `eor x4,x4,9'
aead.c: /tmp/cc5L2vif.s:6016: Error: immediate out of range at operand 3 -- `eor x11,x11,9'
aead.c: /tmp/cc5L2vif.s:6119: Error: immediate out of range at operand 3 -- `eor x10,x10,9'
aead.c: /tmp/cc5L2vif.s:6273: Error: immediate out of range at operand 3 -- `eor x21,x21,9'
aead.c: /tmp/cc5L2vif.s:6460: Error: immediate out of range at operand 3 -- `eor x4,x4,9'
aead.c: /tmp/cc5L2vif.s:7454: Error: immediate out of range at operand 3 -- `eor x15,x15,9'
aead.c: /tmp/cc5L2vif.s:7555: Error: immediate out of range at operand 3 -- `eor x9,x9,9'
aead.c: /tmp/cc5L2vif.s:7624: Error: immediate out of range at operand 3 -- `eor x15,x15,9'
aead.c: /tmp/cc5L2vif.s:7640: Error: immediate out of range at operand 3 -- `eor x9,x9,9'
aead.c: ...

Number of similar (implementation,compiler) pairs: 1, namely:
ImplementationCompiler
bi32_armv7mgcc -march=native -mtune=native -O3 -fwrapv -fPIC -fPIE -gdwarf-4 -Wall (16.2.0)

Compiler output


permutations.c: /tmp/ccK585Lh.s: Assembler messages:
permutations.c: /tmp/ccK585Lh.s:63: Error: operand mismatch -- `ldrb x14,[x1],#1'
permutations.c: /tmp/ccK585Lh.s:63: Info:    did you mean this?
permutations.c: /tmp/ccK585Lh.s:63: Info:    	ldrb w14, [x1], #1
permutations.c: /tmp/ccK585Lh.s:78: Error: operand mismatch -- `ldrb x14,[x1],#1'
permutations.c: /tmp/ccK585Lh.s:78: Info:    did you mean this?
permutations.c: /tmp/ccK585Lh.s:78: Info:    	ldrb w14, [x1], #1

Number of similar (implementation,compiler) pairs: 1, namely:
ImplementationCompiler
bi32_armv7m_smallgcc -march=native -mtune=native -O3 -fwrapv -fPIC -fPIE -gdwarf-4 -Wall (16.2.0)

Compiler output


update.c: update.c: In function 'ascon_update':
update.c: update.c:21:13: warning: unused variable 'rate' [-Wunused-variable]
update.c:    21 |   const int rate = ASCON_AEAD_RATE;
update.c:       |             ^~~~

Number of similar (implementation,compiler) pairs: 3, namely:
ImplementationCompiler
bi32_lowsizegcc -march=native -mtune=native -O3 -fwrapv -fPIC -fPIE -gdwarf-4 -Wall (16.2.0)
opt32_lowsizegcc -march=native -mtune=native -O3 -fwrapv -fPIC -fPIE -gdwarf-4 -Wall (16.2.0)
opt64_lowsizegcc -march=native -mtune=native -O3 -fwrapv -fPIC -fPIE -gdwarf-4 -Wall (16.2.0)

Compiler output


try.c: /usr/bin/aarch64-linux-gnu-ld.bfd: /tmp/cc1MeUaZ.o: in function `doit':
try.c: .../supercop-data/cfarm425/aarch64/try/c/gcc_-march=native_-mtune=native_-O3_-fwrapv_-fPIC_-fPIE_-gdwarf-4_-Wall/timingleaks/crypto_aead/ascon80pqv12/esp32/work/try.c:133:(.text+0x...): undefined reference to `crypto_aead_ascon80pqv12_esp32_timingleaks_encrypt'
try.c: /usr/bin/aarch64-linux-gnu-ld.bfd: .../supercop-data/cfarm425/aarch64/try/c/gcc_-march=native_-mtune=native_-O3_-fwrapv_-fPIC_-fPIE_-gdwarf-4_-Wall/timingleaks/crypto_aead/ascon80pqv12/esp32/work/try.c:135:(.text+0x...): undefined reference to `crypto_aead_ascon80pqv12_esp32_timingleaks_decrypt'
try.c: /usr/bin/aarch64-linux-gnu-ld.bfd: /tmp/cc1MeUaZ.o: in function `test':
try.c: .../supercop-data/cfarm425/aarch64/try/c/gcc_-march=native_-mtune=native_-O3_-fwrapv_-fPIC_-fPIE_-gdwarf-4_-Wall/timingleaks/crypto_aead/ascon80pqv12/esp32/work/try.c:189:(.text+0x...): undefined reference to `crypto_aead_ascon80pqv12_esp32_timingleaks_encrypt'
try.c: /usr/bin/aarch64-linux-gnu-ld.bfd: .../supercop-data/cfarm425/aarch64/try/c/gcc_-march=native_-mtune=native_-O3_-fwrapv_-fPIC_-fPIE_-gdwarf-4_-Wall/timingleaks/crypto_aead/ascon80pqv12/esp32/work/try.c:300:(.text+0x...): undefined reference to `crypto_aead_ascon80pqv12_esp32_timingleaks_decrypt'
try.c: /usr/bin/aarch64-linux-gnu-ld.bfd: .../supercop-data/cfarm425/aarch64/try/c/gcc_-march=native_-mtune=native_-O3_-fwrapv_-fPIC_-fPIE_-gdwarf-4_-Wall/timingleaks/crypto_aead/ascon80pqv12/esp32/work/try.c:331:(.text+0x...): undefined reference to `crypto_aead_ascon80pqv12_esp32_timingleaks_decrypt'
try.c: /usr/bin/aarch64-linux-gnu-ld.bfd: .../supercop-data/cfarm425/aarch64/try/c/gcc_-march=native_-mtune=native_-O3_-fwrapv_-fPIC_-fPIE_-gdwarf-4_-Wall/timingleaks/crypto_aead/ascon80pqv12/esp32/work/try.c:476:(.text+0x...): undefined reference to `crypto_aead_ascon80pqv12_esp32_timingleaks_decrypt'
try.c: /usr/bin/aarch64-linux-gnu-ld.bfd: .../supercop-data/cfarm425/aarch64/try/c/gcc_-march=native_-mtune=native_-O3_-fwrapv_-fPIC_-fPIE_-gdwarf-4_-Wall/timingleaks/crypto_aead/ascon80pqv12/esp32/work/try.c:480:(.text+0x...): undefined reference to `crypto_aead_ascon80pqv12_esp32_timingleaks_decrypt'
try.c: /usr/bin/aarch64-linux-gnu-ld.bfd: .../supercop-data/cfarm425/aarch64/try/c/gcc_-march=native_-mtune=native_-O3_-fwrapv_-fPIC_-fPIE_-gdwarf-4_-Wall/timingleaks/crypto_aead/ascon80pqv12/esp32/work/try.c:484:(.text+0x...): undefined reference to `crypto_aead_ascon80pqv12_esp32_timingleaks_decrypt'
try.c: /usr/bin/aarch64-linux-gnu-ld.bfd: .../supercop-data/cfarm425/aarch64/try/c/gcc_-march=native_-mtune=native_-O3_-fwrapv_-fPIC_-fPIE_-gdwarf-4_-Wall/timingleaks/crypto_aead/ascon80pqv12/esp32/work/try.c:159:(.text+0x...): undefined reference to `crypto_aead_ascon80pqv12_esp32_timingleaks_encrypt'
try.c: collect2: error: ld returned 1 exit status

Number of similar (implementation,compiler) pairs: 1, namely:
ImplementationCompiler
T:esp32gcc -march=native -mtune=native -O3 -fwrapv -fPIC -fPIE -gdwarf-4 -Wall (16.2.0)

Compiler output


aead.c: In file included from round.h:8,
aead.c:                  from permutations.h:11,
aead.c:                  from aead.c:5:
aead.c: In function 'memxor',
aead.c:     inlined from 'ascon_final' at aead.c:147:3:
aead.c: word.h:102:12: warning: writing 1 byte into a region of size 0 [-Wstringop-overflow=]
aead.c:   102 |     *dst++ ^= *src++;
aead.c:       |            ^~
aead.c: aead.c: In function 'ascon_final':
aead.c: aead.c:134:45: note: at offset 32 into destination object 's' of size [0, 32]
aead.c:   134 | forceinline void ascon_final(ascon_state_t* s, const ascon_key_t* key) {
aead.c:       |                              ~~~~~~~~~~~~~~~^
aead.c: In function 'memxor',
aead.c:     inlined from 'ascon_final' at aead.c:147:3:
aead.c: word.h:102:12: warning: writing 1 byte into a region of size 0 [-Wstringop-overflow=]
aead.c:   102 |     *dst++ ^= *src++;
aead.c:       |            ^~
aead.c: aead.c: In function 'ascon_final':
aead.c: aead.c:134:45: note: at offset 33 into destination object 's' of size [0, 32]
aead.c:   134 | forceinline void ascon_final(ascon_state_t* s, const ascon_key_t* key) {
aead.c:       |                              ~~~~~~~~~~~~~~~^
aead.c: In function 'memxor',
aead.c:     inlined from 'ascon_final' at aead.c:147:3:
aead.c: word.h:102:12: warning: writing 1 byte into a region of size 0 [-Wstringop-overflow=]
aead.c:   102 |     *dst++ ^= *src++;
aead.c: ...

Number of similar (implementation,compiler) pairs: 1, namely:
ImplementationCompiler
opt8gcc -march=native -mtune=native -O3 -fwrapv -fPIC -fPIE -gdwarf-4 -Wall (16.2.0)

Compiler output


aead.c: In file included from round.h:8,
aead.c:                  from permutations.h:11,
aead.c:                  from aead.c:5:
aead.c: In function 'memxor',
aead.c:     inlined from 'ascon_final' at aead.c:62:3:
aead.c: word.h:102:12: warning: writing 1 byte into a region of size 0 [-Wstringop-overflow=]
aead.c:   102 |     *dst++ ^= *src++;
aead.c:       |            ^~
aead.c: aead.c: In function 'ascon_final':
aead.c: aead.c:49:45: note: at offset 32 into destination object 's' of size [0, 32]
aead.c:    49 | forceinline void ascon_final(ascon_state_t* s, const ascon_key_t* key) {
aead.c:       |                              ~~~~~~~~~~~~~~~^
aead.c: In function 'memxor',
aead.c:     inlined from 'ascon_final' at aead.c:62:3:
aead.c: word.h:102:12: warning: writing 1 byte into a region of size 0 [-Wstringop-overflow=]
aead.c:   102 |     *dst++ ^= *src++;
aead.c:       |            ^~
aead.c: aead.c: In function 'ascon_final':
aead.c: aead.c:49:45: note: at offset 33 into destination object 's' of size [0, 32]
aead.c:    49 | forceinline void ascon_final(ascon_state_t* s, const ascon_key_t* key) {
aead.c:       |                              ~~~~~~~~~~~~~~~^
aead.c: In function 'memxor',
aead.c:     inlined from 'ascon_final' at aead.c:62:3:
aead.c: word.h:102:12: warning: writing 1 byte into a region of size 0 [-Wstringop-overflow=]
aead.c:   102 |     *dst++ ^= *src++;
aead.c: ...

Number of similar (implementation,compiler) pairs: 1, namely:
ImplementationCompiler
opt8_lowsizegcc -march=native -mtune=native -O3 -fwrapv -fPIC -fPIE -gdwarf-4 -Wall (16.2.0)

Namespace violations


constants.o constants R
interleave.o B R
permutations.o P12 T
permutations.o P6 T

Number of similar (implementation,compiler) pairs: 1, namely:
ImplementationCompiler
bi32gcc -march=native -mtune=native -O3 -fwrapv -fPIC -fPIE -gdwarf-4 -Wall (16.2.0)

Namespace violations


aead.o ascon_adata T
aead.o ascon_decrypt T
aead.o ascon_encrypt T
aead.o ascon_final T
aead.o ascon_initaead T
aead.o ascon_loadkey T
constants.o constants R
interleave.o B R

Number of similar (implementation,compiler) pairs: 1, namely:
ImplementationCompiler
bi32_lowreggcc -march=native -mtune=native -O3 -fwrapv -fPIC -fPIE -gdwarf-4 -Wall (16.2.0)

Namespace violations


aead.o ascon_aead T
constants.o constants R
interleave.o B R
interleave.o FROMBI T
interleave.o TOBI T
permutations.o P T
update.o ascon_update T

Number of similar (implementation,compiler) pairs: 1, namely:
ImplementationCompiler
bi32_lowsizegcc -march=native -mtune=native -O3 -fwrapv -fPIC -fPIE -gdwarf-4 -Wall (16.2.0)

Namespace violations


constants.o constants R
interleave.o FROMBI T
interleave.o TOBI T
permutations.o P T

Number of similar (implementation,compiler) pairs: 1, namely:
ImplementationCompiler
bi8gcc -march=native -mtune=native -O3 -fwrapv -fPIC -fPIE -gdwarf-4 -Wall (16.2.0)

Namespace violations


aead.o ascon_aead T
permutations.o P T
update.o ascon_update T

Number of similar (implementation,compiler) pairs: 2, namely:
ImplementationCompiler
opt32_lowsizegcc -march=native -mtune=native -O3 -fwrapv -fPIC -fPIE -gdwarf-4 -Wall (16.2.0)
opt64_lowsizegcc -march=native -mtune=native -O3 -fwrapv -fPIC -fPIE -gdwarf-4 -Wall (16.2.0)

Namespace violations


aead.o ascon_adata T
aead.o ascon_decrypt T
aead.o ascon_encrypt T
aead.o ascon_final T
aead.o ascon_initaead T
aead.o ascon_loadkey T
permutations.o P T

Number of similar (implementation,compiler) pairs: 1, namely:
ImplementationCompiler
opt8gcc -march=native -mtune=native -O3 -fwrapv -fPIC -fPIE -gdwarf-4 -Wall (16.2.0)

Namespace violations


aead.o ascon_final T
aead.o ascon_initaead T
aead.o ascon_loadkey T
permutations.o P T
update.o ascon_update T

Number of similar (implementation,compiler) pairs: 1, namely:
ImplementationCompiler
opt8_lowsizegcc -march=native -mtune=native -O3 -fwrapv -fPIC -fPIE -gdwarf-4 -Wall (16.2.0)

Passed TIMECOP


TIMECOP iterations: 10

Number of similar (implementation,compiler) pairs: 11, namely:
ImplementationCompiler
bi32gcc -march=native -mtune=native -O3 -fwrapv -fPIC -fPIE -gdwarf-4 -Wall (16.2.0)
bi32_lowreggcc -march=native -mtune=native -O3 -fwrapv -fPIC -fPIE -gdwarf-4 -Wall (16.2.0)
bi32_lowsizegcc -march=native -mtune=native -O3 -fwrapv -fPIC -fPIE -gdwarf-4 -Wall (16.2.0)
bi8gcc -march=native -mtune=native -O3 -fwrapv -fPIC -fPIE -gdwarf-4 -Wall (16.2.0)
opt32gcc -march=native -mtune=native -O3 -fwrapv -fPIC -fPIE -gdwarf-4 -Wall (16.2.0)
opt32_lowsizegcc -march=native -mtune=native -O3 -fwrapv -fPIC -fPIE -gdwarf-4 -Wall (16.2.0)
opt64gcc -march=native -mtune=native -O3 -fwrapv -fPIC -fPIE -gdwarf-4 -Wall (16.2.0)
opt64_lowsizegcc -march=native -mtune=native -O3 -fwrapv -fPIC -fPIE -gdwarf-4 -Wall (16.2.0)
opt8gcc -march=native -mtune=native -O3 -fwrapv -fPIC -fPIE -gdwarf-4 -Wall (16.2.0)
opt8_lowsizegcc -march=native -mtune=native -O3 -fwrapv -fPIC -fPIE -gdwarf-4 -Wall (16.2.0)
refgcc -march=native -mtune=native -O3 -fwrapv -fPIC -fPIE -gdwarf-4 -Wall (16.2.0)