Test results for aarch64, cfarm425, crypto_aead/ascon128av12
[Page version: 20261005 22:53:57]
Measurements for aarch64, cfarm425, crypto_aead
Test results for aarch64, cfarm425, crypto_aead
Test results for crypto_aead/ascon128av12
Computer: cfarm425
Microarchitecture: aarch64; Cortex-A76 (413fd0c1)
Architecture: aarch64
CPU ID: 413fd0c1
SUPERCOP version: 20261004
Operation: crypto_aead
Primitive: ascon128av12
| Time | Object size | Test size | Implementation | Compiler | Benchmark date | SUPERCOP version |
| 31963 | 12360 0 0 | 34396 1200 1544 | opt64 | gcc -march=native -mtune=native -O3 -fwrapv -fPIC -fPIE -gdwarf-4 -Wall | 20261005 | 20261004 |
| 36810 | 15720 0 0 | 37740 1200 1544 | ref | gcc -march=native -mtune=native -O3 -fwrapv -fPIC -fPIE -gdwarf-4 -Wall | 20261005 | 20261004 |
| 41300 | 1740 0 0 | 23804 1200 1544 | opt64_lowsize | gcc -march=native -mtune=native -O3 -fwrapv -fPIC -fPIE -gdwarf-4 -Wall | 20261005 | 20261004 |
| 45068 | 17272 0 0 | 39308 1200 1544 | opt32 | gcc -march=native -mtune=native -O3 -fwrapv -fPIC -fPIE -gdwarf-4 -Wall | 20261005 | 20261004 |
| 51877 | 1780 0 0 | 23836 1200 1544 | opt32_lowsize | gcc -march=native -mtune=native -O3 -fwrapv -fPIC -fPIE -gdwarf-4 -Wall | 20261005 | 20261004 |
| 127389 | 14584 0 0 | 36620 1208 1544 | bi32 | gcc -march=native -mtune=native -O3 -fwrapv -fPIC -fPIE -gdwarf-4 -Wall | 20261005 | 20261004 |
| 129774 | 8968 0 0 | 31132 1216 1544 | bi32_lowreg | gcc -march=native -mtune=native -O3 -fwrapv -fPIC -fPIE -gdwarf-4 -Wall | 20261005 | 20261004 |
| 133195 | 2556 0 0 | 24636 1208 1544 | bi32_lowsize | gcc -march=native -mtune=native -O3 -fwrapv -fPIC -fPIE -gdwarf-4 -Wall | 20261005 | 20261004 |
| 250641 | 7112 0 0 | 28796 1208 1544 | bi8 | gcc -march=native -mtune=native -O3 -fwrapv -fPIC -fPIE -gdwarf-4 -Wall | 20261005 | 20261004 |
| 387219 | 5884 0 0 | 27948 1200 1544 | opt8 | gcc -march=native -mtune=native -O3 -fwrapv -fPIC -fPIE -gdwarf-4 -Wall | 20261005 | 20261004 |
| 387286 | 5832 0 0 | 27892 1200 1544 | opt8_lowsize | gcc -march=native -mtune=native -O3 -fwrapv -fPIC -fPIE -gdwarf-4 -Wall | 20261005 | 20261004 |
Compiler output
permutations.c: /tmp/ccZZgW9y.s: Assembler messages:
permutations.c: /tmp/ccZZgW9y.s:181: Error: immediate out of range at operand 3 -- `eor x13,x13,225'
permutations.c: /tmp/ccZZgW9y.s:287: Error: immediate out of range at operand 3 -- `eor x13,x13,210'
permutations.c: /tmp/ccZZgW9y.s:393: Error: immediate out of range at operand 3 -- `eor x13,x13,195'
permutations.c: /tmp/ccZZgW9y.s:499: Error: immediate out of range at operand 3 -- `eor x13,x13,180'
permutations.c: /tmp/ccZZgW9y.s:605: Error: immediate out of range at operand 3 -- `eor x13,x13,165'
permutations.c: /tmp/ccZZgW9y.s:711: Error: immediate out of range at operand 3 -- `eor x13,x13,150'
permutations.c: /tmp/ccZZgW9y.s:817: Error: immediate out of range at operand 3 -- `eor x13,x13,135'
permutations.c: /tmp/ccZZgW9y.s:1029: Error: immediate out of range at operand 3 -- `eor x13,x13,105'
permutations.c: /tmp/ccZZgW9y.s:1135: Error: immediate out of range at operand 3 -- `eor x13,x13,90'
permutations.c: /tmp/ccZZgW9y.s:1241: Error: immediate out of range at operand 3 -- `eor x13,x13,75'
permutations.c: /tmp/ccZZgW9y.s:1410: Error: immediate out of range at operand 3 -- `eor x13,x13,180'
permutations.c: /tmp/ccZZgW9y.s:1524: Error: immediate out of range at operand 3 -- `eor x13,x13,165'
permutations.c: /tmp/ccZZgW9y.s:1630: Error: immediate out of range at operand 3 -- `eor x13,x13,150'
permutations.c: /tmp/ccZZgW9y.s:1736: Error: immediate out of range at operand 3 -- `eor x13,x13,135'
permutations.c: /tmp/ccZZgW9y.s:1948: Error: immediate out of range at operand 3 -- `eor x13,x13,105'
permutations.c: /tmp/ccZZgW9y.s:2054: Error: immediate out of range at operand 3 -- `eor x13,x13,90'
permutations.c: /tmp/ccZZgW9y.s:2160: Error: immediate out of range at operand 3 -- `eor x13,x13,75'
Number of similar (implementation,compiler) pairs: 1, namely:
| Implementation | Compiler |
| armv6 | gcc -march=native -mtune=native -O3 -fwrapv -fPIC -fPIE -gdwarf-4 -Wall (16.2.0) |
Compiler output
permutations.c: /tmp/ccYYUTFE.s: Assembler messages:
permutations.c: /tmp/ccYYUTFE.s:126: Error: expected a register at operand 2 -- `sub x1,#15'
Number of similar (implementation,compiler) pairs: 1, namely:
| Implementation | Compiler |
| armv6_lowsize | gcc -march=native -mtune=native -O3 -fwrapv -fPIC -fPIE -gdwarf-4 -Wall (16.2.0) |
Compiler output
aead.c: In file included from permutations.h:11,
aead.c: from aead.c:4:
aead.c: In function 'ROUND_LOOP',
aead.c: inlined from 'PROUNDS' at round.h:348:54,
aead.c: inlined from 'P' at permutations.h:70:48,
aead.c: inlined from 'ascon_initaead' at aead.c:40:3,
aead.c: inlined from 'crypto_aead_ascon128av12_armv6m_constbranchindex_encrypt' at aead.c:199:3:
aead.c: round.h:12:3: error: impossible constraint in 'asm'
aead.c: 12 | __asm__ __volatile__(
aead.c: | ^~~~~~~
aead.c: In function 'ROUND_LOOP',
aead.c: inlined from 'PROUNDS' at round.h:348:54,
aead.c: inlined from 'P' at permutations.h:70:48,
aead.c: inlined from 'ascon_adata' at aead.c:61:7,
aead.c: inlined from 'crypto_aead_ascon128av12_armv6m_constbranchindex_encrypt' at aead.c:200:3:
aead.c: round.h:12:3: error: impossible constraint in 'asm'
aead.c: 12 | __asm__ __volatile__(
aead.c: | ^~~~~~~
aead.c: In function 'ROUND_LOOP',
aead.c: inlined from 'PROUNDS' at round.h:348:54,
aead.c: inlined from 'P' at permutations.h:70:48,
aead.c: inlined from 'ascon_adata' at aead.c:76:5,
aead.c: inlined from 'crypto_aead_ascon128av12_armv6m_constbranchindex_encrypt' at aead.c:200:3:
aead.c: round.h:12:3: error: impossible constraint in 'asm'
aead.c: 12 | __asm__ __volatile__(
aead.c: ...
Number of similar (implementation,compiler) pairs: 1, namely:
| Implementation | Compiler |
| armv6m | gcc -march=native -mtune=native -O3 -fwrapv -fPIC -fPIE -gdwarf-4 -Wall (16.2.0) |
Compiler output
permutations.c: In file included from permutations.h:11,
permutations.c: from permutations.c:1:
permutations.c: In function 'ROUND_LOOP',
permutations.c: inlined from 'PROUNDS' at round.h:348:54,
permutations.c: inlined from 'P' at permutations.c:27:36:
permutations.c: round.h:12:3: error: impossible constraint in 'asm'
permutations.c: 12 | __asm__ __volatile__(
permutations.c: | ^~~~~~~
Number of similar (implementation,compiler) pairs: 1, namely:
| Implementation | Compiler |
| armv6m_lowsize | gcc -march=native -mtune=native -O3 -fwrapv -fPIC -fPIE -gdwarf-4 -Wall (16.2.0) |
Compiler output
permutations.c: /tmp/cch9txPS.s: Assembler messages:
permutations.c: /tmp/cch9txPS.s:179: Error: immediate out of range at operand 3 -- `eor x13,x13,225'
permutations.c: /tmp/cch9txPS.s:283: Error: immediate out of range at operand 3 -- `eor x13,x13,210'
permutations.c: /tmp/cch9txPS.s:387: Error: immediate out of range at operand 3 -- `eor x13,x13,195'
permutations.c: /tmp/cch9txPS.s:491: Error: immediate out of range at operand 3 -- `eor x13,x13,180'
permutations.c: /tmp/cch9txPS.s:595: Error: immediate out of range at operand 3 -- `eor x13,x13,165'
permutations.c: /tmp/cch9txPS.s:699: Error: immediate out of range at operand 3 -- `eor x13,x13,150'
permutations.c: /tmp/cch9txPS.s:803: Error: immediate out of range at operand 3 -- `eor x13,x13,135'
permutations.c: /tmp/cch9txPS.s:1011: Error: immediate out of range at operand 3 -- `eor x13,x13,105'
permutations.c: /tmp/cch9txPS.s:1115: Error: immediate out of range at operand 3 -- `eor x13,x13,90'
permutations.c: /tmp/cch9txPS.s:1219: Error: immediate out of range at operand 3 -- `eor x13,x13,75'
permutations.c: /tmp/cch9txPS.s:1386: Error: immediate out of range at operand 3 -- `eor x13,x13,180'
permutations.c: /tmp/cch9txPS.s:1498: Error: immediate out of range at operand 3 -- `eor x13,x13,165'
permutations.c: /tmp/cch9txPS.s:1602: Error: immediate out of range at operand 3 -- `eor x13,x13,150'
permutations.c: /tmp/cch9txPS.s:1706: Error: immediate out of range at operand 3 -- `eor x13,x13,135'
permutations.c: /tmp/cch9txPS.s:1914: Error: immediate out of range at operand 3 -- `eor x13,x13,105'
permutations.c: /tmp/cch9txPS.s:2018: Error: immediate out of range at operand 3 -- `eor x13,x13,90'
permutations.c: /tmp/cch9txPS.s:2122: Error: immediate out of range at operand 3 -- `eor x13,x13,75'
Number of similar (implementation,compiler) pairs: 1, namely:
| Implementation | Compiler |
| armv7m | gcc -march=native -mtune=native -O3 -fwrapv -fPIC -fPIE -gdwarf-4 -Wall (16.2.0) |
Compiler output
permutations.c: /tmp/ccMdzY7e.s: Assembler messages:
permutations.c: /tmp/ccMdzY7e.s:122: Error: expected a register at operand 2 -- `sub x1,#15'
Number of similar (implementation,compiler) pairs: 1, namely:
| Implementation | Compiler |
| armv7m_lowsize | gcc -march=native -mtune=native -O3 -fwrapv -fPIC -fPIE -gdwarf-4 -Wall (16.2.0) |
Compiler output
permutations.c: /tmp/cclVAtdI.s: Assembler messages:
permutations.c: /tmp/cclVAtdI.s:122: Error: expected a register at operand 2 -- `sub x1,#15'
Number of similar (implementation,compiler) pairs: 1, namely:
| Implementation | Compiler |
| armv7m_small | gcc -march=native -mtune=native -O3 -fwrapv -fPIC -fPIE -gdwarf-4 -Wall (16.2.0) |
Compiler output
ascon.S: /tmp/ccfKQKFv.s: Assembler messages:
ascon.S: ascon.S:159: Error: unknown mnemonic `j' -- `j .LPloopcond'
ascon.S: ascon.S:162: Error: unknown mnemonic `xor' -- `xor s5,s5,t2'
ascon.S: ascon.S:163: Error: unknown mnemonic `lbu' -- `lbu t2,1(t1)'
ascon.S: ascon.S:164: Error: unknown mnemonic `xor' -- `xor s4,s4,t2'
ascon.S: ascon.S:73: Error: unknown mnemonic `xor' -- `xor t3,s1,s9'
ascon.S: ascon.S:167: Info: macro invoked from here
ascon.S: ascon.S:74: Error: unknown mnemonic `xor' -- `xor t5,s7,s9'
ascon.S: ascon.S:167: Info: macro invoked from here
ascon.S: ascon.S:75: Error: unknown mnemonic `xor' -- `xor t4,s3,s5'
ascon.S: ascon.S:167: Info: macro invoked from here
ascon.S: ascon.S:76: Error: expected an integer, vector or predicate register at operand 1 -- `orn s9,s7,s9'
ascon.S: ascon.S:167: Info: macro invoked from here
ascon.S: ascon.S:77: Error: unknown mnemonic `xor' -- `xor s9,s9,t4'
ascon.S: ascon.S:167: Info: macro invoked from here
ascon.S: ascon.S:78: Error: unknown mnemonic `xor' -- `xor s7,s7,s3'
ascon.S: ascon.S:167: Info: macro invoked from here
ascon.S: ascon.S:79: Error: unknown mnemonic `or' -- `or s7,s7,t4'
ascon.S: ascon.S:167: Info: macro invoked from here
ascon.S: ascon.S:80: Error: unknown mnemonic `xor' -- `xor s7,s7,t3'
ascon.S: ascon.S:167: Info: macro invoked from here
ascon.S: ascon.S:81: Error: unknown mnemonic `xor' -- `xor s5,s5,t3'
ascon.S: ascon.S:167: Info: macro invoked from here
ascon.S: ascon.S:82: Error: unknown mnemonic `or' -- `or s5,s5,s3'
ascon.S: ascon.S:167: Info: macro invoked from here
ascon.S: ...
Number of similar (implementation,compiler) pairs: 1, namely:
| Implementation | Compiler |
| T:asm_bi32_rv32b | gcc -march=native -mtune=native -O3 -fwrapv -fPIC -fPIE -gdwarf-4 -Wall (16.2.0) |
Compiler output
ascon.S: ascon.S:1:10: fatal error: xtensa/coreasm.h: No such file or directory
ascon.S: 1 | #include <xtensa/coreasm.h>
ascon.S: | ^~~~~~~~~~~~~~~~~~
ascon.S: compilation terminated.
Number of similar (implementation,compiler) pairs: 1, namely:
| Implementation | Compiler |
| T:asm_esp32 | gcc -march=native -mtune=native -O3 -fwrapv -fPIC -fPIE -gdwarf-4 -Wall (16.2.0) |
Compiler output
ascon.S: /tmp/ccC4jFwC.s: Assembler messages:
ascon.S: ascon.S:110: Error: unknown mnemonic `li' -- `li t6,0x4b'
ascon.S: ascon.S:113: Error: unknown mnemonic `xor' -- `xor s5,s5,t1'
ascon.S: ascon.S:73: Error: unknown mnemonic `xor' -- `xor t3,s1,s9'
ascon.S: ascon.S:116: Info: macro invoked from here
ascon.S: ascon.S:74: Error: unknown mnemonic `xor' -- `xor t5,s7,s9'
ascon.S: ascon.S:116: Info: macro invoked from here
ascon.S: ascon.S:75: Error: unknown mnemonic `xor' -- `xor t4,s3,s5'
ascon.S: ascon.S:116: Info: macro invoked from here
ascon.S: ascon.S:76: Error: expected an integer, vector or predicate register at operand 1 -- `orn s9,s7,s9'
ascon.S: ascon.S:116: Info: macro invoked from here
ascon.S: ascon.S:77: Error: unknown mnemonic `xor' -- `xor s9,s9,t4'
ascon.S: ascon.S:116: Info: macro invoked from here
ascon.S: ascon.S:78: Error: unknown mnemonic `xor' -- `xor s7,s7,s3'
ascon.S: ascon.S:116: Info: macro invoked from here
ascon.S: ascon.S:79: Error: unknown mnemonic `or' -- `or s7,s7,t4'
ascon.S: ascon.S:116: Info: macro invoked from here
ascon.S: ascon.S:80: Error: unknown mnemonic `xor' -- `xor s7,s7,t3'
ascon.S: ascon.S:116: Info: macro invoked from here
ascon.S: ascon.S:81: Error: unknown mnemonic `xor' -- `xor s5,s5,t3'
ascon.S: ascon.S:116: Info: macro invoked from here
ascon.S: ascon.S:82: Error: unknown mnemonic `or' -- `or s5,s5,s3'
ascon.S: ascon.S:116: Info: macro invoked from here
ascon.S: ascon.S:83: Error: unknown mnemonic `xor' -- `xor s5,s5,t5'
ascon.S: ascon.S:116: Info: macro invoked from here
ascon.S: ...
Number of similar (implementation,compiler) pairs: 1, namely:
| Implementation | Compiler |
| T:asm_fsr_rv32b | gcc -march=native -mtune=native -O3 -fwrapv -fPIC -fPIE -gdwarf-4 -Wall (16.2.0) |
Compiler output
ascon.S: /tmp/cc03ZV6C.s: Assembler messages:
ascon.S: ascon.S:118: Error: unknown mnemonic `li' -- `li t6,0x4b'
ascon.S: ascon.S:121: Error: unknown mnemonic `xor' -- `xor s5,s5,t1'
ascon.S: ascon.S:73: Error: unknown mnemonic `xor' -- `xor t3,s1,s9'
ascon.S: ascon.S:124: Info: macro invoked from here
ascon.S: ascon.S:74: Error: unknown mnemonic `xor' -- `xor t5,s7,s9'
ascon.S: ascon.S:124: Info: macro invoked from here
ascon.S: ascon.S:75: Error: unknown mnemonic `xor' -- `xor t4,s3,s5'
ascon.S: ascon.S:124: Info: macro invoked from here
ascon.S: ascon.S:76: Error: expected an integer, vector or predicate register at operand 1 -- `orn s9,s7,s9'
ascon.S: ascon.S:124: Info: macro invoked from here
ascon.S: ascon.S:77: Error: unknown mnemonic `xor' -- `xor s9,s9,t4'
ascon.S: ascon.S:124: Info: macro invoked from here
ascon.S: ascon.S:78: Error: unknown mnemonic `xor' -- `xor s7,s7,s3'
ascon.S: ascon.S:124: Info: macro invoked from here
ascon.S: ascon.S:79: Error: unknown mnemonic `or' -- `or s7,s7,t4'
ascon.S: ascon.S:124: Info: macro invoked from here
ascon.S: ascon.S:80: Error: unknown mnemonic `xor' -- `xor s7,s7,t3'
ascon.S: ascon.S:124: Info: macro invoked from here
ascon.S: ascon.S:81: Error: unknown mnemonic `xor' -- `xor s5,s5,t3'
ascon.S: ascon.S:124: Info: macro invoked from here
ascon.S: ascon.S:82: Error: unknown mnemonic `or' -- `or s5,s5,s3'
ascon.S: ascon.S:124: Info: macro invoked from here
ascon.S: ascon.S:83: Error: unknown mnemonic `xor' -- `xor s5,s5,t5'
ascon.S: ascon.S:124: Info: macro invoked from here
ascon.S: ...
Number of similar (implementation,compiler) pairs: 1, namely:
| Implementation | Compiler |
| T:asm_rv32b | gcc -march=native -mtune=native -O3 -fwrapv -fPIC -fPIE -gdwarf-4 -Wall (16.2.0) |
Compiler output
ascon.S: /tmp/ccpUpd3S.s: Assembler messages:
ascon.S: ascon.S:120: Error: unknown mnemonic `li' -- `li t6,0x4b'
ascon.S: ascon.S:123: Error: unknown mnemonic `xor' -- `xor s5,s5,t1'
ascon.S: ascon.S:73: Error: unknown mnemonic `xor' -- `xor t3,s1,s9'
ascon.S: ascon.S:126: Info: macro invoked from here
ascon.S: ascon.S:74: Error: unknown mnemonic `xor' -- `xor t5,s7,s9'
ascon.S: ascon.S:126: Info: macro invoked from here
ascon.S: ascon.S:75: Error: unknown mnemonic `xori' -- `xori s9,s9,-1'
ascon.S: ascon.S:126: Info: macro invoked from here
ascon.S: ascon.S:76: Error: unknown mnemonic `xor' -- `xor t4,s3,s5'
ascon.S: ascon.S:126: Info: macro invoked from here
ascon.S: ascon.S:77: Error: unknown mnemonic `or' -- `or s9,s9,s7'
ascon.S: ascon.S:126: Info: macro invoked from here
ascon.S: ascon.S:78: Error: unknown mnemonic `xor' -- `xor s9,s9,t4'
ascon.S: ascon.S:126: Info: macro invoked from here
ascon.S: ascon.S:79: Error: unknown mnemonic `xor' -- `xor s7,s7,s3'
ascon.S: ascon.S:126: Info: macro invoked from here
ascon.S: ascon.S:80: Error: unknown mnemonic `or' -- `or s7,s7,t4'
ascon.S: ascon.S:126: Info: macro invoked from here
ascon.S: ascon.S:81: Error: unknown mnemonic `xor' -- `xor s7,s7,t3'
ascon.S: ascon.S:126: Info: macro invoked from here
ascon.S: ascon.S:82: Error: unknown mnemonic `xor' -- `xor s5,s5,t3'
ascon.S: ascon.S:126: Info: macro invoked from here
ascon.S: ascon.S:83: Error: unknown mnemonic `or' -- `or s5,s5,s3'
ascon.S: ascon.S:126: Info: macro invoked from here
ascon.S: ...
Number of similar (implementation,compiler) pairs: 1, namely:
| Implementation | Compiler |
| T:asm_rv32i | gcc -march=native -mtune=native -O3 -fwrapv -fPIC -fPIE -gdwarf-4 -Wall (16.2.0) |
Compiler output
permutations.c: /tmp/ccArl5Iy.s: Assembler messages:
permutations.c: /tmp/ccArl5Iy.s:162: Error: immediate out of range at operand 3 -- `eor x13,x13,9'
permutations.c: /tmp/ccArl5Iy.s:266: Error: immediate out of range at operand 3 -- `eor x8,x8,9'
permutations.c: /tmp/ccArl5Iy.s:336: Error: immediate out of range at operand 3 -- `eor x13,x13,9'
permutations.c: /tmp/ccArl5Iy.s:353: Error: immediate out of range at operand 3 -- `eor x8,x8,9'
permutations.c: /tmp/ccArl5Iy.s:614: Error: immediate out of range at operand 3 -- `eor x8,x8,9'
permutations.c: /tmp/ccArl5Iy.s:701: Error: immediate out of range at operand 3 -- `eor x8,x8,9'
permutations.c: /tmp/ccArl5Iy.s:858: Error: immediate out of range at operand 3 -- `eor x13,x13,9'
permutations.c: /tmp/ccArl5Iy.s:1032: Error: immediate out of range at operand 3 -- `eor x13,x13,9'
permutations.c: /tmp/ccArl5Iy.s:1381: Error: immediate out of range at operand 3 -- `eor x8,x8,9'
permutations.c: /tmp/ccArl5Iy.s:1468: Error: immediate out of range at operand 3 -- `eor x8,x8,9'
permutations.c: /tmp/ccArl5Iy.s:1625: Error: immediate out of range at operand 3 -- `eor x13,x13,9'
permutations.c: /tmp/ccArl5Iy.s:1799: Error: immediate out of range at operand 3 -- `eor x13,x13,9'
Number of similar (implementation,compiler) pairs: 1, namely:
| Implementation | Compiler |
| bi32_armv6 | gcc -march=native -mtune=native -O3 -fwrapv -fPIC -fPIE -gdwarf-4 -Wall (16.2.0) |
Compiler output
aead.c: In file included from permutations.h:11,
aead.c: from aead.c:4:
aead.c: round.h: In function 'ROUND_LOOP':
aead.c: round.h:12:12: warning: unused variable 'tmp0' [-Wunused-variable]
aead.c: 12 | uint32_t tmp0, tmp1;
aead.c: | ^~~~
aead.c: In function 'ROUND_LOOP',
aead.c: inlined from 'PROUNDS' at round.h:325:3,
aead.c: inlined from 'P' at permutations.h:70:48,
aead.c: inlined from 'ascon_initaead' at aead.c:40:3,
aead.c: inlined from 'crypto_aead_ascon128av12_bi32_armv6m_constbranchindex_encrypt' at aead.c:199:3:
aead.c: round.h:13:3: error: impossible constraint in 'asm'
aead.c: 13 | __asm__ __volatile__(
aead.c: | ^~~~~~~
aead.c: In function 'ROUND_LOOP',
aead.c: inlined from 'PROUNDS' at round.h:325:3,
aead.c: inlined from 'P' at permutations.h:70:48,
aead.c: inlined from 'ascon_adata' at aead.c:61:7,
aead.c: inlined from 'crypto_aead_ascon128av12_bi32_armv6m_constbranchindex_encrypt' at aead.c:200:3:
aead.c: round.h:13:3: error: impossible constraint in 'asm'
aead.c: 13 | __asm__ __volatile__(
aead.c: | ^~~~~~~
aead.c: In function 'ROUND_LOOP',
aead.c: inlined from 'PROUNDS' at round.h:325:3,
aead.c: inlined from 'P' at permutations.h:70:48,
aead.c: ...
Number of similar (implementation,compiler) pairs: 1, namely:
| Implementation | Compiler |
| bi32_armv6m | gcc -march=native -mtune=native -O3 -fwrapv -fPIC -fPIE -gdwarf-4 -Wall (16.2.0) |
Compiler output
aead.c: /tmp/ccbEeZQ3.s: Assembler messages:
aead.c: /tmp/ccbEeZQ3.s:1996: Error: immediate out of range at operand 3 -- `eor x18,x18,9'
aead.c: /tmp/ccbEeZQ3.s:2097: Error: immediate out of range at operand 3 -- `eor x13,x13,9'
aead.c: /tmp/ccbEeZQ3.s:2166: Error: immediate out of range at operand 3 -- `eor x18,x18,9'
aead.c: /tmp/ccbEeZQ3.s:2182: Error: immediate out of range at operand 3 -- `eor x13,x13,9'
aead.c: /tmp/ccbEeZQ3.s:2437: Error: immediate out of range at operand 3 -- `eor x13,x13,9'
aead.c: /tmp/ccbEeZQ3.s:2522: Error: immediate out of range at operand 3 -- `eor x13,x13,9'
aead.c: /tmp/ccbEeZQ3.s:2676: Error: immediate out of range at operand 3 -- `eor x18,x18,9'
aead.c: /tmp/ccbEeZQ3.s:2841: Error: immediate out of range at operand 3 -- `eor x0,x0,9'
aead.c: /tmp/ccbEeZQ3.s:3628: Error: immediate out of range at operand 3 -- `eor x16,x16,9'
aead.c: /tmp/ccbEeZQ3.s:3713: Error: immediate out of range at operand 3 -- `eor x16,x16,9'
aead.c: /tmp/ccbEeZQ3.s:3876: Error: immediate out of range at operand 3 -- `eor x6,x6,9'
aead.c: /tmp/ccbEeZQ3.s:4016: Error: immediate out of range at operand 3 -- `eor x6,x6,9'
aead.c: /tmp/ccbEeZQ3.s:4700: Error: immediate out of range at operand 3 -- `eor x11,x11,9'
aead.c: /tmp/ccbEeZQ3.s:4785: Error: immediate out of range at operand 3 -- `eor x11,x11,9'
aead.c: /tmp/ccbEeZQ3.s:4948: Error: immediate out of range at operand 3 -- `eor x4,x4,9'
aead.c: /tmp/ccbEeZQ3.s:5088: Error: immediate out of range at operand 3 -- `eor x4,x4,9'
aead.c: /tmp/ccbEeZQ3.s:6664: Error: immediate out of range at operand 3 -- `eor x8,x8,9'
aead.c: /tmp/ccbEeZQ3.s:6749: Error: immediate out of range at operand 3 -- `eor x8,x8,9'
aead.c: /tmp/ccbEeZQ3.s:6920: Error: immediate out of range at operand 3 -- `eor x7,x7,9'
aead.c: /tmp/ccbEeZQ3.s:7060: Error: immediate out of range at operand 3 -- `eor x7,x7,9'
aead.c: /tmp/ccbEeZQ3.s:7382: Error: immediate out of range at operand 3 -- `eor x15,x15,9'
aead.c: /tmp/ccbEeZQ3.s:7483: Error: immediate out of range at operand 3 -- `eor x8,x8,9'
aead.c: /tmp/ccbEeZQ3.s:7552: Error: immediate out of range at operand 3 -- `eor x15,x15,9'
aead.c: /tmp/ccbEeZQ3.s:7568: Error: immediate out of range at operand 3 -- `eor x8,x8,9'
aead.c: ...
Number of similar (implementation,compiler) pairs: 1, namely:
| Implementation | Compiler |
| bi32_armv7m | gcc -march=native -mtune=native -O3 -fwrapv -fPIC -fPIE -gdwarf-4 -Wall (16.2.0) |
Compiler output
permutations.c: /tmp/ccR5fuac.s: Assembler messages:
permutations.c: /tmp/ccR5fuac.s:63: Error: operand mismatch -- `ldrb x14,[x1],#1'
permutations.c: /tmp/ccR5fuac.s:63: Info: did you mean this?
permutations.c: /tmp/ccR5fuac.s:63: Info: ldrb w14, [x1], #1
permutations.c: /tmp/ccR5fuac.s:78: Error: operand mismatch -- `ldrb x14,[x1],#1'
permutations.c: /tmp/ccR5fuac.s:78: Info: did you mean this?
permutations.c: /tmp/ccR5fuac.s:78: Info: ldrb w14, [x1], #1
Number of similar (implementation,compiler) pairs: 1, namely:
| Implementation | Compiler |
| bi32_armv7m_small | gcc -march=native -mtune=native -O3 -fwrapv -fPIC -fPIE -gdwarf-4 -Wall (16.2.0) |
Compiler output
try.c: /usr/bin/aarch64-linux-gnu-ld.bfd: /tmp/ccIHgAgx.o: in function `doit':
try.c: .../supercop-data/cfarm425/aarch64/try/c/gcc_-march=native_-mtune=native_-O3_-fwrapv_-fPIC_-fPIE_-gdwarf-4_-Wall/timingleaks/crypto_aead/ascon128av12/esp32/work/try.c:133:(.text+0x...): undefined reference to `crypto_aead_ascon128av12_esp32_timingleaks_encrypt'
try.c: /usr/bin/aarch64-linux-gnu-ld.bfd: .../supercop-data/cfarm425/aarch64/try/c/gcc_-march=native_-mtune=native_-O3_-fwrapv_-fPIC_-fPIE_-gdwarf-4_-Wall/timingleaks/crypto_aead/ascon128av12/esp32/work/try.c:135:(.text+0x...): undefined reference to `crypto_aead_ascon128av12_esp32_timingleaks_decrypt'
try.c: /usr/bin/aarch64-linux-gnu-ld.bfd: /tmp/ccIHgAgx.o: in function `test':
try.c: .../supercop-data/cfarm425/aarch64/try/c/gcc_-march=native_-mtune=native_-O3_-fwrapv_-fPIC_-fPIE_-gdwarf-4_-Wall/timingleaks/crypto_aead/ascon128av12/esp32/work/try.c:189:(.text+0x...): undefined reference to `crypto_aead_ascon128av12_esp32_timingleaks_encrypt'
try.c: /usr/bin/aarch64-linux-gnu-ld.bfd: .../supercop-data/cfarm425/aarch64/try/c/gcc_-march=native_-mtune=native_-O3_-fwrapv_-fPIC_-fPIE_-gdwarf-4_-Wall/timingleaks/crypto_aead/ascon128av12/esp32/work/try.c:300:(.text+0x...): undefined reference to `crypto_aead_ascon128av12_esp32_timingleaks_decrypt'
try.c: /usr/bin/aarch64-linux-gnu-ld.bfd: .../supercop-data/cfarm425/aarch64/try/c/gcc_-march=native_-mtune=native_-O3_-fwrapv_-fPIC_-fPIE_-gdwarf-4_-Wall/timingleaks/crypto_aead/ascon128av12/esp32/work/try.c:331:(.text+0x...): undefined reference to `crypto_aead_ascon128av12_esp32_timingleaks_decrypt'
try.c: /usr/bin/aarch64-linux-gnu-ld.bfd: .../supercop-data/cfarm425/aarch64/try/c/gcc_-march=native_-mtune=native_-O3_-fwrapv_-fPIC_-fPIE_-gdwarf-4_-Wall/timingleaks/crypto_aead/ascon128av12/esp32/work/try.c:476:(.text+0x...): undefined reference to `crypto_aead_ascon128av12_esp32_timingleaks_decrypt'
try.c: /usr/bin/aarch64-linux-gnu-ld.bfd: .../supercop-data/cfarm425/aarch64/try/c/gcc_-march=native_-mtune=native_-O3_-fwrapv_-fPIC_-fPIE_-gdwarf-4_-Wall/timingleaks/crypto_aead/ascon128av12/esp32/work/try.c:480:(.text+0x...): undefined reference to `crypto_aead_ascon128av12_esp32_timingleaks_decrypt'
try.c: /usr/bin/aarch64-linux-gnu-ld.bfd: .../supercop-data/cfarm425/aarch64/try/c/gcc_-march=native_-mtune=native_-O3_-fwrapv_-fPIC_-fPIE_-gdwarf-4_-Wall/timingleaks/crypto_aead/ascon128av12/esp32/work/try.c:484:(.text+0x...): undefined reference to `crypto_aead_ascon128av12_esp32_timingleaks_decrypt'
try.c: /usr/bin/aarch64-linux-gnu-ld.bfd: .../supercop-data/cfarm425/aarch64/try/c/gcc_-march=native_-mtune=native_-O3_-fwrapv_-fPIC_-fPIE_-gdwarf-4_-Wall/timingleaks/crypto_aead/ascon128av12/esp32/work/try.c:159:(.text+0x...): undefined reference to `crypto_aead_ascon128av12_esp32_timingleaks_encrypt'
try.c: collect2: error: ld returned 1 exit status
Number of similar (implementation,compiler) pairs: 1, namely:
| Implementation | Compiler |
| T:esp32 | gcc -march=native -mtune=native -O3 -fwrapv -fPIC -fPIE -gdwarf-4 -Wall (16.2.0) |
Compiler output
aead.c: aead.c: In function 'ascon_encrypt':
aead.c: aead.c:186:13: warning: unused variable 'nr' [-Wunused-variable]
aead.c: 186 | const int nr = (ASCON_AEAD_RATE == 8) ? 6 : 8;
aead.c: | ^~
aead.c: aead.c: In function 'ascon_decrypt':
aead.c: aead.c:213:13: warning: unused variable 'nr' [-Wunused-variable]
aead.c: 213 | const int nr = (ASCON_AEAD_RATE == 8) ? 6 : 8;
aead.c: | ^~
aead.c: /tmp/cco5iJDl.s: Assembler messages:
aead.c: /tmp/cco5iJDl.s:126: Error: unknown pseudo-op: `.arm'
aead.c: /tmp/cco5iJDl.s:127: Error: unknown pseudo-op: `.fpu'
aead.c: /tmp/cco5iJDl.s:128: Error: unknown mnemonic `vldm' -- `vldm x0,{d0-d4}'
aead.c: /tmp/cco5iJDl.s:129: Error: unknown mnemonic `vmvn' -- `vmvn d2,d2'
aead.c: /tmp/cco5iJDl.s:130: Error: unknown mnemonic `vldr' -- `vldr d31,[x3,#0]'
aead.c: /tmp/cco5iJDl.s:131: Error: unknown mnemonic `veor' -- `veor d0,d0,d4'
aead.c: /tmp/cco5iJDl.s:132: Error: unknown mnemonic `veor' -- `veor d4,d4,d3'
aead.c: /tmp/cco5iJDl.s:133: Error: unknown mnemonic `veor' -- `veor d2,d2,d31'
aead.c: /tmp/cco5iJDl.s:134: Error: unknown mnemonic `vbic' -- `vbic d13,d0,d4'
aead.c: /tmp/cco5iJDl.s:135: Error: unknown mnemonic `vbic' -- `vbic d12,d4,d3'
aead.c: /tmp/cco5iJDl.s:136: Error: unknown mnemonic `veor' -- `veor d2,d2,d1'
aead.c: /tmp/cco5iJDl.s:137: Error: unknown mnemonic `vbic' -- `vbic d14,d1,d0'
aead.c: /tmp/cco5iJDl.s:138: Error: unknown mnemonic `vbic' -- `vbic d11,d3,d2'
aead.c: /tmp/cco5iJDl.s:139: Error: unknown mnemonic `vbic' -- `vbic d10,d2,d1'
aead.c: /tmp/cco5iJDl.s:140: Error: unknown mnemonic `veor' -- `veor q0,q0,q5'
aead.c: /tmp/cco5iJDl.s:141: Error: unknown mnemonic `veor' -- `veor q1,q1,q6'
aead.c: ...
Number of similar (implementation,compiler) pairs: 1, namely:
| Implementation | Compiler |
| neon | gcc -march=native -mtune=native -O3 -fwrapv -fPIC -fPIE -gdwarf-4 -Wall (16.2.0) |
Compiler output
aead.c: In file included from round.h:8,
aead.c: from permutations.h:11,
aead.c: from aead.c:5:
aead.c: In function 'memxor',
aead.c: inlined from 'ascon_final' at aead.c:136:3:
aead.c: word.h:102:12: warning: writing 1 byte into a region of size 0 [-Wstringop-overflow=]
aead.c: 102 | *dst++ ^= *src++;
aead.c: | ^~
aead.c: aead.c: In function 'ascon_final':
aead.c: aead.c:134:45: note: at offset 24 into destination object 's' of size [0, 24]
aead.c: 134 | forceinline void ascon_final(ascon_state_t* s, const ascon_key_t* key) {
aead.c: | ~~~~~~~~~~~~~~~^
aead.c: In function 'memxor',
aead.c: inlined from 'ascon_final' at aead.c:136:3:
aead.c: word.h:102:12: warning: writing 1 byte into a region of size 0 [-Wstringop-overflow=]
aead.c: 102 | *dst++ ^= *src++;
aead.c: | ^~
aead.c: aead.c: In function 'ascon_final':
aead.c: aead.c:134:45: note: at offset 25 into destination object 's' of size [0, 24]
aead.c: 134 | forceinline void ascon_final(ascon_state_t* s, const ascon_key_t* key) {
aead.c: | ~~~~~~~~~~~~~~~^
aead.c: In function 'memxor',
aead.c: inlined from 'ascon_final' at aead.c:136:3:
aead.c: word.h:102:12: warning: writing 1 byte into a region of size 0 [-Wstringop-overflow=]
aead.c: 102 | *dst++ ^= *src++;
aead.c: ...
Number of similar (implementation,compiler) pairs: 1, namely:
| Implementation | Compiler |
| opt8 | gcc -march=native -mtune=native -O3 -fwrapv -fPIC -fPIE -gdwarf-4 -Wall (16.2.0) |
Compiler output
aead.c: In file included from round.h:8,
aead.c: from permutations.h:11,
aead.c: from aead.c:5:
aead.c: In function 'memxor',
aead.c: inlined from 'ascon_final' at aead.c:51:3:
aead.c: word.h:102:12: warning: writing 1 byte into a region of size 0 [-Wstringop-overflow=]
aead.c: 102 | *dst++ ^= *src++;
aead.c: | ^~
aead.c: aead.c: In function 'ascon_final':
aead.c: aead.c:49:45: note: at offset 24 into destination object 's' of size [0, 24]
aead.c: 49 | forceinline void ascon_final(ascon_state_t* s, const ascon_key_t* key) {
aead.c: | ~~~~~~~~~~~~~~~^
aead.c: In function 'memxor',
aead.c: inlined from 'ascon_final' at aead.c:51:3:
aead.c: word.h:102:12: warning: writing 1 byte into a region of size 0 [-Wstringop-overflow=]
aead.c: 102 | *dst++ ^= *src++;
aead.c: | ^~
aead.c: aead.c: In function 'ascon_final':
aead.c: aead.c:49:45: note: at offset 25 into destination object 's' of size [0, 24]
aead.c: 49 | forceinline void ascon_final(ascon_state_t* s, const ascon_key_t* key) {
aead.c: | ~~~~~~~~~~~~~~~^
aead.c: In function 'memxor',
aead.c: inlined from 'ascon_final' at aead.c:51:3:
aead.c: word.h:102:12: warning: writing 1 byte into a region of size 0 [-Wstringop-overflow=]
aead.c: 102 | *dst++ ^= *src++;
aead.c: ...
Number of similar (implementation,compiler) pairs: 1, namely:
| Implementation | Compiler |
| opt8_lowsize | gcc -march=native -mtune=native -O3 -fwrapv -fPIC -fPIE -gdwarf-4 -Wall (16.2.0) |
Namespace violations
constants.o constants R
interleave.o B R
permutations.o P12 T
permutations.o P8 T
Number of similar (implementation,compiler) pairs: 1, namely:
| Implementation | Compiler |
| bi32 | gcc -march=native -mtune=native -O3 -fwrapv -fPIC -fPIE -gdwarf-4 -Wall (16.2.0) |
Namespace violations
aead.o ascon_adata T
aead.o ascon_decrypt T
aead.o ascon_encrypt T
aead.o ascon_final T
aead.o ascon_initaead T
aead.o ascon_loadkey T
constants.o constants R
interleave.o B R
Number of similar (implementation,compiler) pairs: 1, namely:
| Implementation | Compiler |
| bi32_lowreg | gcc -march=native -mtune=native -O3 -fwrapv -fPIC -fPIE -gdwarf-4 -Wall (16.2.0) |
Namespace violations
aead.o ascon_aead T
constants.o constants R
interleave.o B R
interleave.o FROMBI T
interleave.o TOBI T
permutations.o P T
update.o ascon_update T
Number of similar (implementation,compiler) pairs: 1, namely:
| Implementation | Compiler |
| bi32_lowsize | gcc -march=native -mtune=native -O3 -fwrapv -fPIC -fPIE -gdwarf-4 -Wall (16.2.0) |
Namespace violations
constants.o constants R
interleave.o FROMBI T
interleave.o TOBI T
permutations.o P T
Number of similar (implementation,compiler) pairs: 1, namely:
| Implementation | Compiler |
| bi8 | gcc -march=native -mtune=native -O3 -fwrapv -fPIC -fPIE -gdwarf-4 -Wall (16.2.0) |
Namespace violations
aead.o ascon_aead T
permutations.o P T
update.o ascon_update T
Number of similar (implementation,compiler) pairs: 2, namely:
| Implementation | Compiler |
| opt32_lowsize | gcc -march=native -mtune=native -O3 -fwrapv -fPIC -fPIE -gdwarf-4 -Wall (16.2.0) |
| opt64_lowsize | gcc -march=native -mtune=native -O3 -fwrapv -fPIC -fPIE -gdwarf-4 -Wall (16.2.0) |
Namespace violations
aead.o ascon_adata T
aead.o ascon_decrypt T
aead.o ascon_encrypt T
aead.o ascon_final T
aead.o ascon_initaead T
aead.o ascon_loadkey T
permutations.o P T
Number of similar (implementation,compiler) pairs: 1, namely:
| Implementation | Compiler |
| opt8 | gcc -march=native -mtune=native -O3 -fwrapv -fPIC -fPIE -gdwarf-4 -Wall (16.2.0) |
Namespace violations
aead.o ascon_final T
aead.o ascon_initaead T
aead.o ascon_loadkey T
permutations.o P T
update.o ascon_update T
Number of similar (implementation,compiler) pairs: 1, namely:
| Implementation | Compiler |
| opt8_lowsize | gcc -march=native -mtune=native -O3 -fwrapv -fPIC -fPIE -gdwarf-4 -Wall (16.2.0) |
Passed TIMECOP
TIMECOP iterations: 10
Number of similar (implementation,compiler) pairs: 11, namely:
| Implementation | Compiler |
| bi32 | gcc -march=native -mtune=native -O3 -fwrapv -fPIC -fPIE -gdwarf-4 -Wall (16.2.0) |
| bi32_lowreg | gcc -march=native -mtune=native -O3 -fwrapv -fPIC -fPIE -gdwarf-4 -Wall (16.2.0) |
| bi32_lowsize | gcc -march=native -mtune=native -O3 -fwrapv -fPIC -fPIE -gdwarf-4 -Wall (16.2.0) |
| bi8 | gcc -march=native -mtune=native -O3 -fwrapv -fPIC -fPIE -gdwarf-4 -Wall (16.2.0) |
| opt32 | gcc -march=native -mtune=native -O3 -fwrapv -fPIC -fPIE -gdwarf-4 -Wall (16.2.0) |
| opt32_lowsize | gcc -march=native -mtune=native -O3 -fwrapv -fPIC -fPIE -gdwarf-4 -Wall (16.2.0) |
| opt64 | gcc -march=native -mtune=native -O3 -fwrapv -fPIC -fPIE -gdwarf-4 -Wall (16.2.0) |
| opt64_lowsize | gcc -march=native -mtune=native -O3 -fwrapv -fPIC -fPIE -gdwarf-4 -Wall (16.2.0) |
| opt8 | gcc -march=native -mtune=native -O3 -fwrapv -fPIC -fPIE -gdwarf-4 -Wall (16.2.0) |
| opt8_lowsize | gcc -march=native -mtune=native -O3 -fwrapv -fPIC -fPIE -gdwarf-4 -Wall (16.2.0) |
| ref | gcc -march=native -mtune=native -O3 -fwrapv -fPIC -fPIE -gdwarf-4 -Wall (16.2.0) |