Test results for aarch64, cfarm425, crypto_aead/aes128cpfbv1
[Page version: 20261005 22:53:57]
Measurements for aarch64, cfarm425, crypto_aead
Test results for aarch64, cfarm425, crypto_aead
Test results for crypto_aead/aes128cpfbv1
Computer: cfarm425
Microarchitecture: aarch64; Cortex-A76 (413fd0c1)
Architecture: aarch64
CPU ID: 413fd0c1
SUPERCOP version: 20261004
Operation: crypto_aead
Primitive: aes128cpfbv1
| Time | Object size | Test size | Implementation | Compiler | Benchmark date | SUPERCOP version |
| 101854 | 17472 0 0 | 44196 1200 1544 | T:aesref | gcc -march=native -mtune=native -O3 -fwrapv -fPIC -fPIE -gdwarf-4 -Wall | 20261005 | 20261004 |
| 102429 | 2796 0 0 | 31644 1200 1544 | T:ref | gcc -march=native -mtune=native -O3 -fwrapv -fPIC -fPIE -gdwarf-4 -Wall | 20261005 | 20261004 |
| 105813 | 16804 0 0 | 43596 1224 1544 | T:gladman | gcc -march=native -mtune=native -O3 -fwrapv -fPIC -fPIE -gdwarf-4 -Wall | 20261005 | 20261004 |
Compiler output
cpfbkey.c: cpfbkey.c:15:10: fatal error: wmmintrin.h: No such file or directory
cpfbkey.c: 15 | #include <wmmintrin.h>
cpfbkey.c: | ^~~~~~~~~~~~~
cpfbkey.c: compilation terminated.
Number of similar (implementation,compiler) pairs: 1, namely:
| Implementation | Compiler |
| T:aesni | gcc -march=native -mtune=native -O3 -fwrapv -fPIC -fPIE -gdwarf-4 -Wall (16.2.0) |
Compiler output
encrypt.c: encrypt.c:170:82: error: array type has incomplete element type 'EVP_CIPHER_CTX' {aka 'struct evp_cipher_ctx_st'}
encrypt.c: 170 | static void gen_kappa(unsigned char* nonce, unsigned char* kappa, EVP_CIPHER_CTX ctx_key[1]){
encrypt.c: | ^~~~~~~
encrypt.c: encrypt.c: In function 'crypto_aead_aes128cpfbv1_evp_timingleaks_encrypt':
encrypt.c: encrypt.c:188:20: error: array type has incomplete element type 'EVP_CIPHER_CTX' {aka 'struct evp_cipher_ctx_st'}
encrypt.c: 188 | EVP_CIPHER_CTX ctx_k[1];
encrypt.c: | ^~~~~
encrypt.c: encrypt.c:189:20: error: array type has incomplete element type 'EVP_CIPHER_CTX' {aka 'struct evp_cipher_ctx_st'}
encrypt.c: 189 | EVP_CIPHER_CTX ctx_kappa_0[1];
encrypt.c: | ^~~~~~~~~~~
encrypt.c: encrypt.c:190:20: error: array type has incomplete element type 'EVP_CIPHER_CTX' {aka 'struct evp_cipher_ctx_st'}
encrypt.c: 190 | EVP_CIPHER_CTX ctx_kappa_m[1];
encrypt.c: | ^~~~~~~~~~~
encrypt.c: encrypt.c:204:31: error: type of formal parameter 3 is incomplete
encrypt.c: 204 | gen_kappa(nonce, kappa_0, ctx_k);
encrypt.c: | ^~~~~
encrypt.c: encrypt.c:265:35: error: type of formal parameter 3 is incomplete
encrypt.c: 265 | gen_kappa(nonce, kappa_m, ctx_k);
encrypt.c: | ^~~~~
encrypt.c: encrypt.c:190:20: warning: unused variable 'ctx_kappa_m' [-Wunused-variable]
encrypt.c: 190 | EVP_CIPHER_CTX ctx_kappa_m[1];
encrypt.c: | ^~~~~~~~~~~
encrypt.c: encrypt.c:189:20: warning: unused variable 'ctx_kappa_0' [-Wunused-variable]
encrypt.c: 189 | EVP_CIPHER_CTX ctx_kappa_0[1];
encrypt.c: | ^~~~~~~~~~~
encrypt.c: ...
Number of similar (implementation,compiler) pairs: 1, namely:
| Implementation | Compiler |
| T:evp | gcc -march=native -mtune=native -O3 -fwrapv -fPIC -fPIE -gdwarf-4 -Wall (16.2.0) |
Namespace violations
rijndael-alg-fst.o rijndaelDecrypt T
rijndael-alg-fst.o rijndaelEncrypt T
rijndael-alg-fst.o rijndaelKeySetupDec T
rijndael-alg-fst.o rijndaelKeySetupEnc T
Number of similar (implementation,compiler) pairs: 1, namely:
| Implementation | Compiler |
| T:aesref | gcc -march=native -mtune=native -O3 -fwrapv -fPIC -fPIE -gdwarf-4 -Wall (16.2.0) |
Namespace violations
aescrypt.o aes_encrypt T
aeskey.o aes_encrypt_key128 T
aeskey.o aes_encrypt_key256 T
aestab.o aes_init T
aestab.o t_fl R
aestab.o t_fn R
aestab.o t_rc R
Number of similar (implementation,compiler) pairs: 1, namely:
| Implementation | Compiler |
| T:gladman | gcc -march=native -mtune=native -O3 -fwrapv -fPIC -fPIE -gdwarf-4 -Wall (16.2.0) |